{"text_format":"1","workbook":"xlsx","n_sheets":31,"sheets":["ProtectedSheets","Cover Sheet","fredImportSheets","Notes","Form 1","F1","Form 2","F2","Form 3","F3","Form 4","F4","Form 5","F5","Form 6","Form 7","Form 8A","Form 8B","Form 9","Form 10A","Form 10B","Form 10C","F10C","Form 11","Form 12","F12","Form 13","F13","Form 14","Sheet1","F14"],"not_rendered":{"charts":0,"images":0,"macros":1,"external_links":0,"defined_names":17,"comments":4,"pivot_tables":0},"unopened":[],"bounds":{"document_bytes":16777216,"sheet_cells":100000,"rows_first":2000,"rows_last":500,"rows_between":2000,"halvings":0,"cell_chars":16384,"cell_head_chars":4096},"cells_cut":0,"cells_raw":0,"read":"whole","date_system":"1900"}

{"sheet":"ProtectedSheets","index":0,"n_rows":19,"n_cols":1,"rows_kept":19,"cut":false,"hidden":true,"merged":[]}
["Cover Sheet"]
["Notes"]
["Form 1"]
["Form 2"]
["Form 3"]
["Form 4"]
["Form 5"]
["Form 6"]
["Form 7"]
["Form 8A"]
["Form 8B"]
["Form 9"]
["Form 10A"]
["Form 10B"]
["Form 10C"]
["Form 11"]
["Form 12"]
["Form 13"]
["Form 14"]

{"sheet":"Cover Sheet","index":1,"n_rows":30,"n_cols":6,"rows_kept":30,"cut":false,"hidden":false,"merged":[[20,0,20,1],[0,0,0,4],[12,0,12,4],[3,0,3,4],[4,0,4,4],[8,0,8,4]]}
["F I R S T  S C H E D U L E"]
[]
["(Paragraph 10.3.1 of Chapter 10)"]
["MFSA"]
["MALTA FINANCIAL SERVICES AUTHORITY"]
[]
[]
[]
["Business of Insurance Intermediaries Statements"]
[]
[]
[]
["Only cells that are shaded in yellow require completion"]
[]
[]
[]
["Name of Intermediary:",null,null,null,null,{"$f":"IF(ISBLANK(E17), \"<--Kindly ensure that the intermediary name is inputted.\",\"\")","v":"<--Kindly ensure that the intermediary name is inputted."}]
[]
["Code of Intermediary: ",null,null,null,null,{"$f":"IF(ISBLANK(E19), \"<--Kindly ensure that the corresponding intermediary code is inputted.\",\"\")","v":"<--Kindly ensure that the corresponding intermediary code is inputted."}]
[]
["Enrolled in:",null,null,null,null,{"$f":"IF(ISBLANK(E21), \"<--Kindly ensure that an option from the drop-down list is selected.\",\"\")","v":"<--Kindly ensure that an option from the drop-down list is selected."}]
[]
["Year ending on:",null,null,null,null,{"$f":"IF(ISBLANK(E23), \"<--Kindly ensure that the relevant year end is inputted.\",\"\")","v":"<--Kindly ensure that the relevant year end is inputted."}]
[]
["Currency:",null,null,null,null,{"$f":"IF(ISBLANK(E25), \"<--Kindly ensure that a currency from the drop-down list is selected.\",\"\")","v":"<--Kindly ensure that a currency from the drop-down list is selected."}]
[]
["Exchange Rate to Euro:",null,null,null,null,{"$f":"IF(ISBLANK(E27), \"<--Kindly ensure the appropriate exchange rate is inputted.\",\"\")","v":"<--Kindly ensure the appropriate exchange rate is inputted."}]
[]
[]
["Version Number: 05/2025"]

{"sheet":"fredImportSheets","index":2,"n_rows":10,"n_cols":1,"rows_kept":10,"cut":false,"hidden":true,"merged":[]}
["fredImportSheets"]
["F1"]
["F2"]
["F3"]
["F4"]
["F5"]
["F10C"]
["F12"]
["F13"]
["F14"]

{"sheet":"Notes","index":3,"n_rows":73,"n_cols":2,"rows_kept":73,"cut":false,"hidden":false,"merged":[[62,1,63,8],[18,0,19,8],[13,0,13,8],[0,0,1,8],[6,0,10,8],[12,0,12,8],[4,0,4,8],[16,0,16,8],[29,0,29,8],[31,0,32,8],[42,0,42,8],[46,0,46,8],[58,0,58,8]]}
["NOTES "]
[]
[]
[]
["The forms should be completed on a calendar year basis.  Enrolled Persons having a financial year end other than 31 December are to to complete Forms 6, 7, 8, 9, 12, 13 and 14 based on the financial year and to submit to the MFSA four months following financial year end."]
[]
["Enrolled Insurance Brokers, Enrolled Insurance Agents and Enrolled Insurance Managers with an appointment are to complete the applicable sections "]
[]
[]
[]
[]
[]
["Enrolled Insurance Managers without an appointment are to complete only Forms 8, 12, 13 and 14"]
[]
[]
[]
["Part A - Insurance Premiums and Commissions"]
[]
["N.B. Insurance Managers and Insurance Agents should include all premiums and commissions under the heading 'Authorised Undertakings' and, where more than one appointment is held, aggregate the data in respect of all appointments"]
[]
[]
["Form 1","Insurance Premiums and Commissions in relation to: "]
[null,"a. commitments where Malta is the country of commitment, and"]
[null,"b. risks situated in Malta"]
[]
["Form 2","Insurance Premiums and Commissions in relation to: "]
[null,"a. commitments where Malta is not the country of commitment, and"]
[null,"b. risks situated outside Malta"]
[]
["Part B - Reinsurance Premiums and Commissions"]
[]
["N.B. Insurance Managers and Insurance Agents should include all premiums and commissions under the heading 'Authorised Undertakings' and, where more than one appointment is held, aggregate the data in respect of all appointments"]
[]
[]
["Form 3","Reinsurance Premiums and Commissions in relation to: "]
[null,"a. commitments where Malta is the country of commitment, and"]
[null,"b. risks situated in Malta"]
[]
["Form 4","Reinsurance Premiums and Commissions in relation to: "]
[null,"a. commitments where Malta is not the country of commitment, and"]
[null,"b. risks situated outside Malta"]
[]
["Part C - Summary of Premiums, Commissions and Other Income"]
[]
["Form 5","Total Premiums, Total Commissions and Other Income"]
[]
["Part D - Compliance with Financial Requirements"]
[]
["Form 6","Debtors and Creditors In Respect of Insurance Transactions"]
[]
["Form 7","Monies Held in a Fiduciary Capacity"]
[]
["Form 8","Own Funds"]
["Form 8A","Own Funds of Enrolled Companies"]
["Form 8B","Own Funds of Enrolled Individuals"]
[]
["Form 9","Fidelity Bond"]
[]
["Part E - Additional Details "]
[]
["Form 10","Particulars of Business "]
["Form 10A","Spread of Business of Enrolled Insurance Brokers"]
["Form 10B","Breakdown of Business of Enrolled Insurance Managers and Enrolled Insurance Agents with more than one appointment"]
[]
["Form 10C","Spread of Business of Enrolled Insurance Brokers"]
[]
["Form 11","Underwriting Agreements (applicable only to Enrolled Insurance Brokers)"]
[]
["Form 12","Income Statement"]
[]
["Form 13","Remuneration"]
[]
["Form14","Statement of Financial Position"]

{"sheet":"Form 1","index":4,"n_rows":38,"n_cols":11,"rows_kept":38,"cut":false,"hidden":false,"merged":[[8,10,9,10],[20,10,21,10],[35,1,35,12],[36,1,36,12],[19,2,19,3],[19,4,19,5],[19,6,19,7],[19,8,19,9],[0,2,0,5],[7,2,7,3],[7,4,7,5],[7,6,7,7],[7,8,7,9]]}
["Name of Insurance Intermediary:-",null,{"$f":"'Cover Sheet'!E17","v":0},null,null,null,"                  Year ended : ",null,{"$f":"IF('Cover Sheet'!$E$23=\"\",\"\",'Cover Sheet'!$E$23)","v":""}]
[]
["Form 1"]
["Insurance Premiums and Commissions in relation to commitments where Malta is the country of commitment and risks situated in Malta "]
[]
["Long Term Business"]
["Gross insurance premiums written and commissions received or receivable in respect thereof"]
["No","Class","Authorised Undertakings",null,"\"Approved\" Undertakings 1",null,null,null,"Total",null,"Total"]
[null,null,"Premiums","Commissions","Premiums","Commissions",null,null,"Premiums","Commissions","Number of Policies"]
[null,null,"EUR","EUR","EUR","EUR",null,null,"EUR","EUR"]
["I"," Life and Annuity",null,null,null,null,null,null,{"$f":"C11+E11+G11","v":0},{"$f":"D11+F11+G11","v":0}]
["II"," Marriage and Birth",null,null,null,null,null,null,{"$f":"C12+E12+G12","v":0},{"$f":"D12+F12+G12","v":0}]
["III"," Linked Long Term ",null,null,null,null,null,null,{"$f":"C13+E13+G13","v":0},{"$f":"D13+F13+G13","v":0}]
["IV"," Permanent Health",null,null,null,null,null,null,{"$f":"C14+E14+G14","v":0},{"$f":"D14+F14+G14","v":0}]
[null," Other Classes 3",null,null,null,null,null,null,{"$f":"C15+E15+G15","v":0},{"$f":"D15+F15+G15","v":0}]
[null,"TOTAL PREMIUMS AND COMMISSION",{"$f":"SUM(C11:C15)","v":0},{"$f":"SUM(D11:D15)","v":0},{"$f":"SUM(E11:E15)","v":0},{"$f":"SUM(F11:F15)","v":0},null,null,{"$f":"SUM(I11:I15)","v":0},{"$f":"SUM(J11:J15)","v":0},{"$f":"SUM(K11:K15)","v":0}]
[]
["General Business"]
["Gross insurance premiums written and commissions received or receivable in respect thereof"]
[null,null,"Authorised Undertakings",null,"\"Approved\" Undertakings 1",null,"Unauthorised Undertakings 2",null,"Total",null,"Total"]
[null,null,"Premiums","Commissions","Premiums","Commissions","Premiums","Commission","Premiums","Commissions","Number of Policies"]
[null,null,"EUR","EUR","EUR","EUR","EUR","EUR","EUR","EUR"]
[1," Accident & Health",null,null,null,null,null,null,{"$f":"C23+E23+G23","v":0},0]
[2," Motor",null,null,null,null,null,null,0,0]
[3," Marine & Transport",null,null,null,null,null,null,0,0]
[4," Aviation",null,null,null,null,null,null,0,0]
[5," Fire & Other Damage to Property",null,null,null,null,null,null,0,0]
[6," Liability",null,null,null,null,null,null,0,0]
[7," Credit and Suretyship",null,null,null,null,null,null,0,0]
[8," General",null,null,null,null,null,null,0,0]
[null,"TOTAL PREMIUMS AND COMMISSION",{"$f":"SUM(C23:C30)","v":0},{"$f":"SUM(D23:D30)","v":0},0,0,0,0,0,0,0]
[]
[]
[]
["Notes"]
[1,"Business placed with unauthorised undertakings where approval was specifically granted in writing by the MFSA in terms of Article 31 of the Insurance Distribution Act"]
[2,"Unauthorised undertakings refers to undertakings carrying on the business of reinsurance or writing large risks in Malta which are not authorised under the Insurance Business Act"]
[3,"Other Classes refer to classes V to IX found in the Second Schedule of the Insurance Business Act"]

{"sheet":"F1","index":5,"n_rows":136,"n_cols":6,"rows_kept":136,"cut":false,"hidden":true,"merged":[]}
["SheetCode","FieldCode","FICode","Date","ColNum","Value"]
["F1",101,{"$f":"'Cover Sheet'!$E$19","v":0},{"$f":"'Cover Sheet'!$E$23","v":"00:00:00"},1,{"$f":"'Form 1'!C11/'Cover Sheet'!$E$27","v":{"$error":"#DIV/0!"}}]
["F1",102,{"$f":"'Cover Sheet'!$E$19","v":0},{"$f":"'Cover Sheet'!$E$23","v":"00:00:00"},1,{"$f":"'Form 1'!C12/'Cover Sheet'!$E$27","v":{"$error":"#DIV/0!"}}]
["F1",103,{"$f":"'Cover Sheet'!$E$19","v":0},{"$f":"'Cover Sheet'!$E$23","v":"00:00:00"},1,{"$f":"'Form 1'!C13/'Cover Sheet'!$E$27","v":{"$error":"#DIV/0!"}}]
["F1",104,{"$f":"'Cover Sheet'!$E$19","v":0},{"$f":"'Cover Sheet'!$E$23","v":"00:00:00"},1,{"$f":"'Form 1'!C14/'Cover Sheet'!$E$27","v":{"$error":"#DIV/0!"}}]
["F1",105,{"$f":"'Cover Sheet'!$E$19","v":0},{"$f":"'Cover Sheet'!$E$23","v":"00:00:00"},1,{"$f":"'Form 1'!C15/'Cover Sheet'!$E$27","v":{"$error":"#DIV/0!"}}]
["F1",1,{"$f":"'Cover Sheet'!$E$19","v":0},{"$f":"'Cover Sheet'!$E$23","v":"00:00:00"},1,{"$f":"'Form 1'!C16/'Cover Sheet'!$E$27","v":{"$error":"#DIV/0!"}}]
["F1",201,{"$f":"'Cover Sheet'!$E$19","v":0},{"$f":"'Cover Sheet'!$E$23","v":"00:00:00"},1,{"$f":"'Form 1'!C23/'Cover Sheet'!$E$27","v":{"$error":"#DIV/0!"}}]
["F1",202,{"$f":"'Cover Sheet'!$E$19","v":0},{"$f":"'Cover Sheet'!$E$23","v":"00:00:00"},1,{"$f":"'Form 1'!C24/'Cover Sheet'!$E$27","v":{"$error":"#DIV/0!"}}]
["F1",203,{"$f":"'Cover Sheet'!$E$19","v":0},{"$f":"'Cover Sheet'!$E$23","v":"00:00:00"},1,{"$f":"'Form 1'!C25/'Cover Sheet'!$E$27","v":{"$error":"#DIV/0!"}}]
["F1",204,{"$f":"'Cover Sheet'!$E$19","v":0},{"$f":"'Cover Sheet'!$E$23","v":"00:00:00"},1,{"$f":"'Form 1'!C26/'Cover Sheet'!$E$27","v":{"$error":"#DIV/0!"}}]
["F1",205,{"$f":"'Cover Sheet'!$E$19","v":0},{"$f":"'Cover Sheet'!$E$23","v":"00:00:00"},1,{"$f":"'Form 1'!C27/'Cover Sheet'!$E$27","v":{"$error":"#DIV/0!"}}]
["F1",206,{"$f":"'Cover Sheet'!$E$19","v":0},{"$f":"'Cover Sheet'!$E$23","v":"00:00:00"},1,{"$f":"'Form 1'!C28/'Cover Sheet'!$E$27","v":{"$error":"#DIV/0!"}}]
["F1",207,{"$f":"'Cover Sheet'!$E$19","v":0},{"$f":"'Cover Sheet'!$E$23","v":"00:00:00"},1,{"$f":"'Form 1'!C29/'Cover Sheet'!$E$27","v":{"$error":"#DIV/0!"}}]
["F1",208,{"$f":"'Cover Sheet'!$E$19","v":0},{"$f":"'Cover Sheet'!$E$23","v":"00:00:00"},1,{"$f":"'Form 1'!C30/'Cover Sheet'!$E$27","v":{"$error":"#DIV/0!"}}]
["F1",2,{"$f":"'Cover Sheet'!$E$19","v":0},{"$f":"'Cover Sheet'!$E$23","v":"00:00:00"},1,{"$f":"'Form 1'!C31/'Cover Sheet'!$E$27","v":{"$error":"#DIV/0!"}}]
["F1",101,{"$f":"'Cover Sheet'!$E$19","v":0},{"$f":"'Cover Sheet'!$E$23","v":"00:00:00"},2,{"$f":"'Form 1'!#REF!/'Cover Sheet'!$E$27","v":{"$error":"#REF!"}}]
["F1",102,{"$f":"'Cover Sheet'!$E$19","v":0},{"$f":"'Cover Sheet'!$E$23","v":"00:00:00"},2,{"$f":"'Form 1'!#REF!/'Cover Sheet'!$E$27","v":{"$error":"#REF!"}}]
["F1",103,{"$f":"'Cover Sheet'!$E$19","v":0},{"$f":"'Cover Sheet'!$E$23","v":"00:00:00"},2,{"$f":"'Form 1'!#REF!/'Cover Sheet'!$E$27","v":{"$error":"#REF!"}}]
["F1",104,{"$f":"'Cover Sheet'!$E$19","v":0},{"$f":"'Cover Sheet'!$E$23","v":"00:00:00"},2,{"$f":"'Form 1'!#REF!/'Cover Sheet'!$E$27","v":{"$error":"#REF!"}}]
["F1",105,{"$f":"'Cover Sheet'!$E$19","v":0},{"$f":"'Cover Sheet'!$E$23","v":"00:00:00"},2,{"$f":"'Form 1'!#REF!/'Cover Sheet'!$E$27","v":{"$error":"#REF!"}}]
["F1",1,{"$f":"'Cover Sheet'!$E$19","v":0},{"$f":"'Cover Sheet'!$E$23","v":"00:00:00"},2,{"$f":"'Form 1'!#REF!/'Cover Sheet'!$E$27","v":{"$error":"#REF!"}}]
["F1",201,{"$f":"'Cover Sheet'!$E$19","v":0},{"$f":"'Cover Sheet'!$E$23","v":"00:00:00"},2,{"$f":"'Form 1'!#REF!/'Cover Sheet'!$E$27","v":{"$error":"#REF!"}}]
["F1",202,{"$f":"'Cover Sheet'!$E$19","v":0},{"$f":"'Cover Sheet'!$E$23","v":"00:00:00"},2,{"$f":"'Form 1'!#REF!/'Cover Sheet'!$E$27","v":{"$error":"#REF!"}}]
["F1",203,{"$f":"'Cover Sheet'!$E$19","v":0},{"$f":"'Cover Sheet'!$E$23","v":"00:00:00"},2,{"$f":"'Form 1'!#REF!/'Cover Sheet'!$E$27","v":{"$error":"#REF!"}}]
["F1",204,{"$f":"'Cover Sheet'!$E$19","v":0},{"$f":"'Cover Sheet'!$E$23","v":"00:00:00"},2,{"$f":"'Form 1'!#REF!/'Cover Sheet'!$E$27","v":{"$error":"#REF!"}}]
["F1",205,{"$f":"'Cover Sheet'!$E$19","v":0},{"$f":"'Cover Sheet'!$E$23","v":"00:00:00"},2,{"$f":"'Form 1'!#REF!/'Cover Sheet'!$E$27","v":{"$error":"#REF!"}}]
["F1",206,{"$f":"'Cover Sheet'!$E$19","v":0},{"$f":"'Cover Sheet'!$E$23","v":"00:00:00"},2,{"$f":"'Form 1'!#REF!/'Cover Sheet'!$E$27","v":{"$error":"#REF!"}}]
["F1",207,{"$f":"'Cover Sheet'!$E$19","v":0},{"$f":"'Cover Sheet'!$E$23","v":"00:00:00"},2,{"$f":"'Form 1'!#REF!/'Cover Sheet'!$E$27","v":{"$error":"#REF!"}}]
["F1",208,{"$f":"'Cover Sheet'!$E$19","v":0},{"$f":"'Cover Sheet'!$E$23","v":"00:00:00"},2,{"$f":"'Form 1'!#REF!/'Cover Sheet'!$E$27","v":{"$error":"#REF!"}}]
["F1",2,{"$f":"'Cover Sheet'!$E$19","v":0},{"$f":"'Cover Sheet'!$E$23","v":"00:00:00"},2,{"$f":"'Form 1'!#REF!/'Cover Sheet'!$E$27","v":{"$error":"#REF!"}}]
["F1",101,{"$f":"'Cover Sheet'!$E$19","v":0},{"$f":"'Cover Sheet'!$E$23","v":"00:00:00"},3,{"$f":"'Form 1'!E11/'Cover Sheet'!$E$27","v":{"$error":"#DIV/0!"}}]
["F1",102,{"$f":"'Cover Sheet'!$E$19","v":0},{"$f":"'Cover Sheet'!$E$23","v":"00:00:00"},3,{"$f":"'Form 1'!E12/'Cover Sheet'!$E$27","v":{"$error":"#DIV/0!"}}]
["F1",103,{"$f":"'Cover Sheet'!$E$19","v":0},{"$f":"'Cover Sheet'!$E$23","v":"00:00:00"},3,{"$f":"'Form 1'!E13/'Cover Sheet'!$E$27","v":{"$error":"#DIV/0!"}}]
["F1",104,{"$f":"'Cover Sheet'!$E$19","v":0},{"$f":"'Cover Sheet'!$E$23","v":"00:00:00"},3,{"$f":"'Form 1'!E14/'Cover Sheet'!$E$27","v":{"$error":"#DIV/0!"}}]
["F1",105,{"$f":"'Cover Sheet'!$E$19","v":0},{"$f":"'Cover Sheet'!$E$23","v":"00:00:00"},3,{"$f":"'Form 1'!E15/'Cover Sheet'!$E$27","v":{"$error":"#DIV/0!"}}]
["F1",1,{"$f":"'Cover Sheet'!$E$19","v":0},{"$f":"'Cover Sheet'!$E$23","v":"00:00:00"},3,{"$f":"'Form 1'!E16/'Cover Sheet'!$E$27","v":{"$error":"#DIV/0!"}}]
["F1",201,{"$f":"'Cover Sheet'!$E$19","v":0},{"$f":"'Cover Sheet'!$E$23","v":"00:00:00"},3,{"$f":"'Form 1'!E23/'Cover Sheet'!$E$27","v":{"$error":"#DIV/0!"}}]
["F1",202,{"$f":"'Cover Sheet'!$E$19","v":0},{"$f":"'Cover Sheet'!$E$23","v":"00:00:00"},3,{"$f":"'Form 1'!E24/'Cover Sheet'!$E$27","v":{"$error":"#DIV/0!"}}]
["F1",203,{"$f":"'Cover Sheet'!$E$19","v":0},{"$f":"'Cover Sheet'!$E$23","v":"00:00:00"},3,{"$f":"'Form 1'!E25/'Cover Sheet'!$E$27","v":{"$error":"#DIV/0!"}}]
["F1",204,{"$f":"'Cover Sheet'!$E$19","v":0},{"$f":"'Cover Sheet'!$E$23","v":"00:00:00"},3,{"$f":"'Form 1'!E26/'Cover Sheet'!$E$27","v":{"$error":"#DIV/0!"}}]
["F1",205,{"$f":"'Cover Sheet'!$E$19","v":0},{"$f":"'Cover Sheet'!$E$23","v":"00:00:00"},3,{"$f":"'Form 1'!E27/'Cover Sheet'!$E$27","v":{"$error":"#DIV/0!"}}]
["F1",206,{"$f":"'Cover Sheet'!$E$19","v":0},{"$f":"'Cover Sheet'!$E$23","v":"00:00:00"},3,{"$f":"'Form 1'!E28/'Cover Sheet'!$E$27","v":{"$error":"#DIV/0!"}}]
["F1",207,{"$f":"'Cover Sheet'!$E$19","v":0},{"$f":"'Cover Sheet'!$E$23","v":"00:00:00"},3,{"$f":"'Form 1'!E29/'Cover Sheet'!$E$27","v":{"$error":"#DIV/0!"}}]
["F1",208,{"$f":"'Cover Sheet'!$E$19","v":0},{"$f":"'Cover Sheet'!$E$23","v":"00:00:00"},3,{"$f":"'Form 1'!E30/'Cover Sheet'!$E$27","v":{"$error":"#DIV/0!"}}]
["F1",2,{"$f":"'Cover Sheet'!$E$19","v":0},{"$f":"'Cover Sheet'!$E$23","v":"00:00:00"},3,{"$f":"'Form 1'!E31/'Cover Sheet'!$E$27","v":{"$error":"#DIV/0!"}}]
["F1",101,{"$f":"'Cover Sheet'!$E$19","v":0},{"$f":"'Cover Sheet'!$E$23","v":"00:00:00"},4,{"$f":"'Form 1'!#REF!/'Cover Sheet'!$E$27","v":{"$error":"#REF!"}}]
["F1",102,{"$f":"'Cover Sheet'!$E$19","v":0},{"$f":"'Cover Sheet'!$E$23","v":"00:00:00"},4,{"$f":"'Form 1'!#REF!/'Cover Sheet'!$E$27","v":{"$error":"#REF!"}}]
["F1",103,{"$f":"'Cover Sheet'!$E$19","v":0},{"$f":"'Cover Sheet'!$E$23","v":"00:00:00"},4,{"$f":"'Form 1'!#REF!/'Cover Sheet'!$E$27","v":{"$error":"#REF!"}}]
["F1",104,{"$f":"'Cover Sheet'!$E$19","v":0},{"$f":"'Cover Sheet'!$E$23","v":"00:00:00"},4,{"$f":"'Form 1'!#REF!/'Cover Sheet'!$E$27","v":{"$error":"#REF!"}}]
["F1",105,{"$f":"'Cover Sheet'!$E$19","v":0},{"$f":"'Cover Sheet'!$E$23","v":"00:00:00"},4,{"$f":"'Form 1'!#REF!/'Cover Sheet'!$E$27","v":{"$error":"#REF!"}}]
["F1",1,{"$f":"'Cover Sheet'!$E$19","v":0},{"$f":"'Cover Sheet'!$E$23","v":"00:00:00"},4,{"$f":"'Form 1'!#REF!/'Cover Sheet'!$E$27","v":{"$error":"#REF!"}}]
["F1",201,{"$f":"'Cover Sheet'!$E$19","v":0},{"$f":"'Cover Sheet'!$E$23","v":"00:00:00"},4,{"$f":"'Form 1'!#REF!/'Cover Sheet'!$E$27","v":{"$error":"#REF!"}}]
["F1",202,{"$f":"'Cover Sheet'!$E$19","v":0},{"$f":"'Cover Sheet'!$E$23","v":"00:00:00"},4,{"$f":"'Form 1'!#REF!/'Cover Sheet'!$E$27","v":{"$error":"#REF!"}}]
["F1",203,{"$f":"'Cover Sheet'!$E$19","v":0},{"$f":"'Cover Sheet'!$E$23","v":"00:00:00"},4,{"$f":"'Form 1'!#REF!/'Cover Sheet'!$E$27","v":{"$error":"#REF!"}}]
["F1",204,{"$f":"'Cover Sheet'!$E$19","v":0},{"$f":"'Cover Sheet'!$E$23","v":"00:00:00"},4,{"$f":"'Form 1'!#REF!/'Cover Sheet'!$E$27","v":{"$error":"#REF!"}}]
["F1",205,{"$f":"'Cover Sheet'!$E$19","v":0},{"$f":"'Cover Sheet'!$E$23","v":"00:00:00"},4,{"$f":"'Form 1'!#REF!/'Cover Sheet'!$E$27","v":{"$error":"#REF!"}}]
["F1",206,{"$f":"'Cover Sheet'!$E$19","v":0},{"$f":"'Cover Sheet'!$E$23","v":"00:00:00"},4,{"$f":"'Form 1'!#REF!/'Cover Sheet'!$E$27","v":{"$error":"#REF!"}}]
["F1",207,{"$f":"'Cover Sheet'!$E$19","v":0},{"$f":"'Cover Sheet'!$E$23","v":"00:00:00"},4,{"$f":"'Form 1'!#REF!/'Cover Sheet'!$E$27","v":{"$error":"#REF!"}}]
["F1",208,{"$f":"'Cover Sheet'!$E$19","v":0},{"$f":"'Cover Sheet'!$E$23","v":"00:00:00"},4,{"$f":"'Form 1'!#REF!/'Cover Sheet'!$E$27","v":{"$error":"#REF!"}}]
["F1",2,{"$f":"'Cover Sheet'!$E$19","v":0},{"$f":"'Cover Sheet'!$E$23","v":"00:00:00"},4,{"$f":"'Form 1'!#REF!/'Cover Sheet'!$E$27","v":{"$error":"#REF!"}}]
["F1",101,{"$f":"'Cover Sheet'!$E$19","v":0},{"$f":"'Cover Sheet'!$E$23","v":"00:00:00"},5,{"$f":"'Form 1'!G11/'Cover Sheet'!$E$27","v":{"$error":"#DIV/0!"}}]
["F1",102,{"$f":"'Cover Sheet'!$E$19","v":0},{"$f":"'Cover Sheet'!$E$23","v":"00:00:00"},5,{"$f":"'Form 1'!G12/'Cover Sheet'!$E$27","v":{"$error":"#DIV/0!"}}]
["F1",103,{"$f":"'Cover Sheet'!$E$19","v":0},{"$f":"'Cover Sheet'!$E$23","v":"00:00:00"},5,{"$f":"'Form 1'!G13/'Cover Sheet'!$E$27","v":{"$error":"#DIV/0!"}}]
["F1",104,{"$f":"'Cover Sheet'!$E$19","v":0},{"$f":"'Cover Sheet'!$E$23","v":"00:00:00"},5,{"$f":"'Form 1'!G14/'Cover Sheet'!$E$27","v":{"$error":"#DIV/0!"}}]
["F1",105,{"$f":"'Cover Sheet'!$E$19","v":0},{"$f":"'Cover Sheet'!$E$23","v":"00:00:00"},5,{"$f":"'Form 1'!G15/'Cover Sheet'!$E$27","v":{"$error":"#DIV/0!"}}]
["F1",1,{"$f":"'Cover Sheet'!$E$19","v":0},{"$f":"'Cover Sheet'!$E$23","v":"00:00:00"},5,{"$f":"'Form 1'!G16/'Cover Sheet'!$E$27","v":{"$error":"#DIV/0!"}}]
["F1",201,{"$f":"'Cover Sheet'!$E$19","v":0},{"$f":"'Cover Sheet'!$E$23","v":"00:00:00"},5,{"$f":"'Form 1'!G23/'Cover Sheet'!$E$27","v":{"$error":"#DIV/0!"}}]
["F1",202,{"$f":"'Cover Sheet'!$E$19","v":0},{"$f":"'Cover Sheet'!$E$23","v":"00:00:00"},5,{"$f":"'Form 1'!G24/'Cover Sheet'!$E$27","v":{"$error":"#DIV/0!"}}]
["F1",203,{"$f":"'Cover Sheet'!$E$19","v":0},{"$f":"'Cover Sheet'!$E$23","v":"00:00:00"},5,{"$f":"'Form 1'!G25/'Cover Sheet'!$E$27","v":{"$error":"#DIV/0!"}}]
["F1",204,{"$f":"'Cover Sheet'!$E$19","v":0},{"$f":"'Cover Sheet'!$E$23","v":"00:00:00"},5,{"$f":"'Form 1'!G26/'Cover Sheet'!$E$27","v":{"$error":"#DIV/0!"}}]
["F1",205,{"$f":"'Cover Sheet'!$E$19","v":0},{"$f":"'Cover Sheet'!$E$23","v":"00:00:00"},5,{"$f":"'Form 1'!G27/'Cover Sheet'!$E$27","v":{"$error":"#DIV/0!"}}]
["F1",206,{"$f":"'Cover Sheet'!$E$19","v":0},{"$f":"'Cover Sheet'!$E$23","v":"00:00:00"},5,{"$f":"'Form 1'!G28/'Cover Sheet'!$E$27","v":{"$error":"#DIV/0!"}}]
["F1",207,{"$f":"'Cover Sheet'!$E$19","v":0},{"$f":"'Cover Sheet'!$E$23","v":"00:00:00"},5,{"$f":"'Form 1'!G29/'Cover Sheet'!$E$27","v":{"$error":"#DIV/0!"}}]
["F1",208,{"$f":"'Cover Sheet'!$E$19","v":0},{"$f":"'Cover Sheet'!$E$23","v":"00:00:00"},5,{"$f":"'Form 1'!G30/'Cover Sheet'!$E$27","v":{"$error":"#DIV/0!"}}]
["F1",2,{"$f":"'Cover Sheet'!$E$19","v":0},{"$f":"'Cover Sheet'!$E$23","v":"00:00:00"},5,{"$f":"'Form 1'!G31/'Cover Sheet'!$E$27","v":{"$error":"#DIV/0!"}}]
["F1",101,{"$f":"'Cover Sheet'!$E$19","v":0},{"$f":"'Cover Sheet'!$E$23","v":"00:00:00"},6,{"$f":"'Form 1'!#REF!/'Cover Sheet'!$E$27","v":{"$error":"#REF!"}}]
["F1",102,{"$f":"'Cover Sheet'!$E$19","v":0},{"$f":"'Cover Sheet'!$E$23","v":"00:00:00"},6,{"$f":"'Form 1'!#REF!/'Cover Sheet'!$E$27","v":{"$error":"#REF!"}}]
["F1",103,{"$f":"'Cover Sheet'!$E$19","v":0},{"$f":"'Cover Sheet'!$E$23","v":"00:00:00"},6,{"$f":"'Form 1'!#REF!/'Cover Sheet'!$E$27","v":{"$error":"#REF!"}}]
["F1",104,{"$f":"'Cover Sheet'!$E$19","v":0},{"$f":"'Cover Sheet'!$E$23","v":"00:00:00"},6,{"$f":"'Form 1'!#REF!/'Cover Sheet'!$E$27","v":{"$error":"#REF!"}}]
["F1",105,{"$f":"'Cover Sheet'!$E$19","v":0},{"$f":"'Cover Sheet'!$E$23","v":"00:00:00"},6,{"$f":"'Form 1'!#REF!/'Cover Sheet'!$E$27","v":{"$error":"#REF!"}}]
["F1",1,{"$f":"'Cover Sheet'!$E$19","v":0},{"$f":"'Cover Sheet'!$E$23","v":"00:00:00"},6,{"$f":"'Form 1'!#REF!/'Cover Sheet'!$E$27","v":{"$error":"#REF!"}}]
["F1",201,{"$f":"'Cover Sheet'!$E$19","v":0},{"$f":"'Cover Sheet'!$E$23","v":"00:00:00"},6,{"$f":"'Form 1'!#REF!/'Cover Sheet'!$E$27","v":{"$error":"#REF!"}}]
["F1",202,{"$f":"'Cover Sheet'!$E$19","v":0},{"$f":"'Cover Sheet'!$E$23","v":"00:00:00"},6,{"$f":"'Form 1'!#REF!/'Cover Sheet'!$E$27","v":{"$error":"#REF!"}}]
["F1",203,{"$f":"'Cover Sheet'!$E$19","v":0},{"$f":"'Cover Sheet'!$E$23","v":"00:00:00"},6,{"$f":"'Form 1'!#REF!/'Cover Sheet'!$E$27","v":{"$error":"#REF!"}}]
["F1",204,{"$f":"'Cover Sheet'!$E$19","v":0},{"$f":"'Cover Sheet'!$E$23","v":"00:00:00"},6,{"$f":"'Form 1'!#REF!/'Cover Sheet'!$E$27","v":{"$error":"#REF!"}}]
["F1",205,{"$f":"'Cover Sheet'!$E$19","v":0},{"$f":"'Cover Sheet'!$E$23","v":"00:00:00"},6,{"$f":"'Form 1'!#REF!/'Cover Sheet'!$E$27","v":{"$error":"#REF!"}}]
["F1",206,{"$f":"'Cover Sheet'!$E$19","v":0},{"$f":"'Cover Sheet'!$E$23","v":"00:00:00"},6,{"$f":"'Form 1'!#REF!/'Cover Sheet'!$E$27","v":{"$error":"#REF!"}}]
["F1",207,{"$f":"'Cover Sheet'!$E$19","v":0},{"$f":"'Cover Sheet'!$E$23","v":"00:00:00"},6,{"$f":"'Form 1'!#REF!/'Cover Sheet'!$E$27","v":{"$error":"#REF!"}}]
["F1",208,{"$f":"'Cover Sheet'!$E$19","v":0},{"$f":"'Cover Sheet'!$E$23","v":"00:00:00"},6,{"$f":"'Form 1'!#REF!/'Cover Sheet'!$E$27","v":{"$error":"#REF!"}}]
["F1",2,{"$f":"'Cover Sheet'!$E$19","v":0},{"$f":"'Cover Sheet'!$E$23","v":"00:00:00"},6,{"$f":"'Form 1'!#REF!/'Cover Sheet'!$E$27","v":{"$error":"#REF!"}}]
["F1",101,{"$f":"'Cover Sheet'!$E$19","v":0},{"$f":"'Cover Sheet'!$E$23","v":"00:00:00"},7,{"$f":"'Form 1'!I11/'Cover Sheet'!$E$27","v":{"$error":"#DIV/0!"}}]
["F1",102,{"$f":"'Cover Sheet'!$E$19","v":0},{"$f":"'Cover Sheet'!$E$23","v":"00:00:00"},7,{"$f":"'Form 1'!I12/'Cover Sheet'!$E$27","v":{"$error":"#DIV/0!"}}]
["F1",103,{"$f":"'Cover Sheet'!$E$19","v":0},{"$f":"'Cover Sheet'!$E$23","v":"00:00:00"},7,{"$f":"'Form 1'!I13/'Cover Sheet'!$E$27","v":{"$error":"#DIV/0!"}}]
["F1",104,{"$f":"'Cover Sheet'!$E$19","v":0},{"$f":"'Cover Sheet'!$E$23","v":"00:00:00"},7,{"$f":"'Form 1'!I14/'Cover Sheet'!$E$27","v":{"$error":"#DIV/0!"}}]
["F1",105,{"$f":"'Cover Sheet'!$E$19","v":0},{"$f":"'Cover Sheet'!$E$23","v":"00:00:00"},7,{"$f":"'Form 1'!I15/'Cover Sheet'!$E$27","v":{"$error":"#DIV/0!"}}]
["F1",1,{"$f":"'Cover Sheet'!$E$19","v":0},{"$f":"'Cover Sheet'!$E$23","v":"00:00:00"},7,{"$f":"'Form 1'!I16/'Cover Sheet'!$E$27","v":{"$error":"#DIV/0!"}}]
["F1",201,{"$f":"'Cover Sheet'!$E$19","v":0},{"$f":"'Cover Sheet'!$E$23","v":"00:00:00"},7,{"$f":"'Form 1'!I23/'Cover Sheet'!$E$27","v":{"$error":"#DIV/0!"}}]
["F1",202,{"$f":"'Cover Sheet'!$E$19","v":0},{"$f":"'Cover Sheet'!$E$23","v":"00:00:00"},7,{"$f":"'Form 1'!I24/'Cover Sheet'!$E$27","v":{"$error":"#DIV/0!"}}]
["F1",203,{"$f":"'Cover Sheet'!$E$19","v":0},{"$f":"'Cover Sheet'!$E$23","v":"00:00:00"},7,{"$f":"'Form 1'!I25/'Cover Sheet'!$E$27","v":{"$error":"#DIV/0!"}}]
["F1",204,{"$f":"'Cover Sheet'!$E$19","v":0},{"$f":"'Cover Sheet'!$E$23","v":"00:00:00"},7,{"$f":"'Form 1'!I26/'Cover Sheet'!$E$27","v":{"$error":"#DIV/0!"}}]
["F1",205,{"$f":"'Cover Sheet'!$E$19","v":0},{"$f":"'Cover Sheet'!$E$23","v":"00:00:00"},7,{"$f":"'Form 1'!I27/'Cover Sheet'!$E$27","v":{"$error":"#DIV/0!"}}]
["F1",206,{"$f":"'Cover Sheet'!$E$19","v":0},{"$f":"'Cover Sheet'!$E$23","v":"00:00:00"},7,{"$f":"'Form 1'!I28/'Cover Sheet'!$E$27","v":{"$error":"#DIV/0!"}}]
["F1",207,{"$f":"'Cover Sheet'!$E$19","v":0},{"$f":"'Cover Sheet'!$E$23","v":"00:00:00"},7,{"$f":"'Form 1'!I29/'Cover Sheet'!$E$27","v":{"$error":"#DIV/0!"}}]
["F1",208,{"$f":"'Cover Sheet'!$E$19","v":0},{"$f":"'Cover Sheet'!$E$23","v":"00:00:00"},7,{"$f":"'Form 1'!I30/'Cover Sheet'!$E$27","v":{"$error":"#DIV/0!"}}]
["F1",2,{"$f":"'Cover Sheet'!$E$19","v":0},{"$f":"'Cover Sheet'!$E$23","v":"00:00:00"},7,{"$f":"'Form 1'!I31/'Cover Sheet'!$E$27","v":{"$error":"#DIV/0!"}}]
["F1",101,{"$f":"'Cover Sheet'!$E$19","v":0},{"$f":"'Cover Sheet'!$E$23","v":"00:00:00"},8,{"$f":"'Form 1'!#REF!/'Cover Sheet'!$E$27","v":{"$error":"#REF!"}}]
["F1",102,{"$f":"'Cover Sheet'!$E$19","v":0},{"$f":"'Cover Sheet'!$E$23","v":"00:00:00"},8,{"$f":"'Form 1'!#REF!/'Cover Sheet'!$E$27","v":{"$error":"#REF!"}}]
["F1",103,{"$f":"'Cover Sheet'!$E$19","v":0},{"$f":"'Cover Sheet'!$E$23","v":"00:00:00"},8,{"$f":"'Form 1'!#REF!/'Cover Sheet'!$E$27","v":{"$error":"#REF!"}}]
["F1",104,{"$f":"'Cover Sheet'!$E$19","v":0},{"$f":"'Cover Sheet'!$E$23","v":"00:00:00"},8,{"$f":"'Form 1'!#REF!/'Cover Sheet'!$E$27","v":{"$error":"#REF!"}}]
["F1",105,{"$f":"'Cover Sheet'!$E$19","v":0},{"$f":"'Cover Sheet'!$E$23","v":"00:00:00"},8,{"$f":"'Form 1'!#REF!/'Cover Sheet'!$E$27","v":{"$error":"#REF!"}}]
["F1",1,{"$f":"'Cover Sheet'!$E$19","v":0},{"$f":"'Cover Sheet'!$E$23","v":"00:00:00"},8,{"$f":"'Form 1'!#REF!/'Cover Sheet'!$E$27","v":{"$error":"#REF!"}}]
["F1",201,{"$f":"'Cover Sheet'!$E$19","v":0},{"$f":"'Cover Sheet'!$E$23","v":"00:00:00"},8,{"$f":"'Form 1'!#REF!/'Cover Sheet'!$E$27","v":{"$error":"#REF!"}}]
["F1",202,{"$f":"'Cover Sheet'!$E$19","v":0},{"$f":"'Cover Sheet'!$E$23","v":"00:00:00"},8,{"$f":"'Form 1'!#REF!/'Cover Sheet'!$E$27","v":{"$error":"#REF!"}}]
["F1",203,{"$f":"'Cover Sheet'!$E$19","v":0},{"$f":"'Cover Sheet'!$E$23","v":"00:00:00"},8,{"$f":"'Form 1'!#REF!/'Cover Sheet'!$E$27","v":{"$error":"#REF!"}}]
["F1",204,{"$f":"'Cover Sheet'!$E$19","v":0},{"$f":"'Cover Sheet'!$E$23","v":"00:00:00"},8,{"$f":"'Form 1'!#REF!/'Cover Sheet'!$E$27","v":{"$error":"#REF!"}}]
["F1",205,{"$f":"'Cover Sheet'!$E$19","v":0},{"$f":"'Cover Sheet'!$E$23","v":"00:00:00"},8,{"$f":"'Form 1'!#REF!/'Cover Sheet'!$E$27","v":{"$error":"#REF!"}}]
["F1",206,{"$f":"'Cover Sheet'!$E$19","v":0},{"$f":"'Cover Sheet'!$E$23","v":"00:00:00"},8,{"$f":"'Form 1'!#REF!/'Cover Sheet'!$E$27","v":{"$error":"#REF!"}}]
["F1",207,{"$f":"'Cover Sheet'!$E$19","v":0},{"$f":"'Cover Sheet'!$E$23","v":"00:00:00"},8,{"$f":"'Form 1'!#REF!/'Cover Sheet'!$E$27","v":{"$error":"#REF!"}}]
["F1",208,{"$f":"'Cover Sheet'!$E$19","v":0},{"$f":"'Cover Sheet'!$E$23","v":"00:00:00"},8,{"$f":"'Form 1'!#REF!/'Cover Sheet'!$E$27","v":{"$error":"#REF!"}}]
["F1",2,{"$f":"'Cover Sheet'!$E$19","v":0},{"$f":"'Cover Sheet'!$E$23","v":"00:00:00"},8,{"$f":"'Form 1'!#REF!/'Cover Sheet'!$E$27","v":{"$error":"#REF!"}}]
["F1",101,{"$f":"'Cover Sheet'!$E$19","v":0},{"$f":"'Cover Sheet'!$E$23","v":"00:00:00"},9,{"$f":"'Form 1'!K11","v":0}]
["F1",102,{"$f":"'Cover Sheet'!$E$19","v":0},{"$f":"'Cover Sheet'!$E$23","v":"00:00:00"},9,{"$f":"'Form 1'!K12","v":0}]
["F1",103,{"$f":"'Cover Sheet'!$E$19","v":0},{"$f":"'Cover Sheet'!$E$23","v":"00:00:00"},9,{"$f":"'Form 1'!K13","v":0}]
["F1",104,{"$f":"'Cover Sheet'!$E$19","v":0},{"$f":"'Cover Sheet'!$E$23","v":"00:00:00"},9,{"$f":"'Form 1'!K14","v":0}]
["F1",105,{"$f":"'Cover Sheet'!$E$19","v":0},{"$f":"'Cover Sheet'!$E$23","v":"00:00:00"},9,{"$f":"'Form 1'!K15","v":0}]
["F1",1,{"$f":"'Cover Sheet'!$E$19","v":0},{"$f":"'Cover Sheet'!$E$23","v":"00:00:00"},9,{"$f":"'Form 1'!K16","v":0}]
["F1",201,{"$f":"'Cover Sheet'!$E$19","v":0},{"$f":"'Cover Sheet'!$E$23","v":"00:00:00"},9,{"$f":"'Form 1'!K23","v":0}]
["F1",202,{"$f":"'Cover Sheet'!$E$19","v":0},{"$f":"'Cover Sheet'!$E$23","v":"00:00:00"},9,{"$f":"'Form 1'!K24","v":0}]
["F1",203,{"$f":"'Cover Sheet'!$E$19","v":0},{"$f":"'Cover Sheet'!$E$23","v":"00:00:00"},9,{"$f":"'Form 1'!K25","v":0}]
["F1",204,{"$f":"'Cover Sheet'!$E$19","v":0},{"$f":"'Cover Sheet'!$E$23","v":"00:00:00"},9,{"$f":"'Form 1'!K26","v":0}]
["F1",205,{"$f":"'Cover Sheet'!$E$19","v":0},{"$f":"'Cover Sheet'!$E$23","v":"00:00:00"},9,{"$f":"'Form 1'!K27","v":0}]
["F1",206,{"$f":"'Cover Sheet'!$E$19","v":0},{"$f":"'Cover Sheet'!$E$23","v":"00:00:00"},9,{"$f":"'Form 1'!K28","v":0}]
["F1",207,{"$f":"'Cover Sheet'!$E$19","v":0},{"$f":"'Cover Sheet'!$E$23","v":"00:00:00"},9,{"$f":"'Form 1'!K29","v":0}]
["F1",208,{"$f":"'Cover Sheet'!$E$19","v":0},{"$f":"'Cover Sheet'!$E$23","v":"00:00:00"},9,{"$f":"'Form 1'!K30","v":0}]
["F1",2,{"$f":"'Cover Sheet'!$E$19","v":0},{"$f":"'Cover Sheet'!$E$23","v":"00:00:00"},9,{"$f":"'Form 1'!K31","v":0}]

{"sheet":"Form 2","index":6,"n_rows":36,"n_cols":11,"rows_kept":36,"cut":false,"hidden":false,"merged":[[20,8,21,8],[34,1,34,12],[7,10,7,11],[19,2,19,3],[19,4,19,5],[19,6,19,7],[19,10,19,11],[8,8,9,8],[0,2,0,4],[33,0,33,1],[7,2,7,3],[7,4,7,5],[7,6,7,7],[3,0,3,7]]}
["Name of Insurance Intermediary:-",null,{"$f":"'Cover Sheet'!E17","v":0},null,null,null,{"$f":"IF('Cover Sheet'!$E$23=\"\",\"\",'Cover Sheet'!$E$23)","v":""}]
[]
["Form 2"]
["Insurance Premiums and Commissions in relation to commitments where Malta is not the country of commitment and risks situated outside Malta"]
[]
["Long Term Business"]
["Gross insurance premiums written and commissions received or receivable in respect thereof"]
["No","Class","Authorised Undertakings",null,"\"Approved\" Undertakings 1",null,"Total",null,"Total"]
[null,null,"Premiums","Commissions","Premiums","Commissions","Premiums","Commissions","Number of Policies"]
[null,null,"EUR","EUR","EUR","EUR","EUR","EUR"]
["I"," Life and Annuity",null,null,null,null,{"$f":"C11+E11","v":0},0,null,null,101]
["II"," Marriage and Birth",null,null,null,null,0,0,null,null,102]
["III"," Linked Long Term ",null,null,null,null,0,0,null,null,103]
["IV"," Permanent Health",null,null,null,null,0,0,null,null,104]
[null," Other Classes 2",null,null,null,null,{"$f":"A15+C15+E15","v":0},{"$f":"D15+F15","v":0},null,null,105]
[null,"TOTAL PREMIUMS AND COMMISSION",{"$f":"SUM(C11:C15)","v":0},0,0,{"$f":"SUM(F11:F15)","v":0},0,0,0,null,1]
[]
["General Business"]
["Gross insurance premiums written and commissions received or receivable in respect thereof"]
[null,null,"Authorised Undertakings",null,"\"Approved\" Undertakings 1",null,"Total",null,"Total"]
[null,null,"Premiums","Commissions","Premiums","Commissions","Premiums","Commissions","Number of Policies"]
[null,null,"EUR","EUR","EUR","EUR","EUR","EUR"]
[1," Accident & Health",null,null,null,null,{"$f":"C23+E23","v":0},0,null,null,201]
[2," Motor",null,null,null,null,0,0,null,null,202]
[3," Marine & Transport",100000,50000,null,null,100000,50000,null,null,203]
[4," Aviation",null,null,null,null,0,0,null,null,204]
[5," Fire & Other Damage to Property",null,null,null,null,0,0,null,null,205]
[6," Liability",null,null,null,null,0,0,null,null,206]
[7," Credit and Suretyship",null,null,null,null,0,0,null,null,207]
[8," General",null,null,null,null,0,0,null,null,208]
[null,"TOTAL PREMIUMS AND COMMISSION",{"$f":"SUM(C23:C30)","v":100000},50000,0,{"$f":"SUM(F23:F30)","v":0},100000,50000,0,null,2]
[]
[]
["Notes"]
[1,"Business placed with unauthorised undertakings where approval was specifically granted in writing by the MFSA in terms of Article 31 of the Insurance Distribution Act"]
[2,"Other Classes refer to classes V to IX found in the Second Schedule of the Insurance Business Act"]

{"sheet":"F2","index":7,"n_rows":106,"n_cols":6,"rows_kept":106,"cut":false,"hidden":true,"merged":[]}
["SheetCode","FieldCode","FICode","Date","ColNum","Value"]
["F2",101,{"$f":"'Cover Sheet'!$E$19","v":0},{"$f":"'Cover Sheet'!$E$23","v":"00:00:00"},1,{"$f":"'Form 2'!C11/'Cover Sheet'!$E$27","v":{"$error":"#DIV/0!"}}]
["F2",102,{"$f":"'Cover Sheet'!$E$19","v":0},{"$f":"'Cover Sheet'!$E$23","v":"00:00:00"},1,{"$f":"'Form 2'!C12/'Cover Sheet'!$E$27","v":{"$error":"#DIV/0!"}}]
["F2",103,{"$f":"'Cover Sheet'!$E$19","v":0},{"$f":"'Cover Sheet'!$E$23","v":"00:00:00"},1,{"$f":"'Form 2'!C13/'Cover Sheet'!$E$27","v":{"$error":"#DIV/0!"}}]
["F2",104,{"$f":"'Cover Sheet'!$E$19","v":0},{"$f":"'Cover Sheet'!$E$23","v":"00:00:00"},1,{"$f":"'Form 2'!C14/'Cover Sheet'!$E$27","v":{"$error":"#DIV/0!"}}]
["F2",105,{"$f":"'Cover Sheet'!$E$19","v":0},{"$f":"'Cover Sheet'!$E$23","v":"00:00:00"},1,{"$f":"'Form 2'!C15/'Cover Sheet'!$E$27","v":{"$error":"#DIV/0!"}}]
["F2",1,{"$f":"'Cover Sheet'!$E$19","v":0},{"$f":"'Cover Sheet'!$E$23","v":"00:00:00"},1,{"$f":"'Form 2'!C16/'Cover Sheet'!$E$27","v":{"$error":"#DIV/0!"}}]
["F2",201,{"$f":"'Cover Sheet'!$E$19","v":0},{"$f":"'Cover Sheet'!$E$23","v":"00:00:00"},1,{"$f":"'Form 2'!C23/'Cover Sheet'!$E$27","v":{"$error":"#DIV/0!"}}]
["F2",202,{"$f":"'Cover Sheet'!$E$19","v":0},{"$f":"'Cover Sheet'!$E$23","v":"00:00:00"},1,{"$f":"'Form 2'!C24/'Cover Sheet'!$E$27","v":{"$error":"#DIV/0!"}}]
["F2",203,{"$f":"'Cover Sheet'!$E$19","v":0},{"$f":"'Cover Sheet'!$E$23","v":"00:00:00"},1,{"$f":"'Form 2'!C25/'Cover Sheet'!$E$27","v":{"$error":"#DIV/0!"}}]
["F2",204,{"$f":"'Cover Sheet'!$E$19","v":0},{"$f":"'Cover Sheet'!$E$23","v":"00:00:00"},1,{"$f":"'Form 2'!C26/'Cover Sheet'!$E$27","v":{"$error":"#DIV/0!"}}]
["F2",205,{"$f":"'Cover Sheet'!$E$19","v":0},{"$f":"'Cover Sheet'!$E$23","v":"00:00:00"},1,{"$f":"'Form 2'!C27/'Cover Sheet'!$E$27","v":{"$error":"#DIV/0!"}}]
["F2",206,{"$f":"'Cover Sheet'!$E$19","v":0},{"$f":"'Cover Sheet'!$E$23","v":"00:00:00"},1,{"$f":"'Form 2'!C28/'Cover Sheet'!$E$27","v":{"$error":"#DIV/0!"}}]
["F2",207,{"$f":"'Cover Sheet'!$E$19","v":0},{"$f":"'Cover Sheet'!$E$23","v":"00:00:00"},1,{"$f":"'Form 2'!C29/'Cover Sheet'!$E$27","v":{"$error":"#DIV/0!"}}]
["F2",208,{"$f":"'Cover Sheet'!$E$19","v":0},{"$f":"'Cover Sheet'!$E$23","v":"00:00:00"},1,{"$f":"'Form 2'!C30/'Cover Sheet'!$E$27","v":{"$error":"#DIV/0!"}}]
["F2",2,{"$f":"'Cover Sheet'!$E$19","v":0},{"$f":"'Cover Sheet'!$E$23","v":"00:00:00"},1,{"$f":"'Form 2'!C31/'Cover Sheet'!$E$27","v":{"$error":"#DIV/0!"}}]
["F2",101,{"$f":"'Cover Sheet'!$E$19","v":0},{"$f":"'Cover Sheet'!$E$23","v":"00:00:00"},2,{"$f":"'Form 2'!#REF!/'Cover Sheet'!$E$27","v":{"$error":"#REF!"}}]
["F2",102,{"$f":"'Cover Sheet'!$E$19","v":0},{"$f":"'Cover Sheet'!$E$23","v":"00:00:00"},2,{"$f":"'Form 2'!#REF!/'Cover Sheet'!$E$27","v":{"$error":"#REF!"}}]
["F2",103,{"$f":"'Cover Sheet'!$E$19","v":0},{"$f":"'Cover Sheet'!$E$23","v":"00:00:00"},2,{"$f":"'Form 2'!#REF!/'Cover Sheet'!$E$27","v":{"$error":"#REF!"}}]
["F2",104,{"$f":"'Cover Sheet'!$E$19","v":0},{"$f":"'Cover Sheet'!$E$23","v":"00:00:00"},2,{"$f":"'Form 2'!#REF!/'Cover Sheet'!$E$27","v":{"$error":"#REF!"}}]
["F2",105,{"$f":"'Cover Sheet'!$E$19","v":0},{"$f":"'Cover Sheet'!$E$23","v":"00:00:00"},2,{"$f":"'Form 2'!#REF!/'Cover Sheet'!$E$27","v":{"$error":"#REF!"}}]
["F2",1,{"$f":"'Cover Sheet'!$E$19","v":0},{"$f":"'Cover Sheet'!$E$23","v":"00:00:00"},2,{"$f":"'Form 2'!#REF!/'Cover Sheet'!$E$27","v":{"$error":"#REF!"}}]
["F2",201,{"$f":"'Cover Sheet'!$E$19","v":0},{"$f":"'Cover Sheet'!$E$23","v":"00:00:00"},2,{"$f":"'Form 2'!#REF!/'Cover Sheet'!$E$27","v":{"$error":"#REF!"}}]
["F2",202,{"$f":"'Cover Sheet'!$E$19","v":0},{"$f":"'Cover Sheet'!$E$23","v":"00:00:00"},2,{"$f":"'Form 2'!#REF!/'Cover Sheet'!$E$27","v":{"$error":"#REF!"}}]
["F2",203,{"$f":"'Cover Sheet'!$E$19","v":0},{"$f":"'Cover Sheet'!$E$23","v":"00:00:00"},2,{"$f":"'Form 2'!#REF!/'Cover Sheet'!$E$27","v":{"$error":"#REF!"}}]
["F2",204,{"$f":"'Cover Sheet'!$E$19","v":0},{"$f":"'Cover Sheet'!$E$23","v":"00:00:00"},2,{"$f":"'Form 2'!#REF!/'Cover Sheet'!$E$27","v":{"$error":"#REF!"}}]
["F2",205,{"$f":"'Cover Sheet'!$E$19","v":0},{"$f":"'Cover Sheet'!$E$23","v":"00:00:00"},2,{"$f":"'Form 2'!#REF!/'Cover Sheet'!$E$27","v":{"$error":"#REF!"}}]
["F2",206,{"$f":"'Cover Sheet'!$E$19","v":0},{"$f":"'Cover Sheet'!$E$23","v":"00:00:00"},2,{"$f":"'Form 2'!#REF!/'Cover Sheet'!$E$27","v":{"$error":"#REF!"}}]
["F2",207,{"$f":"'Cover Sheet'!$E$19","v":0},{"$f":"'Cover Sheet'!$E$23","v":"00:00:00"},2,{"$f":"'Form 2'!#REF!/'Cover Sheet'!$E$27","v":{"$error":"#REF!"}}]
["F2",208,{"$f":"'Cover Sheet'!$E$19","v":0},{"$f":"'Cover Sheet'!$E$23","v":"00:00:00"},2,{"$f":"'Form 2'!#REF!/'Cover Sheet'!$E$27","v":{"$error":"#REF!"}}]
["F2",2,{"$f":"'Cover Sheet'!$E$19","v":0},{"$f":"'Cover Sheet'!$E$23","v":"00:00:00"},2,{"$f":"'Form 2'!#REF!/'Cover Sheet'!$E$27","v":{"$error":"#REF!"}}]
["F2",101,{"$f":"'Cover Sheet'!$E$19","v":0},{"$f":"'Cover Sheet'!$E$23","v":"00:00:00"},3,{"$f":"'Form 2'!E11/'Cover Sheet'!$E$27","v":{"$error":"#DIV/0!"}}]
["F2",102,{"$f":"'Cover Sheet'!$E$19","v":0},{"$f":"'Cover Sheet'!$E$23","v":"00:00:00"},3,{"$f":"'Form 2'!E12/'Cover Sheet'!$E$27","v":{"$error":"#DIV/0!"}}]
["F2",103,{"$f":"'Cover Sheet'!$E$19","v":0},{"$f":"'Cover Sheet'!$E$23","v":"00:00:00"},3,{"$f":"'Form 2'!E13/'Cover Sheet'!$E$27","v":{"$error":"#DIV/0!"}}]
["F2",104,{"$f":"'Cover Sheet'!$E$19","v":0},{"$f":"'Cover Sheet'!$E$23","v":"00:00:00"},3,{"$f":"'Form 2'!E14/'Cover Sheet'!$E$27","v":{"$error":"#DIV/0!"}}]
["F2",105,{"$f":"'Cover Sheet'!$E$19","v":0},{"$f":"'Cover Sheet'!$E$23","v":"00:00:00"},3,{"$f":"'Form 2'!E15/'Cover Sheet'!$E$27","v":{"$error":"#DIV/0!"}}]
["F2",1,{"$f":"'Cover Sheet'!$E$19","v":0},{"$f":"'Cover Sheet'!$E$23","v":"00:00:00"},3,{"$f":"'Form 2'!E16/'Cover Sheet'!$E$27","v":{"$error":"#DIV/0!"}}]
["F2",201,{"$f":"'Cover Sheet'!$E$19","v":0},{"$f":"'Cover Sheet'!$E$23","v":"00:00:00"},3,{"$f":"'Form 2'!E23/'Cover Sheet'!$E$27","v":{"$error":"#DIV/0!"}}]
["F2",202,{"$f":"'Cover Sheet'!$E$19","v":0},{"$f":"'Cover Sheet'!$E$23","v":"00:00:00"},3,{"$f":"'Form 2'!E24/'Cover Sheet'!$E$27","v":{"$error":"#DIV/0!"}}]
["F2",203,{"$f":"'Cover Sheet'!$E$19","v":0},{"$f":"'Cover Sheet'!$E$23","v":"00:00:00"},3,{"$f":"'Form 2'!E25/'Cover Sheet'!$E$27","v":{"$error":"#DIV/0!"}}]
["F2",204,{"$f":"'Cover Sheet'!$E$19","v":0},{"$f":"'Cover Sheet'!$E$23","v":"00:00:00"},3,{"$f":"'Form 2'!E26/'Cover Sheet'!$E$27","v":{"$error":"#DIV/0!"}}]
["F2",205,{"$f":"'Cover Sheet'!$E$19","v":0},{"$f":"'Cover Sheet'!$E$23","v":"00:00:00"},3,{"$f":"'Form 2'!E27/'Cover Sheet'!$E$27","v":{"$error":"#DIV/0!"}}]
["F2",206,{"$f":"'Cover Sheet'!$E$19","v":0},{"$f":"'Cover Sheet'!$E$23","v":"00:00:00"},3,{"$f":"'Form 2'!E28/'Cover Sheet'!$E$27","v":{"$error":"#DIV/0!"}}]
["F2",207,{"$f":"'Cover Sheet'!$E$19","v":0},{"$f":"'Cover Sheet'!$E$23","v":"00:00:00"},3,{"$f":"'Form 2'!E29/'Cover Sheet'!$E$27","v":{"$error":"#DIV/0!"}}]
["F2",208,{"$f":"'Cover Sheet'!$E$19","v":0},{"$f":"'Cover Sheet'!$E$23","v":"00:00:00"},3,{"$f":"'Form 2'!E30/'Cover Sheet'!$E$27","v":{"$error":"#DIV/0!"}}]
["F2",2,{"$f":"'Cover Sheet'!$E$19","v":0},{"$f":"'Cover Sheet'!$E$23","v":"00:00:00"},3,{"$f":"'Form 2'!E31/'Cover Sheet'!$E$27","v":{"$error":"#DIV/0!"}}]
["F2",101,{"$f":"'Cover Sheet'!$E$19","v":0},{"$f":"'Cover Sheet'!$E$23","v":"00:00:00"},4,{"$f":"'Form 2'!#REF!/'Cover Sheet'!$E$27","v":{"$error":"#REF!"}}]
["F2",102,{"$f":"'Cover Sheet'!$E$19","v":0},{"$f":"'Cover Sheet'!$E$23","v":"00:00:00"},4,{"$f":"'Form 2'!#REF!/'Cover Sheet'!$E$27","v":{"$error":"#REF!"}}]
["F2",103,{"$f":"'Cover Sheet'!$E$19","v":0},{"$f":"'Cover Sheet'!$E$23","v":"00:00:00"},4,{"$f":"'Form 2'!#REF!/'Cover Sheet'!$E$27","v":{"$error":"#REF!"}}]
["F2",104,{"$f":"'Cover Sheet'!$E$19","v":0},{"$f":"'Cover Sheet'!$E$23","v":"00:00:00"},4,{"$f":"'Form 2'!#REF!/'Cover Sheet'!$E$27","v":{"$error":"#REF!"}}]
["F2",105,{"$f":"'Cover Sheet'!$E$19","v":0},{"$f":"'Cover Sheet'!$E$23","v":"00:00:00"},4,{"$f":"'Form 2'!#REF!/'Cover Sheet'!$E$27","v":{"$error":"#REF!"}}]
["F2",1,{"$f":"'Cover Sheet'!$E$19","v":0},{"$f":"'Cover Sheet'!$E$23","v":"00:00:00"},4,{"$f":"'Form 2'!#REF!/'Cover Sheet'!$E$27","v":{"$error":"#REF!"}}]
["F2",201,{"$f":"'Cover Sheet'!$E$19","v":0},{"$f":"'Cover Sheet'!$E$23","v":"00:00:00"},4,{"$f":"'Form 2'!#REF!/'Cover Sheet'!$E$27","v":{"$error":"#REF!"}}]
["F2",202,{"$f":"'Cover Sheet'!$E$19","v":0},{"$f":"'Cover Sheet'!$E$23","v":"00:00:00"},4,{"$f":"'Form 2'!#REF!/'Cover Sheet'!$E$27","v":{"$error":"#REF!"}}]
["F2",203,{"$f":"'Cover Sheet'!$E$19","v":0},{"$f":"'Cover Sheet'!$E$23","v":"00:00:00"},4,{"$f":"'Form 2'!#REF!/'Cover Sheet'!$E$27","v":{"$error":"#REF!"}}]
["F2",204,{"$f":"'Cover Sheet'!$E$19","v":0},{"$f":"'Cover Sheet'!$E$23","v":"00:00:00"},4,{"$f":"'Form 2'!#REF!/'Cover Sheet'!$E$27","v":{"$error":"#REF!"}}]
["F2",205,{"$f":"'Cover Sheet'!$E$19","v":0},{"$f":"'Cover Sheet'!$E$23","v":"00:00:00"},4,{"$f":"'Form 2'!#REF!/'Cover Sheet'!$E$27","v":{"$error":"#REF!"}}]
["F2",206,{"$f":"'Cover Sheet'!$E$19","v":0},{"$f":"'Cover Sheet'!$E$23","v":"00:00:00"},4,{"$f":"'Form 2'!#REF!/'Cover Sheet'!$E$27","v":{"$error":"#REF!"}}]
["F2",207,{"$f":"'Cover Sheet'!$E$19","v":0},{"$f":"'Cover Sheet'!$E$23","v":"00:00:00"},4,{"$f":"'Form 2'!#REF!/'Cover Sheet'!$E$27","v":{"$error":"#REF!"}}]
["F2",208,{"$f":"'Cover Sheet'!$E$19","v":0},{"$f":"'Cover Sheet'!$E$23","v":"00:00:00"},4,{"$f":"'Form 2'!#REF!/'Cover Sheet'!$E$27","v":{"$error":"#REF!"}}]
["F2",2,{"$f":"'Cover Sheet'!$E$19","v":0},{"$f":"'Cover Sheet'!$E$23","v":"00:00:00"},4,{"$f":"'Form 2'!#REF!/'Cover Sheet'!$E$27","v":{"$error":"#REF!"}}]
["F2",101,{"$f":"'Cover Sheet'!$E$19","v":0},{"$f":"'Cover Sheet'!$E$23","v":"00:00:00"},5,{"$f":"'Form 2'!G11/'Cover Sheet'!$E$27","v":{"$error":"#DIV/0!"}}]
["F2",102,{"$f":"'Cover Sheet'!$E$19","v":0},{"$f":"'Cover Sheet'!$E$23","v":"00:00:00"},5,{"$f":"'Form 2'!G12/'Cover Sheet'!$E$27","v":{"$error":"#DIV/0!"}}]
["F2",103,{"$f":"'Cover Sheet'!$E$19","v":0},{"$f":"'Cover Sheet'!$E$23","v":"00:00:00"},5,{"$f":"'Form 2'!G13/'Cover Sheet'!$E$27","v":{"$error":"#DIV/0!"}}]
["F2",104,{"$f":"'Cover Sheet'!$E$19","v":0},{"$f":"'Cover Sheet'!$E$23","v":"00:00:00"},5,{"$f":"'Form 2'!G14/'Cover Sheet'!$E$27","v":{"$error":"#DIV/0!"}}]
["F2",105,{"$f":"'Cover Sheet'!$E$19","v":0},{"$f":"'Cover Sheet'!$E$23","v":"00:00:00"},5,{"$f":"'Form 2'!G15/'Cover Sheet'!$E$27","v":{"$error":"#DIV/0!"}}]
["F2",1,{"$f":"'Cover Sheet'!$E$19","v":0},{"$f":"'Cover Sheet'!$E$23","v":"00:00:00"},5,{"$f":"'Form 2'!G16/'Cover Sheet'!$E$27","v":{"$error":"#DIV/0!"}}]
["F2",201,{"$f":"'Cover Sheet'!$E$19","v":0},{"$f":"'Cover Sheet'!$E$23","v":"00:00:00"},5,{"$f":"'Form 2'!G23/'Cover Sheet'!$E$27","v":{"$error":"#DIV/0!"}}]
["F2",202,{"$f":"'Cover Sheet'!$E$19","v":0},{"$f":"'Cover Sheet'!$E$23","v":"00:00:00"},5,{"$f":"'Form 2'!G24/'Cover Sheet'!$E$27","v":{"$error":"#DIV/0!"}}]
["F2",203,{"$f":"'Cover Sheet'!$E$19","v":0},{"$f":"'Cover Sheet'!$E$23","v":"00:00:00"},5,{"$f":"'Form 2'!G25/'Cover Sheet'!$E$27","v":{"$error":"#DIV/0!"}}]
["F2",204,{"$f":"'Cover Sheet'!$E$19","v":0},{"$f":"'Cover Sheet'!$E$23","v":"00:00:00"},5,{"$f":"'Form 2'!G26/'Cover Sheet'!$E$27","v":{"$error":"#DIV/0!"}}]
["F2",205,{"$f":"'Cover Sheet'!$E$19","v":0},{"$f":"'Cover Sheet'!$E$23","v":"00:00:00"},5,{"$f":"'Form 2'!G27/'Cover Sheet'!$E$27","v":{"$error":"#DIV/0!"}}]
["F2",206,{"$f":"'Cover Sheet'!$E$19","v":0},{"$f":"'Cover Sheet'!$E$23","v":"00:00:00"},5,{"$f":"'Form 2'!G28/'Cover Sheet'!$E$27","v":{"$error":"#DIV/0!"}}]
["F2",207,{"$f":"'Cover Sheet'!$E$19","v":0},{"$f":"'Cover Sheet'!$E$23","v":"00:00:00"},5,{"$f":"'Form 2'!G29/'Cover Sheet'!$E$27","v":{"$error":"#DIV/0!"}}]
["F2",208,{"$f":"'Cover Sheet'!$E$19","v":0},{"$f":"'Cover Sheet'!$E$23","v":"00:00:00"},5,{"$f":"'Form 2'!G30/'Cover Sheet'!$E$27","v":{"$error":"#DIV/0!"}}]
["F2",2,{"$f":"'Cover Sheet'!$E$19","v":0},{"$f":"'Cover Sheet'!$E$23","v":"00:00:00"},5,{"$f":"'Form 2'!G31/'Cover Sheet'!$E$27","v":{"$error":"#DIV/0!"}}]
["F2",101,{"$f":"'Cover Sheet'!$E$19","v":0},{"$f":"'Cover Sheet'!$E$23","v":"00:00:00"},6,{"$f":"'Form 2'!#REF!/'Cover Sheet'!$E$27","v":{"$error":"#REF!"}}]
["F2",102,{"$f":"'Cover Sheet'!$E$19","v":0},{"$f":"'Cover Sheet'!$E$23","v":"00:00:00"},6,{"$f":"'Form 2'!#REF!/'Cover Sheet'!$E$27","v":{"$error":"#REF!"}}]
["F2",103,{"$f":"'Cover Sheet'!$E$19","v":0},{"$f":"'Cover Sheet'!$E$23","v":"00:00:00"},6,{"$f":"'Form 2'!#REF!/'Cover Sheet'!$E$27","v":{"$error":"#REF!"}}]
["F2",104,{"$f":"'Cover Sheet'!$E$19","v":0},{"$f":"'Cover Sheet'!$E$23","v":"00:00:00"},6,{"$f":"'Form 2'!#REF!/'Cover Sheet'!$E$27","v":{"$error":"#REF!"}}]
["F2",105,{"$f":"'Cover Sheet'!$E$19","v":0},{"$f":"'Cover Sheet'!$E$23","v":"00:00:00"},6,{"$f":"'Form 2'!#REF!/'Cover Sheet'!$E$27","v":{"$error":"#REF!"}}]
["F2",1,{"$f":"'Cover Sheet'!$E$19","v":0},{"$f":"'Cover Sheet'!$E$23","v":"00:00:00"},6,{"$f":"'Form 2'!#REF!/'Cover Sheet'!$E$27","v":{"$error":"#REF!"}}]
["F2",201,{"$f":"'Cover Sheet'!$E$19","v":0},{"$f":"'Cover Sheet'!$E$23","v":"00:00:00"},6,{"$f":"'Form 2'!#REF!/'Cover Sheet'!$E$27","v":{"$error":"#REF!"}}]
["F2",202,{"$f":"'Cover Sheet'!$E$19","v":0},{"$f":"'Cover Sheet'!$E$23","v":"00:00:00"},6,{"$f":"'Form 2'!#REF!/'Cover Sheet'!$E$27","v":{"$error":"#REF!"}}]
["F2",203,{"$f":"'Cover Sheet'!$E$19","v":0},{"$f":"'Cover Sheet'!$E$23","v":"00:00:00"},6,{"$f":"'Form 2'!#REF!/'Cover Sheet'!$E$27","v":{"$error":"#REF!"}}]
["F2",204,{"$f":"'Cover Sheet'!$E$19","v":0},{"$f":"'Cover Sheet'!$E$23","v":"00:00:00"},6,{"$f":"'Form 2'!#REF!/'Cover Sheet'!$E$27","v":{"$error":"#REF!"}}]
["F2",205,{"$f":"'Cover Sheet'!$E$19","v":0},{"$f":"'Cover Sheet'!$E$23","v":"00:00:00"},6,{"$f":"'Form 2'!#REF!/'Cover Sheet'!$E$27","v":{"$error":"#REF!"}}]
["F2",206,{"$f":"'Cover Sheet'!$E$19","v":0},{"$f":"'Cover Sheet'!$E$23","v":"00:00:00"},6,{"$f":"'Form 2'!#REF!/'Cover Sheet'!$E$27","v":{"$error":"#REF!"}}]
["F2",207,{"$f":"'Cover Sheet'!$E$19","v":0},{"$f":"'Cover Sheet'!$E$23","v":"00:00:00"},6,{"$f":"'Form 2'!#REF!/'Cover Sheet'!$E$27","v":{"$error":"#REF!"}}]
["F2",208,{"$f":"'Cover Sheet'!$E$19","v":0},{"$f":"'Cover Sheet'!$E$23","v":"00:00:00"},6,{"$f":"'Form 2'!#REF!/'Cover Sheet'!$E$27","v":{"$error":"#REF!"}}]
["F2",2,{"$f":"'Cover Sheet'!$E$19","v":0},{"$f":"'Cover Sheet'!$E$23","v":"00:00:00"},6,{"$f":"'Form 2'!#REF!/'Cover Sheet'!$E$27","v":{"$error":"#REF!"}}]
["F2",101,{"$f":"'Cover Sheet'!$E$19","v":0},{"$f":"'Cover Sheet'!$E$23","v":"00:00:00"},7,{"$f":"'Form 2'!I11","v":0}]
["F2",102,{"$f":"'Cover Sheet'!$E$19","v":0},{"$f":"'Cover Sheet'!$E$23","v":"00:00:00"},7,{"$f":"'Form 2'!I12","v":0}]
["F2",103,{"$f":"'Cover Sheet'!$E$19","v":0},{"$f":"'Cover Sheet'!$E$23","v":"00:00:00"},7,{"$f":"'Form 2'!I13","v":0}]
["F2",104,{"$f":"'Cover Sheet'!$E$19","v":0},{"$f":"'Cover Sheet'!$E$23","v":"00:00:00"},7,{"$f":"'Form 2'!I14","v":0}]
["F2",105,{"$f":"'Cover Sheet'!$E$19","v":0},{"$f":"'Cover Sheet'!$E$23","v":"00:00:00"},7,{"$f":"'Form 2'!I15","v":0}]
["F2",1,{"$f":"'Cover Sheet'!$E$19","v":0},{"$f":"'Cover Sheet'!$E$23","v":"00:00:00"},7,{"$f":"'Form 2'!I16","v":0}]
["F2",201,{"$f":"'Cover Sheet'!$E$19","v":0},{"$f":"'Cover Sheet'!$E$23","v":"00:00:00"},7,{"$f":"'Form 2'!I23","v":0}]
["F2",202,{"$f":"'Cover Sheet'!$E$19","v":0},{"$f":"'Cover Sheet'!$E$23","v":"00:00:00"},7,{"$f":"'Form 2'!I24","v":0}]
["F2",203,{"$f":"'Cover Sheet'!$E$19","v":0},{"$f":"'Cover Sheet'!$E$23","v":"00:00:00"},7,{"$f":"'Form 2'!I25","v":0}]
["F2",204,{"$f":"'Cover Sheet'!$E$19","v":0},{"$f":"'Cover Sheet'!$E$23","v":"00:00:00"},7,{"$f":"'Form 2'!I26","v":0}]
["F2",205,{"$f":"'Cover Sheet'!$E$19","v":0},{"$f":"'Cover Sheet'!$E$23","v":"00:00:00"},7,{"$f":"'Form 2'!I27","v":0}]
["F2",206,{"$f":"'Cover Sheet'!$E$19","v":0},{"$f":"'Cover Sheet'!$E$23","v":"00:00:00"},7,{"$f":"'Form 2'!I28","v":0}]
["F2",207,{"$f":"'Cover Sheet'!$E$19","v":0},{"$f":"'Cover Sheet'!$E$23","v":"00:00:00"},7,{"$f":"'Form 2'!I29","v":0}]
["F2",208,{"$f":"'Cover Sheet'!$E$19","v":0},{"$f":"'Cover Sheet'!$E$23","v":"00:00:00"},7,{"$f":"'Form 2'!I30","v":0}]
["F2",2,{"$f":"'Cover Sheet'!$E$19","v":0},{"$f":"'Cover Sheet'!$E$23","v":"00:00:00"},7,{"$f":"'Form 2'!I31","v":0}]

{"sheet":"Form 3","index":8,"n_rows":35,"n_cols":11,"rows_kept":35,"cut":false,"hidden":false,"merged":[[7,10,7,11],[0,2,0,4],[33,0,33,1],[7,2,7,3],[7,4,7,5],[7,6,7,7],[19,2,19,3],[19,4,19,5],[19,6,19,7],[19,10,19,11],[8,8,9,8],[20,8,21,8]]}
["Name of Insurance Intermediary:-",null,{"$f":"'Cover Sheet'!E17","v":0},null,null,null,{"$f":"IF('Cover Sheet'!$E$23=\"\",\"\",'Cover Sheet'!$E$23)","v":""}]
[]
["Form 3"]
["Reinsurance Premiums and Commissions in relation to commitments where Malta is the country of commitment and risks situated in Malta "]
[]
["Long Term Business"]
["Gross reinsurance premiums written and commissions received or receivable in respect thereof"]
["No","Class","Authorised Undertakings",null,"Unauthorised Undertakings ",null,"Total",null,"Total"]
[null,null,"Premiums","Commissions","Premiums","Commissions","Premiums","Commissions","Number of policies"]
[null,null,"EUR","EUR","EUR","EUR","EUR","EUR"]
["I"," Life and Annuity",null,null,null,null,{"$f":"C11+E11","v":0},0,null,null,101]
["II"," Marriage and Birth",null,null,null,null,0,0,null,null,102]
["III"," Linked Long Term ",null,null,null,null,0,0,null,null,103]
["IV"," Permanent Health",null,null,null,null,0,0,null,null,104]
[null," Other Classes 1",null,null,null,null,{"$f":"A15+C15+E15","v":0},{"$f":"D15+F15","v":0},null,null,105]
[null,"TOTAL PREMIUMS AND COMMISSION",{"$f":"SUM(C11:C15)","v":0},0,0,0,0,0,0,null,1]
[]
["General Business"]
["Gross reinsurance premiums written and commissions received or receivable in respect thereof"]
["No","Class","Authorised Undertakings",null,"Unauthorised Undertakings ",null,"Total",null,"Total"]
[null,null,"Premiums","Commissions","Premiums","Commissions","Premiums","Commissions","Number of policies"]
[null,null,"EUR","EUR","EUR","EUR","EUR","EUR"]
[1," Accident & Health",null,null,null,null,{"$f":"C23+E23","v":0},0,null,null,201]
[2," Motor",null,null,null,null,0,0,null,null,202]
[3," Marine & Transport",null,null,null,null,0,0,null,null,203]
[4," Aviation",100000,50000,null,null,100000,50000,null,null,204]
[5," Fire & Other Damage to Property",null,null,null,null,0,0,null,null,205]
[6," Liability",null,null,null,null,0,0,null,null,206]
[7," Credit and Suretyship",null,null,null,null,0,0,null,null,207]
[8," General",null,null,null,null,0,0,null,null,208]
[null,"TOTAL PREMIUMS AND COMMISSION",{"$f":"SUM(C23:C30)","v":100000},50000,0,0,100000,50000,0,null,2]
[]
[]
["Notes"]
[1,"Other Classes refer to classes V to IX found in the Second Schedule of the Insurance Business Act"]

{"sheet":"F3","index":9,"n_rows":106,"n_cols":6,"rows_kept":106,"cut":false,"hidden":true,"merged":[]}
["SheetCode","FieldCode","FICode","Date","ColNum","Value"]
["F3",101,{"$f":"'Cover Sheet'!$E$19","v":0},{"$f":"'Cover Sheet'!$E$23","v":"00:00:00"},1,{"$f":"'Form 3'!C11/'Cover Sheet'!$E$27","v":{"$error":"#DIV/0!"}}]
["F3",102,{"$f":"'Cover Sheet'!$E$19","v":0},{"$f":"'Cover Sheet'!$E$23","v":"00:00:00"},1,{"$f":"'Form 3'!C12/'Cover Sheet'!$E$27","v":{"$error":"#DIV/0!"}}]
["F3",103,{"$f":"'Cover Sheet'!$E$19","v":0},{"$f":"'Cover Sheet'!$E$23","v":"00:00:00"},1,{"$f":"'Form 3'!C13/'Cover Sheet'!$E$27","v":{"$error":"#DIV/0!"}}]
["F3",104,{"$f":"'Cover Sheet'!$E$19","v":0},{"$f":"'Cover Sheet'!$E$23","v":"00:00:00"},1,{"$f":"'Form 3'!C14/'Cover Sheet'!$E$27","v":{"$error":"#DIV/0!"}}]
["F3",105,{"$f":"'Cover Sheet'!$E$19","v":0},{"$f":"'Cover Sheet'!$E$23","v":"00:00:00"},1,{"$f":"'Form 3'!C15/'Cover Sheet'!$E$27","v":{"$error":"#DIV/0!"}}]
["F3",1,{"$f":"'Cover Sheet'!$E$19","v":0},{"$f":"'Cover Sheet'!$E$23","v":"00:00:00"},1,{"$f":"'Form 3'!C16/'Cover Sheet'!$E$27","v":{"$error":"#DIV/0!"}}]
["F3",201,{"$f":"'Cover Sheet'!$E$19","v":0},{"$f":"'Cover Sheet'!$E$23","v":"00:00:00"},1,{"$f":"'Form 3'!C23/'Cover Sheet'!$E$27","v":{"$error":"#DIV/0!"}}]
["F3",202,{"$f":"'Cover Sheet'!$E$19","v":0},{"$f":"'Cover Sheet'!$E$23","v":"00:00:00"},1,{"$f":"'Form 3'!C24/'Cover Sheet'!$E$27","v":{"$error":"#DIV/0!"}}]
["F3",203,{"$f":"'Cover Sheet'!$E$19","v":0},{"$f":"'Cover Sheet'!$E$23","v":"00:00:00"},1,{"$f":"'Form 3'!C25/'Cover Sheet'!$E$27","v":{"$error":"#DIV/0!"}}]
["F3",204,{"$f":"'Cover Sheet'!$E$19","v":0},{"$f":"'Cover Sheet'!$E$23","v":"00:00:00"},1,{"$f":"'Form 3'!C26/'Cover Sheet'!$E$27","v":{"$error":"#DIV/0!"}}]
["F3",205,{"$f":"'Cover Sheet'!$E$19","v":0},{"$f":"'Cover Sheet'!$E$23","v":"00:00:00"},1,{"$f":"'Form 3'!C27/'Cover Sheet'!$E$27","v":{"$error":"#DIV/0!"}}]
["F3",206,{"$f":"'Cover Sheet'!$E$19","v":0},{"$f":"'Cover Sheet'!$E$23","v":"00:00:00"},1,{"$f":"'Form 3'!C28/'Cover Sheet'!$E$27","v":{"$error":"#DIV/0!"}}]
["F3",207,{"$f":"'Cover Sheet'!$E$19","v":0},{"$f":"'Cover Sheet'!$E$23","v":"00:00:00"},1,{"$f":"'Form 3'!C29/'Cover Sheet'!$E$27","v":{"$error":"#DIV/0!"}}]
["F3",208,{"$f":"'Cover Sheet'!$E$19","v":0},{"$f":"'Cover Sheet'!$E$23","v":"00:00:00"},1,{"$f":"'Form 3'!C30/'Cover Sheet'!$E$27","v":{"$error":"#DIV/0!"}}]
["F3",2,{"$f":"'Cover Sheet'!$E$19","v":0},{"$f":"'Cover Sheet'!$E$23","v":"00:00:00"},1,{"$f":"'Form 3'!C31/'Cover Sheet'!$E$27","v":{"$error":"#DIV/0!"}}]
["F3",101,{"$f":"'Cover Sheet'!$E$19","v":0},{"$f":"'Cover Sheet'!$E$23","v":"00:00:00"},2,{"$f":"'Form 3'!#REF!/'Cover Sheet'!$E$27","v":{"$error":"#REF!"}}]
["F3",102,{"$f":"'Cover Sheet'!$E$19","v":0},{"$f":"'Cover Sheet'!$E$23","v":"00:00:00"},2,{"$f":"'Form 3'!#REF!/'Cover Sheet'!$E$27","v":{"$error":"#REF!"}}]
["F3",103,{"$f":"'Cover Sheet'!$E$19","v":0},{"$f":"'Cover Sheet'!$E$23","v":"00:00:00"},2,{"$f":"'Form 3'!#REF!/'Cover Sheet'!$E$27","v":{"$error":"#REF!"}}]
["F3",104,{"$f":"'Cover Sheet'!$E$19","v":0},{"$f":"'Cover Sheet'!$E$23","v":"00:00:00"},2,{"$f":"'Form 3'!#REF!/'Cover Sheet'!$E$27","v":{"$error":"#REF!"}}]
["F3",105,{"$f":"'Cover Sheet'!$E$19","v":0},{"$f":"'Cover Sheet'!$E$23","v":"00:00:00"},2,{"$f":"'Form 3'!#REF!/'Cover Sheet'!$E$27","v":{"$error":"#REF!"}}]
["F3",1,{"$f":"'Cover Sheet'!$E$19","v":0},{"$f":"'Cover Sheet'!$E$23","v":"00:00:00"},2,{"$f":"'Form 3'!#REF!/'Cover Sheet'!$E$27","v":{"$error":"#REF!"}}]
["F3",201,{"$f":"'Cover Sheet'!$E$19","v":0},{"$f":"'Cover Sheet'!$E$23","v":"00:00:00"},2,{"$f":"'Form 3'!#REF!/'Cover Sheet'!$E$27","v":{"$error":"#REF!"}}]
["F3",202,{"$f":"'Cover Sheet'!$E$19","v":0},{"$f":"'Cover Sheet'!$E$23","v":"00:00:00"},2,{"$f":"'Form 3'!#REF!/'Cover Sheet'!$E$27","v":{"$error":"#REF!"}}]
["F3",203,{"$f":"'Cover Sheet'!$E$19","v":0},{"$f":"'Cover Sheet'!$E$23","v":"00:00:00"},2,{"$f":"'Form 3'!#REF!/'Cover Sheet'!$E$27","v":{"$error":"#REF!"}}]
["F3",204,{"$f":"'Cover Sheet'!$E$19","v":0},{"$f":"'Cover Sheet'!$E$23","v":"00:00:00"},2,{"$f":"'Form 3'!#REF!/'Cover Sheet'!$E$27","v":{"$error":"#REF!"}}]
["F3",205,{"$f":"'Cover Sheet'!$E$19","v":0},{"$f":"'Cover Sheet'!$E$23","v":"00:00:00"},2,{"$f":"'Form 3'!#REF!/'Cover Sheet'!$E$27","v":{"$error":"#REF!"}}]
["F3",206,{"$f":"'Cover Sheet'!$E$19","v":0},{"$f":"'Cover Sheet'!$E$23","v":"00:00:00"},2,{"$f":"'Form 3'!#REF!/'Cover Sheet'!$E$27","v":{"$error":"#REF!"}}]
["F3",207,{"$f":"'Cover Sheet'!$E$19","v":0},{"$f":"'Cover Sheet'!$E$23","v":"00:00:00"},2,{"$f":"'Form 3'!#REF!/'Cover Sheet'!$E$27","v":{"$error":"#REF!"}}]
["F3",208,{"$f":"'Cover Sheet'!$E$19","v":0},{"$f":"'Cover Sheet'!$E$23","v":"00:00:00"},2,{"$f":"'Form 3'!#REF!/'Cover Sheet'!$E$27","v":{"$error":"#REF!"}}]
["F3",2,{"$f":"'Cover Sheet'!$E$19","v":0},{"$f":"'Cover Sheet'!$E$23","v":"00:00:00"},2,{"$f":"'Form 3'!#REF!/'Cover Sheet'!$E$27","v":{"$error":"#REF!"}}]
["F3",101,{"$f":"'Cover Sheet'!$E$19","v":0},{"$f":"'Cover Sheet'!$E$23","v":"00:00:00"},3,{"$f":"'Form 3'!E11/'Cover Sheet'!$E$27","v":{"$error":"#DIV/0!"}}]
["F3",102,{"$f":"'Cover Sheet'!$E$19","v":0},{"$f":"'Cover Sheet'!$E$23","v":"00:00:00"},3,{"$f":"'Form 3'!E12/'Cover Sheet'!$E$27","v":{"$error":"#DIV/0!"}}]
["F3",103,{"$f":"'Cover Sheet'!$E$19","v":0},{"$f":"'Cover Sheet'!$E$23","v":"00:00:00"},3,{"$f":"'Form 3'!E13/'Cover Sheet'!$E$27","v":{"$error":"#DIV/0!"}}]
["F3",104,{"$f":"'Cover Sheet'!$E$19","v":0},{"$f":"'Cover Sheet'!$E$23","v":"00:00:00"},3,{"$f":"'Form 3'!E14/'Cover Sheet'!$E$27","v":{"$error":"#DIV/0!"}}]
["F3",105,{"$f":"'Cover Sheet'!$E$19","v":0},{"$f":"'Cover Sheet'!$E$23","v":"00:00:00"},3,{"$f":"'Form 3'!E15/'Cover Sheet'!$E$27","v":{"$error":"#DIV/0!"}}]
["F3",1,{"$f":"'Cover Sheet'!$E$19","v":0},{"$f":"'Cover Sheet'!$E$23","v":"00:00:00"},3,{"$f":"'Form 3'!E16/'Cover Sheet'!$E$27","v":{"$error":"#DIV/0!"}}]
["F3",201,{"$f":"'Cover Sheet'!$E$19","v":0},{"$f":"'Cover Sheet'!$E$23","v":"00:00:00"},3,{"$f":"'Form 3'!E23/'Cover Sheet'!$E$27","v":{"$error":"#DIV/0!"}}]
["F3",202,{"$f":"'Cover Sheet'!$E$19","v":0},{"$f":"'Cover Sheet'!$E$23","v":"00:00:00"},3,{"$f":"'Form 3'!E24/'Cover Sheet'!$E$27","v":{"$error":"#DIV/0!"}}]
["F3",203,{"$f":"'Cover Sheet'!$E$19","v":0},{"$f":"'Cover Sheet'!$E$23","v":"00:00:00"},3,{"$f":"'Form 3'!E25/'Cover Sheet'!$E$27","v":{"$error":"#DIV/0!"}}]
["F3",204,{"$f":"'Cover Sheet'!$E$19","v":0},{"$f":"'Cover Sheet'!$E$23","v":"00:00:00"},3,{"$f":"'Form 3'!E26/'Cover Sheet'!$E$27","v":{"$error":"#DIV/0!"}}]
["F3",205,{"$f":"'Cover Sheet'!$E$19","v":0},{"$f":"'Cover Sheet'!$E$23","v":"00:00:00"},3,{"$f":"'Form 3'!E27/'Cover Sheet'!$E$27","v":{"$error":"#DIV/0!"}}]
["F3",206,{"$f":"'Cover Sheet'!$E$19","v":0},{"$f":"'Cover Sheet'!$E$23","v":"00:00:00"},3,{"$f":"'Form 3'!E28/'Cover Sheet'!$E$27","v":{"$error":"#DIV/0!"}}]
["F3",207,{"$f":"'Cover Sheet'!$E$19","v":0},{"$f":"'Cover Sheet'!$E$23","v":"00:00:00"},3,{"$f":"'Form 3'!E29/'Cover Sheet'!$E$27","v":{"$error":"#DIV/0!"}}]
["F3",208,{"$f":"'Cover Sheet'!$E$19","v":0},{"$f":"'Cover Sheet'!$E$23","v":"00:00:00"},3,{"$f":"'Form 3'!E30/'Cover Sheet'!$E$27","v":{"$error":"#DIV/0!"}}]
["F3",2,{"$f":"'Cover Sheet'!$E$19","v":0},{"$f":"'Cover Sheet'!$E$23","v":"00:00:00"},3,{"$f":"'Form 3'!E31/'Cover Sheet'!$E$27","v":{"$error":"#DIV/0!"}}]
["F3",101,{"$f":"'Cover Sheet'!$E$19","v":0},{"$f":"'Cover Sheet'!$E$23","v":"00:00:00"},4,{"$f":"'Form 3'!#REF!/'Cover Sheet'!$E$27","v":{"$error":"#REF!"}}]
["F3",102,{"$f":"'Cover Sheet'!$E$19","v":0},{"$f":"'Cover Sheet'!$E$23","v":"00:00:00"},4,{"$f":"'Form 3'!#REF!/'Cover Sheet'!$E$27","v":{"$error":"#REF!"}}]
["F3",103,{"$f":"'Cover Sheet'!$E$19","v":0},{"$f":"'Cover Sheet'!$E$23","v":"00:00:00"},4,{"$f":"'Form 3'!#REF!/'Cover Sheet'!$E$27","v":{"$error":"#REF!"}}]
["F3",104,{"$f":"'Cover Sheet'!$E$19","v":0},{"$f":"'Cover Sheet'!$E$23","v":"00:00:00"},4,{"$f":"'Form 3'!#REF!/'Cover Sheet'!$E$27","v":{"$error":"#REF!"}}]
["F3",105,{"$f":"'Cover Sheet'!$E$19","v":0},{"$f":"'Cover Sheet'!$E$23","v":"00:00:00"},4,{"$f":"'Form 3'!#REF!/'Cover Sheet'!$E$27","v":{"$error":"#REF!"}}]
["F3",1,{"$f":"'Cover Sheet'!$E$19","v":0},{"$f":"'Cover Sheet'!$E$23","v":"00:00:00"},4,{"$f":"'Form 3'!#REF!/'Cover Sheet'!$E$27","v":{"$error":"#REF!"}}]
["F3",201,{"$f":"'Cover Sheet'!$E$19","v":0},{"$f":"'Cover Sheet'!$E$23","v":"00:00:00"},4,{"$f":"'Form 3'!#REF!/'Cover Sheet'!$E$27","v":{"$error":"#REF!"}}]
["F3",202,{"$f":"'Cover Sheet'!$E$19","v":0},{"$f":"'Cover Sheet'!$E$23","v":"00:00:00"},4,{"$f":"'Form 3'!#REF!/'Cover Sheet'!$E$27","v":{"$error":"#REF!"}}]
["F3",203,{"$f":"'Cover Sheet'!$E$19","v":0},{"$f":"'Cover Sheet'!$E$23","v":"00:00:00"},4,{"$f":"'Form 3'!#REF!/'Cover Sheet'!$E$27","v":{"$error":"#REF!"}}]
["F3",204,{"$f":"'Cover Sheet'!$E$19","v":0},{"$f":"'Cover Sheet'!$E$23","v":"00:00:00"},4,{"$f":"'Form 3'!#REF!/'Cover Sheet'!$E$27","v":{"$error":"#REF!"}}]
["F3",205,{"$f":"'Cover Sheet'!$E$19","v":0},{"$f":"'Cover Sheet'!$E$23","v":"00:00:00"},4,{"$f":"'Form 3'!#REF!/'Cover Sheet'!$E$27","v":{"$error":"#REF!"}}]
["F3",206,{"$f":"'Cover Sheet'!$E$19","v":0},{"$f":"'Cover Sheet'!$E$23","v":"00:00:00"},4,{"$f":"'Form 3'!#REF!/'Cover Sheet'!$E$27","v":{"$error":"#REF!"}}]
["F3",207,{"$f":"'Cover Sheet'!$E$19","v":0},{"$f":"'Cover Sheet'!$E$23","v":"00:00:00"},4,{"$f":"'Form 3'!#REF!/'Cover Sheet'!$E$27","v":{"$error":"#REF!"}}]
["F3",208,{"$f":"'Cover Sheet'!$E$19","v":0},{"$f":"'Cover Sheet'!$E$23","v":"00:00:00"},4,{"$f":"'Form 3'!#REF!/'Cover Sheet'!$E$27","v":{"$error":"#REF!"}}]
["F3",2,{"$f":"'Cover Sheet'!$E$19","v":0},{"$f":"'Cover Sheet'!$E$23","v":"00:00:00"},4,{"$f":"'Form 3'!#REF!/'Cover Sheet'!$E$27","v":{"$error":"#REF!"}}]
["F3",101,{"$f":"'Cover Sheet'!$E$19","v":0},{"$f":"'Cover Sheet'!$E$23","v":"00:00:00"},5,{"$f":"'Form 3'!G11/'Cover Sheet'!$E$27","v":{"$error":"#DIV/0!"}}]
["F3",102,{"$f":"'Cover Sheet'!$E$19","v":0},{"$f":"'Cover Sheet'!$E$23","v":"00:00:00"},5,{"$f":"'Form 3'!G12/'Cover Sheet'!$E$27","v":{"$error":"#DIV/0!"}}]
["F3",103,{"$f":"'Cover Sheet'!$E$19","v":0},{"$f":"'Cover Sheet'!$E$23","v":"00:00:00"},5,{"$f":"'Form 3'!G13/'Cover Sheet'!$E$27","v":{"$error":"#DIV/0!"}}]
["F3",104,{"$f":"'Cover Sheet'!$E$19","v":0},{"$f":"'Cover Sheet'!$E$23","v":"00:00:00"},5,{"$f":"'Form 3'!G14/'Cover Sheet'!$E$27","v":{"$error":"#DIV/0!"}}]
["F3",105,{"$f":"'Cover Sheet'!$E$19","v":0},{"$f":"'Cover Sheet'!$E$23","v":"00:00:00"},5,{"$f":"'Form 3'!G15/'Cover Sheet'!$E$27","v":{"$error":"#DIV/0!"}}]
["F3",1,{"$f":"'Cover Sheet'!$E$19","v":0},{"$f":"'Cover Sheet'!$E$23","v":"00:00:00"},5,{"$f":"'Form 3'!G16/'Cover Sheet'!$E$27","v":{"$error":"#DIV/0!"}}]
["F3",201,{"$f":"'Cover Sheet'!$E$19","v":0},{"$f":"'Cover Sheet'!$E$23","v":"00:00:00"},5,{"$f":"'Form 3'!G23/'Cover Sheet'!$E$27","v":{"$error":"#DIV/0!"}}]
["F3",202,{"$f":"'Cover Sheet'!$E$19","v":0},{"$f":"'Cover Sheet'!$E$23","v":"00:00:00"},5,{"$f":"'Form 3'!G24/'Cover Sheet'!$E$27","v":{"$error":"#DIV/0!"}}]
["F3",203,{"$f":"'Cover Sheet'!$E$19","v":0},{"$f":"'Cover Sheet'!$E$23","v":"00:00:00"},5,{"$f":"'Form 3'!G25/'Cover Sheet'!$E$27","v":{"$error":"#DIV/0!"}}]
["F3",204,{"$f":"'Cover Sheet'!$E$19","v":0},{"$f":"'Cover Sheet'!$E$23","v":"00:00:00"},5,{"$f":"'Form 3'!G26/'Cover Sheet'!$E$27","v":{"$error":"#DIV/0!"}}]
["F3",205,{"$f":"'Cover Sheet'!$E$19","v":0},{"$f":"'Cover Sheet'!$E$23","v":"00:00:00"},5,{"$f":"'Form 3'!G27/'Cover Sheet'!$E$27","v":{"$error":"#DIV/0!"}}]
["F3",206,{"$f":"'Cover Sheet'!$E$19","v":0},{"$f":"'Cover Sheet'!$E$23","v":"00:00:00"},5,{"$f":"'Form 3'!G28/'Cover Sheet'!$E$27","v":{"$error":"#DIV/0!"}}]
["F3",207,{"$f":"'Cover Sheet'!$E$19","v":0},{"$f":"'Cover Sheet'!$E$23","v":"00:00:00"},5,{"$f":"'Form 3'!G29/'Cover Sheet'!$E$27","v":{"$error":"#DIV/0!"}}]
["F3",208,{"$f":"'Cover Sheet'!$E$19","v":0},{"$f":"'Cover Sheet'!$E$23","v":"00:00:00"},5,{"$f":"'Form 3'!G30/'Cover Sheet'!$E$27","v":{"$error":"#DIV/0!"}}]
["F3",2,{"$f":"'Cover Sheet'!$E$19","v":0},{"$f":"'Cover Sheet'!$E$23","v":"00:00:00"},5,{"$f":"'Form 3'!G31/'Cover Sheet'!$E$27","v":{"$error":"#DIV/0!"}}]
["F3",101,{"$f":"'Cover Sheet'!$E$19","v":0},{"$f":"'Cover Sheet'!$E$23","v":"00:00:00"},6,{"$f":"'Form 3'!#REF!/'Cover Sheet'!$E$27","v":{"$error":"#REF!"}}]
["F3",102,{"$f":"'Cover Sheet'!$E$19","v":0},{"$f":"'Cover Sheet'!$E$23","v":"00:00:00"},6,{"$f":"'Form 3'!#REF!/'Cover Sheet'!$E$27","v":{"$error":"#REF!"}}]
["F3",103,{"$f":"'Cover Sheet'!$E$19","v":0},{"$f":"'Cover Sheet'!$E$23","v":"00:00:00"},6,{"$f":"'Form 3'!#REF!/'Cover Sheet'!$E$27","v":{"$error":"#REF!"}}]
["F3",104,{"$f":"'Cover Sheet'!$E$19","v":0},{"$f":"'Cover Sheet'!$E$23","v":"00:00:00"},6,{"$f":"'Form 3'!#REF!/'Cover Sheet'!$E$27","v":{"$error":"#REF!"}}]
["F3",105,{"$f":"'Cover Sheet'!$E$19","v":0},{"$f":"'Cover Sheet'!$E$23","v":"00:00:00"},6,{"$f":"'Form 3'!#REF!/'Cover Sheet'!$E$27","v":{"$error":"#REF!"}}]
["F3",1,{"$f":"'Cover Sheet'!$E$19","v":0},{"$f":"'Cover Sheet'!$E$23","v":"00:00:00"},6,{"$f":"'Form 3'!#REF!/'Cover Sheet'!$E$27","v":{"$error":"#REF!"}}]
["F3",201,{"$f":"'Cover Sheet'!$E$19","v":0},{"$f":"'Cover Sheet'!$E$23","v":"00:00:00"},6,{"$f":"'Form 3'!#REF!/'Cover Sheet'!$E$27","v":{"$error":"#REF!"}}]
["F3",202,{"$f":"'Cover Sheet'!$E$19","v":0},{"$f":"'Cover Sheet'!$E$23","v":"00:00:00"},6,{"$f":"'Form 3'!#REF!/'Cover Sheet'!$E$27","v":{"$error":"#REF!"}}]
["F3",203,{"$f":"'Cover Sheet'!$E$19","v":0},{"$f":"'Cover Sheet'!$E$23","v":"00:00:00"},6,{"$f":"'Form 3'!#REF!/'Cover Sheet'!$E$27","v":{"$error":"#REF!"}}]
["F3",204,{"$f":"'Cover Sheet'!$E$19","v":0},{"$f":"'Cover Sheet'!$E$23","v":"00:00:00"},6,{"$f":"'Form 3'!#REF!/'Cover Sheet'!$E$27","v":{"$error":"#REF!"}}]
["F3",205,{"$f":"'Cover Sheet'!$E$19","v":0},{"$f":"'Cover Sheet'!$E$23","v":"00:00:00"},6,{"$f":"'Form 3'!#REF!/'Cover Sheet'!$E$27","v":{"$error":"#REF!"}}]
["F3",206,{"$f":"'Cover Sheet'!$E$19","v":0},{"$f":"'Cover Sheet'!$E$23","v":"00:00:00"},6,{"$f":"'Form 3'!#REF!/'Cover Sheet'!$E$27","v":{"$error":"#REF!"}}]
["F3",207,{"$f":"'Cover Sheet'!$E$19","v":0},{"$f":"'Cover Sheet'!$E$23","v":"00:00:00"},6,{"$f":"'Form 3'!#REF!/'Cover Sheet'!$E$27","v":{"$error":"#REF!"}}]
["F3",208,{"$f":"'Cover Sheet'!$E$19","v":0},{"$f":"'Cover Sheet'!$E$23","v":"00:00:00"},6,{"$f":"'Form 3'!#REF!/'Cover Sheet'!$E$27","v":{"$error":"#REF!"}}]
["F3",2,{"$f":"'Cover Sheet'!$E$19","v":0},{"$f":"'Cover Sheet'!$E$23","v":"00:00:00"},6,{"$f":"'Form 3'!#REF!/'Cover Sheet'!$E$27","v":{"$error":"#REF!"}}]
["F3",101,{"$f":"'Cover Sheet'!$E$19","v":0},{"$f":"'Cover Sheet'!$E$23","v":"00:00:00"},7,{"$f":"'Form 3'!I11","v":0}]
["F3",102,{"$f":"'Cover Sheet'!$E$19","v":0},{"$f":"'Cover Sheet'!$E$23","v":"00:00:00"},7,{"$f":"'Form 3'!I12","v":0}]
["F3",103,{"$f":"'Cover Sheet'!$E$19","v":0},{"$f":"'Cover Sheet'!$E$23","v":"00:00:00"},7,{"$f":"'Form 3'!I13","v":0}]
["F3",104,{"$f":"'Cover Sheet'!$E$19","v":0},{"$f":"'Cover Sheet'!$E$23","v":"00:00:00"},7,{"$f":"'Form 3'!I14","v":0}]
["F3",105,{"$f":"'Cover Sheet'!$E$19","v":0},{"$f":"'Cover Sheet'!$E$23","v":"00:00:00"},7,{"$f":"'Form 3'!I15","v":0}]
["F3",1,{"$f":"'Cover Sheet'!$E$19","v":0},{"$f":"'Cover Sheet'!$E$23","v":"00:00:00"},7,{"$f":"'Form 3'!I16","v":0}]
["F3",201,{"$f":"'Cover Sheet'!$E$19","v":0},{"$f":"'Cover Sheet'!$E$23","v":"00:00:00"},7,{"$f":"'Form 3'!I23","v":0}]
["F3",202,{"$f":"'Cover Sheet'!$E$19","v":0},{"$f":"'Cover Sheet'!$E$23","v":"00:00:00"},7,{"$f":"'Form 3'!I24","v":0}]
["F3",203,{"$f":"'Cover Sheet'!$E$19","v":0},{"$f":"'Cover Sheet'!$E$23","v":"00:00:00"},7,{"$f":"'Form 3'!I25","v":0}]
["F3",204,{"$f":"'Cover Sheet'!$E$19","v":0},{"$f":"'Cover Sheet'!$E$23","v":"00:00:00"},7,{"$f":"'Form 3'!I26","v":0}]
["F3",205,{"$f":"'Cover Sheet'!$E$19","v":0},{"$f":"'Cover Sheet'!$E$23","v":"00:00:00"},7,{"$f":"'Form 3'!I27","v":0}]
["F3",206,{"$f":"'Cover Sheet'!$E$19","v":0},{"$f":"'Cover Sheet'!$E$23","v":"00:00:00"},7,{"$f":"'Form 3'!I28","v":0}]
["F3",207,{"$f":"'Cover Sheet'!$E$19","v":0},{"$f":"'Cover Sheet'!$E$23","v":"00:00:00"},7,{"$f":"'Form 3'!I29","v":0}]
["F3",208,{"$f":"'Cover Sheet'!$E$19","v":0},{"$f":"'Cover Sheet'!$E$23","v":"00:00:00"},7,{"$f":"'Form 3'!I30","v":0}]
["F3",2,{"$f":"'Cover Sheet'!$E$19","v":0},{"$f":"'Cover Sheet'!$E$23","v":"00:00:00"},7,{"$f":"'Form 3'!I31","v":0}]

{"sheet":"Form 4","index":10,"n_rows":35,"n_cols":9,"rows_kept":35,"cut":false,"hidden":false,"merged":[[19,10,19,11],[3,0,3,7],[0,2,0,4],[7,4,7,5],[7,6,7,7],[7,10,7,11],[7,2,7,3],[8,8,9,8],[20,8,21,8],[33,0,33,1],[19,2,19,3],[19,4,19,5],[19,6,19,7]]}
["Name of Insurance Intermediary:-",null,{"$f":"'Form 1'!C1","v":0},null,null,null,{"$f":"IF('Cover Sheet'!$E$23=\"\",\"\",'Cover Sheet'!$E$23)","v":""}]
[]
["Form 4"]
["Reinsurance Premiums and Commissions in relation to commitments where Malta is not the country of commitment and risks situated outside Malta"]
[]
["Long Term Business"]
["Gross reinsurance premiums written and commissions received or receivable in respect thereof"]
["No","Class","Authorised Undertakings",null,"Unauthorised Undertakings ",null,"Total",null,"Total"]
[null,null,"Premiums","Commissions","Premiums","Commissions","Premiums","Commissions","Number of policies"]
[null,null,"EUR","EUR","EUR","EUR","EUR","EUR"]
["I"," Life and Annuity",null,null,null,null,{"$f":"C11+E11","v":0},0]
["II"," Marriage and Birth",null,null,null,null,0,0]
["III"," Linked Long Term ",null,null,null,null,0,0]
["IV"," Permanent Health",null,null,null,null,0,0]
[null," Other Classes 1",null,null,null,null,{"$f":"A15+C15+E15","v":0},{"$f":"D15+F15","v":0}]
[null,"TOTAL PREMIUMS AND COMMISSIONS",{"$f":"SUM(C11:C15)","v":0},0,0,0,0,0,0]
[]
["General Business"]
["Gross reinsurance premiums written and commission received or receivable in respect thereof"]
["No","Class","Authorised Undertakings",null,"Unauthorised Undertakings ",null,"Total",null,"Total"]
[null,null,"Premiums","Commissions","Premiums","Commissions","Premiums","Commissions","Number of policies"]
[null,null,"EUR","EUR","EUR","EUR","EUR","EUR"]
[1," Accident & Health",null,null,null,null,{"$f":"C23+E23","v":0},0]
[2," Motor",null,null,null,null,0,0]
[3," Marine & Transport",null,null,null,null,0,0]
[4," Aviation",null,null,null,null,0,0]
[5," Fire & Other Damage to Property",null,null,null,null,0,0]
[6," Liability",null,null,null,null,0,0]
[7," Credit and Suretyship",null,null,null,null,0,0]
[8," General",null,null,null,null,0,0]
[null,"TOTAL PREMIUMS AND COMMISSIONS",{"$f":"SUM(C23:C30)","v":0},{"$f":"SUM(D23:D30)","v":0},0,0,0,0,0]
[]
[]
["Notes"]
[1,"Other Classes refer to classes V to IX found in the Second Schedule of the Insurance Business Act"]

{"sheet":"F4","index":11,"n_rows":106,"n_cols":6,"rows_kept":106,"cut":false,"hidden":true,"merged":[]}
["SheetCode","FieldCode","FICode","Date","ColNum","Value"]
["F4",101,{"$f":"'Cover Sheet'!$E$19","v":0},{"$f":"'Cover Sheet'!$E$23","v":"00:00:00"},1,{"$f":"'Form 4'!C11/'Cover Sheet'!$E$27","v":{"$error":"#DIV/0!"}}]
["F4",102,{"$f":"'Cover Sheet'!$E$19","v":0},{"$f":"'Cover Sheet'!$E$23","v":"00:00:00"},1,{"$f":"'Form 4'!C12/'Cover Sheet'!$E$27","v":{"$error":"#DIV/0!"}}]
["F4",103,{"$f":"'Cover Sheet'!$E$19","v":0},{"$f":"'Cover Sheet'!$E$23","v":"00:00:00"},1,{"$f":"'Form 4'!C13/'Cover Sheet'!$E$27","v":{"$error":"#DIV/0!"}}]
["F4",104,{"$f":"'Cover Sheet'!$E$19","v":0},{"$f":"'Cover Sheet'!$E$23","v":"00:00:00"},1,{"$f":"'Form 4'!C14/'Cover Sheet'!$E$27","v":{"$error":"#DIV/0!"}}]
["F4",105,{"$f":"'Cover Sheet'!$E$19","v":0},{"$f":"'Cover Sheet'!$E$23","v":"00:00:00"},1,{"$f":"'Form 4'!C15/'Cover Sheet'!$E$27","v":{"$error":"#DIV/0!"}}]
["F4",1,{"$f":"'Cover Sheet'!$E$19","v":0},{"$f":"'Cover Sheet'!$E$23","v":"00:00:00"},1,{"$f":"'Form 4'!C16/'Cover Sheet'!$E$27","v":{"$error":"#DIV/0!"}}]
["F4",201,{"$f":"'Cover Sheet'!$E$19","v":0},{"$f":"'Cover Sheet'!$E$23","v":"00:00:00"},1,{"$f":"'Form 4'!C23/'Cover Sheet'!$E$27","v":{"$error":"#DIV/0!"}}]
["F4",202,{"$f":"'Cover Sheet'!$E$19","v":0},{"$f":"'Cover Sheet'!$E$23","v":"00:00:00"},1,{"$f":"'Form 4'!C24/'Cover Sheet'!$E$27","v":{"$error":"#DIV/0!"}}]
["F4",203,{"$f":"'Cover Sheet'!$E$19","v":0},{"$f":"'Cover Sheet'!$E$23","v":"00:00:00"},1,{"$f":"'Form 4'!C25/'Cover Sheet'!$E$27","v":{"$error":"#DIV/0!"}}]
["F4",204,{"$f":"'Cover Sheet'!$E$19","v":0},{"$f":"'Cover Sheet'!$E$23","v":"00:00:00"},1,{"$f":"'Form 4'!C26/'Cover Sheet'!$E$27","v":{"$error":"#DIV/0!"}}]
["F4",205,{"$f":"'Cover Sheet'!$E$19","v":0},{"$f":"'Cover Sheet'!$E$23","v":"00:00:00"},1,{"$f":"'Form 4'!C27/'Cover Sheet'!$E$27","v":{"$error":"#DIV/0!"}}]
["F4",206,{"$f":"'Cover Sheet'!$E$19","v":0},{"$f":"'Cover Sheet'!$E$23","v":"00:00:00"},1,{"$f":"'Form 4'!C28/'Cover Sheet'!$E$27","v":{"$error":"#DIV/0!"}}]
["F4",207,{"$f":"'Cover Sheet'!$E$19","v":0},{"$f":"'Cover Sheet'!$E$23","v":"00:00:00"},1,{"$f":"'Form 4'!C29/'Cover Sheet'!$E$27","v":{"$error":"#DIV/0!"}}]
["F4",208,{"$f":"'Cover Sheet'!$E$19","v":0},{"$f":"'Cover Sheet'!$E$23","v":"00:00:00"},1,{"$f":"'Form 4'!C30/'Cover Sheet'!$E$27","v":{"$error":"#DIV/0!"}}]
["F4",2,{"$f":"'Cover Sheet'!$E$19","v":0},{"$f":"'Cover Sheet'!$E$23","v":"00:00:00"},1,{"$f":"'Form 4'!C31/'Cover Sheet'!$E$27","v":{"$error":"#DIV/0!"}}]
["F4",101,{"$f":"'Cover Sheet'!$E$19","v":0},{"$f":"'Cover Sheet'!$E$23","v":"00:00:00"},2,{"$f":"'Form 4'!#REF!/'Cover Sheet'!$E$27","v":{"$error":"#REF!"}}]
["F4",102,{"$f":"'Cover Sheet'!$E$19","v":0},{"$f":"'Cover Sheet'!$E$23","v":"00:00:00"},2,{"$f":"'Form 4'!#REF!/'Cover Sheet'!$E$27","v":{"$error":"#REF!"}}]
["F4",103,{"$f":"'Cover Sheet'!$E$19","v":0},{"$f":"'Cover Sheet'!$E$23","v":"00:00:00"},2,{"$f":"'Form 4'!#REF!/'Cover Sheet'!$E$27","v":{"$error":"#REF!"}}]
["F4",104,{"$f":"'Cover Sheet'!$E$19","v":0},{"$f":"'Cover Sheet'!$E$23","v":"00:00:00"},2,{"$f":"'Form 4'!#REF!/'Cover Sheet'!$E$27","v":{"$error":"#REF!"}}]
["F4",105,{"$f":"'Cover Sheet'!$E$19","v":0},{"$f":"'Cover Sheet'!$E$23","v":"00:00:00"},2,{"$f":"'Form 4'!#REF!/'Cover Sheet'!$E$27","v":{"$error":"#REF!"}}]
["F4",1,{"$f":"'Cover Sheet'!$E$19","v":0},{"$f":"'Cover Sheet'!$E$23","v":"00:00:00"},2,{"$f":"'Form 4'!#REF!/'Cover Sheet'!$E$27","v":{"$error":"#REF!"}}]
["F4",201,{"$f":"'Cover Sheet'!$E$19","v":0},{"$f":"'Cover Sheet'!$E$23","v":"00:00:00"},2,{"$f":"'Form 4'!#REF!/'Cover Sheet'!$E$27","v":{"$error":"#REF!"}}]
["F4",202,{"$f":"'Cover Sheet'!$E$19","v":0},{"$f":"'Cover Sheet'!$E$23","v":"00:00:00"},2,{"$f":"'Form 4'!#REF!/'Cover Sheet'!$E$27","v":{"$error":"#REF!"}}]
["F4",203,{"$f":"'Cover Sheet'!$E$19","v":0},{"$f":"'Cover Sheet'!$E$23","v":"00:00:00"},2,{"$f":"'Form 4'!#REF!/'Cover Sheet'!$E$27","v":{"$error":"#REF!"}}]
["F4",204,{"$f":"'Cover Sheet'!$E$19","v":0},{"$f":"'Cover Sheet'!$E$23","v":"00:00:00"},2,{"$f":"'Form 4'!#REF!/'Cover Sheet'!$E$27","v":{"$error":"#REF!"}}]
["F4",205,{"$f":"'Cover Sheet'!$E$19","v":0},{"$f":"'Cover Sheet'!$E$23","v":"00:00:00"},2,{"$f":"'Form 4'!#REF!/'Cover Sheet'!$E$27","v":{"$error":"#REF!"}}]
["F4",206,{"$f":"'Cover Sheet'!$E$19","v":0},{"$f":"'Cover Sheet'!$E$23","v":"00:00:00"},2,{"$f":"'Form 4'!#REF!/'Cover Sheet'!$E$27","v":{"$error":"#REF!"}}]
["F4",207,{"$f":"'Cover Sheet'!$E$19","v":0},{"$f":"'Cover Sheet'!$E$23","v":"00:00:00"},2,{"$f":"'Form 4'!#REF!/'Cover Sheet'!$E$27","v":{"$error":"#REF!"}}]
["F4",208,{"$f":"'Cover Sheet'!$E$19","v":0},{"$f":"'Cover Sheet'!$E$23","v":"00:00:00"},2,{"$f":"'Form 4'!#REF!/'Cover Sheet'!$E$27","v":{"$error":"#REF!"}}]
["F4",2,{"$f":"'Cover Sheet'!$E$19","v":0},{"$f":"'Cover Sheet'!$E$23","v":"00:00:00"},2,{"$f":"'Form 4'!#REF!/'Cover Sheet'!$E$27","v":{"$error":"#REF!"}}]
["F4",101,{"$f":"'Cover Sheet'!$E$19","v":0},{"$f":"'Cover Sheet'!$E$23","v":"00:00:00"},3,{"$f":"'Form 4'!E11/'Cover Sheet'!$E$27","v":{"$error":"#DIV/0!"}}]
["F4",102,{"$f":"'Cover Sheet'!$E$19","v":0},{"$f":"'Cover Sheet'!$E$23","v":"00:00:00"},3,{"$f":"'Form 4'!E12/'Cover Sheet'!$E$27","v":{"$error":"#DIV/0!"}}]
["F4",103,{"$f":"'Cover Sheet'!$E$19","v":0},{"$f":"'Cover Sheet'!$E$23","v":"00:00:00"},3,{"$f":"'Form 4'!E13/'Cover Sheet'!$E$27","v":{"$error":"#DIV/0!"}}]
["F4",104,{"$f":"'Cover Sheet'!$E$19","v":0},{"$f":"'Cover Sheet'!$E$23","v":"00:00:00"},3,{"$f":"'Form 4'!E14/'Cover Sheet'!$E$27","v":{"$error":"#DIV/0!"}}]
["F4",105,{"$f":"'Cover Sheet'!$E$19","v":0},{"$f":"'Cover Sheet'!$E$23","v":"00:00:00"},3,{"$f":"'Form 4'!E15/'Cover Sheet'!$E$27","v":{"$error":"#DIV/0!"}}]
["F4",1,{"$f":"'Cover Sheet'!$E$19","v":0},{"$f":"'Cover Sheet'!$E$23","v":"00:00:00"},3,{"$f":"'Form 4'!E16/'Cover Sheet'!$E$27","v":{"$error":"#DIV/0!"}}]
["F4",201,{"$f":"'Cover Sheet'!$E$19","v":0},{"$f":"'Cover Sheet'!$E$23","v":"00:00:00"},3,{"$f":"'Form 4'!E23/'Cover Sheet'!$E$27","v":{"$error":"#DIV/0!"}}]
["F4",202,{"$f":"'Cover Sheet'!$E$19","v":0},{"$f":"'Cover Sheet'!$E$23","v":"00:00:00"},3,{"$f":"'Form 4'!E24/'Cover Sheet'!$E$27","v":{"$error":"#DIV/0!"}}]
["F4",203,{"$f":"'Cover Sheet'!$E$19","v":0},{"$f":"'Cover Sheet'!$E$23","v":"00:00:00"},3,{"$f":"'Form 4'!E25/'Cover Sheet'!$E$27","v":{"$error":"#DIV/0!"}}]
["F4",204,{"$f":"'Cover Sheet'!$E$19","v":0},{"$f":"'Cover Sheet'!$E$23","v":"00:00:00"},3,{"$f":"'Form 4'!E26/'Cover Sheet'!$E$27","v":{"$error":"#DIV/0!"}}]
["F4",205,{"$f":"'Cover Sheet'!$E$19","v":0},{"$f":"'Cover Sheet'!$E$23","v":"00:00:00"},3,{"$f":"'Form 4'!E27/'Cover Sheet'!$E$27","v":{"$error":"#DIV/0!"}}]
["F4",206,{"$f":"'Cover Sheet'!$E$19","v":0},{"$f":"'Cover Sheet'!$E$23","v":"00:00:00"},3,{"$f":"'Form 4'!E28/'Cover Sheet'!$E$27","v":{"$error":"#DIV/0!"}}]
["F4",207,{"$f":"'Cover Sheet'!$E$19","v":0},{"$f":"'Cover Sheet'!$E$23","v":"00:00:00"},3,{"$f":"'Form 4'!E29/'Cover Sheet'!$E$27","v":{"$error":"#DIV/0!"}}]
["F4",208,{"$f":"'Cover Sheet'!$E$19","v":0},{"$f":"'Cover Sheet'!$E$23","v":"00:00:00"},3,{"$f":"'Form 4'!E30/'Cover Sheet'!$E$27","v":{"$error":"#DIV/0!"}}]
["F4",2,{"$f":"'Cover Sheet'!$E$19","v":0},{"$f":"'Cover Sheet'!$E$23","v":"00:00:00"},3,{"$f":"'Form 4'!E31/'Cover Sheet'!$E$27","v":{"$error":"#DIV/0!"}}]
["F4",101,{"$f":"'Cover Sheet'!$E$19","v":0},{"$f":"'Cover Sheet'!$E$23","v":"00:00:00"},4,{"$f":"'Form 4'!#REF!/'Cover Sheet'!$E$27","v":{"$error":"#REF!"}}]
["F4",102,{"$f":"'Cover Sheet'!$E$19","v":0},{"$f":"'Cover Sheet'!$E$23","v":"00:00:00"},4,{"$f":"'Form 4'!#REF!/'Cover Sheet'!$E$27","v":{"$error":"#REF!"}}]
["F4",103,{"$f":"'Cover Sheet'!$E$19","v":0},{"$f":"'Cover Sheet'!$E$23","v":"00:00:00"},4,{"$f":"'Form 4'!#REF!/'Cover Sheet'!$E$27","v":{"$error":"#REF!"}}]
["F4",104,{"$f":"'Cover Sheet'!$E$19","v":0},{"$f":"'Cover Sheet'!$E$23","v":"00:00:00"},4,{"$f":"'Form 4'!#REF!/'Cover Sheet'!$E$27","v":{"$error":"#REF!"}}]
["F4",105,{"$f":"'Cover Sheet'!$E$19","v":0},{"$f":"'Cover Sheet'!$E$23","v":"00:00:00"},4,{"$f":"'Form 4'!#REF!/'Cover Sheet'!$E$27","v":{"$error":"#REF!"}}]
["F4",1,{"$f":"'Cover Sheet'!$E$19","v":0},{"$f":"'Cover Sheet'!$E$23","v":"00:00:00"},4,{"$f":"'Form 4'!#REF!/'Cover Sheet'!$E$27","v":{"$error":"#REF!"}}]
["F4",201,{"$f":"'Cover Sheet'!$E$19","v":0},{"$f":"'Cover Sheet'!$E$23","v":"00:00:00"},4,{"$f":"'Form 4'!#REF!/'Cover Sheet'!$E$27","v":{"$error":"#REF!"}}]
["F4",202,{"$f":"'Cover Sheet'!$E$19","v":0},{"$f":"'Cover Sheet'!$E$23","v":"00:00:00"},4,{"$f":"'Form 4'!#REF!/'Cover Sheet'!$E$27","v":{"$error":"#REF!"}}]
["F4",203,{"$f":"'Cover Sheet'!$E$19","v":0},{"$f":"'Cover Sheet'!$E$23","v":"00:00:00"},4,{"$f":"'Form 4'!#REF!/'Cover Sheet'!$E$27","v":{"$error":"#REF!"}}]
["F4",204,{"$f":"'Cover Sheet'!$E$19","v":0},{"$f":"'Cover Sheet'!$E$23","v":"00:00:00"},4,{"$f":"'Form 4'!#REF!/'Cover Sheet'!$E$27","v":{"$error":"#REF!"}}]
["F4",205,{"$f":"'Cover Sheet'!$E$19","v":0},{"$f":"'Cover Sheet'!$E$23","v":"00:00:00"},4,{"$f":"'Form 4'!#REF!/'Cover Sheet'!$E$27","v":{"$error":"#REF!"}}]
["F4",206,{"$f":"'Cover Sheet'!$E$19","v":0},{"$f":"'Cover Sheet'!$E$23","v":"00:00:00"},4,{"$f":"'Form 4'!#REF!/'Cover Sheet'!$E$27","v":{"$error":"#REF!"}}]
["F4",207,{"$f":"'Cover Sheet'!$E$19","v":0},{"$f":"'Cover Sheet'!$E$23","v":"00:00:00"},4,{"$f":"'Form 4'!#REF!/'Cover Sheet'!$E$27","v":{"$error":"#REF!"}}]
["F4",208,{"$f":"'Cover Sheet'!$E$19","v":0},{"$f":"'Cover Sheet'!$E$23","v":"00:00:00"},4,{"$f":"'Form 4'!#REF!/'Cover Sheet'!$E$27","v":{"$error":"#REF!"}}]
["F4",2,{"$f":"'Cover Sheet'!$E$19","v":0},{"$f":"'Cover Sheet'!$E$23","v":"00:00:00"},4,{"$f":"'Form 4'!#REF!/'Cover Sheet'!$E$27","v":{"$error":"#REF!"}}]
["F4",101,{"$f":"'Cover Sheet'!$E$19","v":0},{"$f":"'Cover Sheet'!$E$23","v":"00:00:00"},5,{"$f":"'Form 4'!G11/'Cover Sheet'!$E$27","v":{"$error":"#DIV/0!"}}]
["F4",102,{"$f":"'Cover Sheet'!$E$19","v":0},{"$f":"'Cover Sheet'!$E$23","v":"00:00:00"},5,{"$f":"'Form 4'!G12/'Cover Sheet'!$E$27","v":{"$error":"#DIV/0!"}}]
["F4",103,{"$f":"'Cover Sheet'!$E$19","v":0},{"$f":"'Cover Sheet'!$E$23","v":"00:00:00"},5,{"$f":"'Form 4'!G13/'Cover Sheet'!$E$27","v":{"$error":"#DIV/0!"}}]
["F4",104,{"$f":"'Cover Sheet'!$E$19","v":0},{"$f":"'Cover Sheet'!$E$23","v":"00:00:00"},5,{"$f":"'Form 4'!G14/'Cover Sheet'!$E$27","v":{"$error":"#DIV/0!"}}]
["F4",105,{"$f":"'Cover Sheet'!$E$19","v":0},{"$f":"'Cover Sheet'!$E$23","v":"00:00:00"},5,{"$f":"'Form 4'!G15/'Cover Sheet'!$E$27","v":{"$error":"#DIV/0!"}}]
["F4",1,{"$f":"'Cover Sheet'!$E$19","v":0},{"$f":"'Cover Sheet'!$E$23","v":"00:00:00"},5,{"$f":"'Form 4'!G16/'Cover Sheet'!$E$27","v":{"$error":"#DIV/0!"}}]
["F4",201,{"$f":"'Cover Sheet'!$E$19","v":0},{"$f":"'Cover Sheet'!$E$23","v":"00:00:00"},5,{"$f":"'Form 4'!G23/'Cover Sheet'!$E$27","v":{"$error":"#DIV/0!"}}]
["F4",202,{"$f":"'Cover Sheet'!$E$19","v":0},{"$f":"'Cover Sheet'!$E$23","v":"00:00:00"},5,{"$f":"'Form 4'!G24/'Cover Sheet'!$E$27","v":{"$error":"#DIV/0!"}}]
["F4",203,{"$f":"'Cover Sheet'!$E$19","v":0},{"$f":"'Cover Sheet'!$E$23","v":"00:00:00"},5,{"$f":"'Form 4'!G25/'Cover Sheet'!$E$27","v":{"$error":"#DIV/0!"}}]
["F4",204,{"$f":"'Cover Sheet'!$E$19","v":0},{"$f":"'Cover Sheet'!$E$23","v":"00:00:00"},5,{"$f":"'Form 4'!G26/'Cover Sheet'!$E$27","v":{"$error":"#DIV/0!"}}]
["F4",205,{"$f":"'Cover Sheet'!$E$19","v":0},{"$f":"'Cover Sheet'!$E$23","v":"00:00:00"},5,{"$f":"'Form 4'!G27/'Cover Sheet'!$E$27","v":{"$error":"#DIV/0!"}}]
["F4",206,{"$f":"'Cover Sheet'!$E$19","v":0},{"$f":"'Cover Sheet'!$E$23","v":"00:00:00"},5,{"$f":"'Form 4'!G28/'Cover Sheet'!$E$27","v":{"$error":"#DIV/0!"}}]
["F4",207,{"$f":"'Cover Sheet'!$E$19","v":0},{"$f":"'Cover Sheet'!$E$23","v":"00:00:00"},5,{"$f":"'Form 4'!G29/'Cover Sheet'!$E$27","v":{"$error":"#DIV/0!"}}]
["F4",208,{"$f":"'Cover Sheet'!$E$19","v":0},{"$f":"'Cover Sheet'!$E$23","v":"00:00:00"},5,{"$f":"'Form 4'!G30/'Cover Sheet'!$E$27","v":{"$error":"#DIV/0!"}}]
["F4",2,{"$f":"'Cover Sheet'!$E$19","v":0},{"$f":"'Cover Sheet'!$E$23","v":"00:00:00"},5,{"$f":"'Form 4'!G31/'Cover Sheet'!$E$27","v":{"$error":"#DIV/0!"}}]
["F4",101,{"$f":"'Cover Sheet'!$E$19","v":0},{"$f":"'Cover Sheet'!$E$23","v":"00:00:00"},6,{"$f":"'Form 4'!#REF!/'Cover Sheet'!$E$27","v":{"$error":"#REF!"}}]
["F4",102,{"$f":"'Cover Sheet'!$E$19","v":0},{"$f":"'Cover Sheet'!$E$23","v":"00:00:00"},6,{"$f":"'Form 4'!#REF!/'Cover Sheet'!$E$27","v":{"$error":"#REF!"}}]
["F4",103,{"$f":"'Cover Sheet'!$E$19","v":0},{"$f":"'Cover Sheet'!$E$23","v":"00:00:00"},6,{"$f":"'Form 4'!#REF!/'Cover Sheet'!$E$27","v":{"$error":"#REF!"}}]
["F4",104,{"$f":"'Cover Sheet'!$E$19","v":0},{"$f":"'Cover Sheet'!$E$23","v":"00:00:00"},6,{"$f":"'Form 4'!#REF!/'Cover Sheet'!$E$27","v":{"$error":"#REF!"}}]
["F4",105,{"$f":"'Cover Sheet'!$E$19","v":0},{"$f":"'Cover Sheet'!$E$23","v":"00:00:00"},6,{"$f":"'Form 4'!#REF!/'Cover Sheet'!$E$27","v":{"$error":"#REF!"}}]
["F4",1,{"$f":"'Cover Sheet'!$E$19","v":0},{"$f":"'Cover Sheet'!$E$23","v":"00:00:00"},6,{"$f":"'Form 4'!#REF!/'Cover Sheet'!$E$27","v":{"$error":"#REF!"}}]
["F4",201,{"$f":"'Cover Sheet'!$E$19","v":0},{"$f":"'Cover Sheet'!$E$23","v":"00:00:00"},6,{"$f":"'Form 4'!#REF!/'Cover Sheet'!$E$27","v":{"$error":"#REF!"}}]
["F4",202,{"$f":"'Cover Sheet'!$E$19","v":0},{"$f":"'Cover Sheet'!$E$23","v":"00:00:00"},6,{"$f":"'Form 4'!#REF!/'Cover Sheet'!$E$27","v":{"$error":"#REF!"}}]
["F4",203,{"$f":"'Cover Sheet'!$E$19","v":0},{"$f":"'Cover Sheet'!$E$23","v":"00:00:00"},6,{"$f":"'Form 4'!#REF!/'Cover Sheet'!$E$27","v":{"$error":"#REF!"}}]
["F4",204,{"$f":"'Cover Sheet'!$E$19","v":0},{"$f":"'Cover Sheet'!$E$23","v":"00:00:00"},6,{"$f":"'Form 4'!#REF!/'Cover Sheet'!$E$27","v":{"$error":"#REF!"}}]
["F4",205,{"$f":"'Cover Sheet'!$E$19","v":0},{"$f":"'Cover Sheet'!$E$23","v":"00:00:00"},6,{"$f":"'Form 4'!#REF!/'Cover Sheet'!$E$27","v":{"$error":"#REF!"}}]
["F4",206,{"$f":"'Cover Sheet'!$E$19","v":0},{"$f":"'Cover Sheet'!$E$23","v":"00:00:00"},6,{"$f":"'Form 4'!#REF!/'Cover Sheet'!$E$27","v":{"$error":"#REF!"}}]
["F4",207,{"$f":"'Cover Sheet'!$E$19","v":0},{"$f":"'Cover Sheet'!$E$23","v":"00:00:00"},6,{"$f":"'Form 4'!#REF!/'Cover Sheet'!$E$27","v":{"$error":"#REF!"}}]
["F4",208,{"$f":"'Cover Sheet'!$E$19","v":0},{"$f":"'Cover Sheet'!$E$23","v":"00:00:00"},6,{"$f":"'Form 4'!#REF!/'Cover Sheet'!$E$27","v":{"$error":"#REF!"}}]
["F4",2,{"$f":"'Cover Sheet'!$E$19","v":0},{"$f":"'Cover Sheet'!$E$23","v":"00:00:00"},6,{"$f":"'Form 4'!#REF!/'Cover Sheet'!$E$27","v":{"$error":"#REF!"}}]
["F4",101,{"$f":"'Cover Sheet'!$E$19","v":0},{"$f":"'Cover Sheet'!$E$23","v":"00:00:00"},7,{"$f":"'Form 4'!I11","v":0}]
["F4",102,{"$f":"'Cover Sheet'!$E$19","v":0},{"$f":"'Cover Sheet'!$E$23","v":"00:00:00"},7,{"$f":"'Form 4'!I12","v":0}]
["F4",103,{"$f":"'Cover Sheet'!$E$19","v":0},{"$f":"'Cover Sheet'!$E$23","v":"00:00:00"},7,{"$f":"'Form 4'!I13","v":0}]
["F4",104,{"$f":"'Cover Sheet'!$E$19","v":0},{"$f":"'Cover Sheet'!$E$23","v":"00:00:00"},7,{"$f":"'Form 4'!I14","v":0}]
["F4",105,{"$f":"'Cover Sheet'!$E$19","v":0},{"$f":"'Cover Sheet'!$E$23","v":"00:00:00"},7,{"$f":"'Form 4'!I15","v":0}]
["F4",1,{"$f":"'Cover Sheet'!$E$19","v":0},{"$f":"'Cover Sheet'!$E$23","v":"00:00:00"},7,{"$f":"'Form 4'!I16","v":0}]
["F4",201,{"$f":"'Cover Sheet'!$E$19","v":0},{"$f":"'Cover Sheet'!$E$23","v":"00:00:00"},7,{"$f":"'Form 4'!I23","v":0}]
["F4",202,{"$f":"'Cover Sheet'!$E$19","v":0},{"$f":"'Cover Sheet'!$E$23","v":"00:00:00"},7,{"$f":"'Form 4'!I24","v":0}]
["F4",203,{"$f":"'Cover Sheet'!$E$19","v":0},{"$f":"'Cover Sheet'!$E$23","v":"00:00:00"},7,{"$f":"'Form 4'!I25","v":0}]
["F4",204,{"$f":"'Cover Sheet'!$E$19","v":0},{"$f":"'Cover Sheet'!$E$23","v":"00:00:00"},7,{"$f":"'Form 4'!I26","v":0}]
["F4",205,{"$f":"'Cover Sheet'!$E$19","v":0},{"$f":"'Cover Sheet'!$E$23","v":"00:00:00"},7,{"$f":"'Form 4'!I27","v":0}]
["F4",206,{"$f":"'Cover Sheet'!$E$19","v":0},{"$f":"'Cover Sheet'!$E$23","v":"00:00:00"},7,{"$f":"'Form 4'!I28","v":0}]
["F4",207,{"$f":"'Cover Sheet'!$E$19","v":0},{"$f":"'Cover Sheet'!$E$23","v":"00:00:00"},7,{"$f":"'Form 4'!I29","v":0}]
["F4",208,{"$f":"'Cover Sheet'!$E$19","v":0},{"$f":"'Cover Sheet'!$E$23","v":"00:00:00"},7,{"$f":"'Form 4'!I30","v":0}]
["F4",2,{"$f":"'Cover Sheet'!$E$19","v":0},{"$f":"'Cover Sheet'!$E$23","v":"00:00:00"},7,{"$f":"'Form 4'!I31","v":0}]

{"sheet":"Form 5","index":12,"n_rows":49,"n_cols":11,"rows_kept":49,"cut":false,"hidden":false,"merged":[[0,2,0,5],[48,0,48,8],[23,1,23,2],[23,3,23,4],[23,5,23,6],[23,7,23,8],[23,0,25,0],[11,0,13,0],[11,5,11,6],[11,7,11,8],[11,1,11,2],[11,3,11,4],[47,0,47,8],[48,144,48,152],[48,153,48,161],[48,162,48,170],[48,171,48,179],[47,144,47,152],[47,153,47,161],[47,162,47,170],[47,171,47,179],[48,180,48,188],[48,99,48,107],[48,108,48,116],[48,117,48,125],[48,126,48,134],[48,135,48,143],[48,54,48,62],[48,63,48,71],[48,72,48,80],[48,81,48,89],[48,90,48,98],[48,18,48,26],[48,27,48,35],[48,36,48,44],[48,45,48,53],[48,324,48,332],[48,333,48,341],[48,342,48,350],[48,351,48,359],[48,360,48,368],[48,279,48,287],[48,288,48,296],[48,297,48,305],[48,306,48,314],[48,315,48,323],[48,234,48,242],[48,243,48,251],[48,252,48,260],[48,261,48,269],[48,270,48,278],[48,189,48,197],[48,198,48,206],[48,207,48,215],[48,216,48,224],[48,225,48,233],[48,504,48,512],[48,513,48,521],[48,522,48,530],[48,531,48,539],[48,540,48,548],[48,459,48,467],[48,468,48,476],[48,477,48,485],[48,486,48,494],[48,495,48,503],[48,414,48,422],[48,423,48,431],[48,432,48,440],[48,441,48,449],[48,450,48,458],[48,369,48,377],[48,378,48,386],[48,387,48,395],[48,396,48,404],[48,405,48,413],[48,684,48,692],[48,693,48,701],[48,702,48,710],[48,711,48,719],[48,720,48,728],[48,639,48,647],[48,648,48,656],[48,657,48,665],[48,666,48,674],[48,675,48,683],[48,594,48,602],[48,603,48,611],[48,612,48,620],[48,621,48,629],[48,630,48,638],[48,549,48,557],[48,558,48,566],[48,567,48,575],[48,576,48,584],[48,585,48,593],[48,864,48,872],[48,873,48,881],[48,882,48,890],[48,891,48,899],[48,900,48,908],[48,819,48,827],[48,828,48,836],[48,837,48,845],[48,846,48,854],[48,855,48,863],[48,774,48,782],[48,783,48,791],[48,792,48,800],[48,801,48,809],[48,810,48,818],[48,729,48,737],[48,738,48,746],[48,747,48,755],[48,756,48,764],[48,765,48,773],[48,1044,48,1052],[48,1053,48,1061],[48,1062,48,1070],[48,1071,48,1079],[48,1080,48,1088],[48,999,48,1007],[48,1008,48,1016],[48,1017,48,1025],[48,1026,48,1034],[48,1035,48,1043],[48,954,48,962],[48,963,48,971],[48,972,48,980],[48,981,48,989],[48,990,48,998],[48,909,48,917],[48,918,48,926],[48,927,48,935],[48,936,48,944],[48,945,48,953],[48,1224,48,1232],[48,1233,48,1241],[48,1242,48,1250],[48,1251,48,1259],[48,1260,48,1268],[48,1179,48,1187],[48,1188,48,1196],[48,1197,48,1205],[48,1206,48,1214],[48,1215,48,1223],[48,1134,48,1142],[48,1143,48,1151],[48,1152,48,1160],[48,1161,48,1169],[48,1170,48,1178],[48,1089,48,1097],[48,1098,48,1106],[48,1107,48,1115],[48,1116,48,1124],[48,1125,48,1133],[48,1404,48,1412],[48,1413,48,1421],[48,1422,48,1430],[48,1431,48,1439],[48,1440,48,1448],[48,1359,48,1367],[48,1368,48,1376],[48,1377,48,1385],[48,1386,48,1394],[48,1395,48,1403],[48,1314,48,1322],[48,1323,48,1331],[48,1332,48,1340],[48,1341,48,1349],[48,1350,48,1358],[48,1269,48,1277],[48,1278,48,1286],[48,1287,48,1295],[48,1296,48,1304],[48,1305,48,1313],[48,1584,48,1592],[48,1593,48,1601],[48,1602,48,1610],[48,1611,48,1619],[48,1620,48,1628],[48,1539,48,1547],[48,1548,48,1556],[48,1557,48,1565],[48,1566,48,1574],[48,1575,48,1583],[48,1494,48,1502],[48,1503,48,1511],[48,1512,48,1520],[48,1521,48,1529],[48,1530,48,1538],[48,1449,48,1457],[48,1458,48,1466],[48,1467,48,1475],[48,1476,48,1484],[48,1485,48,1493],[48,1764,48,1772],[48,1773,48,1781],[48,1782,48,1790],[48,1791,48,1799],[48,1800,48,1808],[48,1719,48,1727],[48,1728,48,1736],[48,1737,48,1745],[48,1746,48,1754],[48,1755,48,1763],[48,1674,48,1682],[48,1683,48,1691],[48,1692,48,1700],[48,1701,48,1709],[48,1710,48,1718],[48,1629,48,1637],[48,1638,48,1646],[48,1647,48,1655],[48,1656,48,1664],[48,1665,48,1673],[48,1944,48,1952],[48,1953,48,1961],[48,1962,48,1970],[48,1971,48,1979],[48,1980,48,1988],[48,1899,48,1907],[48,1908,48,1916],[48,1917,48,1925],[48,1926,48,1934],[48,1935,48,1943],[48,1854,48,1862],[48,1863,48,1871],[48,1872,48,1880],[48,1881,48,1889],[48,1890,48,1898],[48,1809,48,1817],[48,1818,48,1826],[48,1827,48,1835],[48,1836,48,1844],[48,1845,48,1853],[48,2124,48,2132],[48,2133,48,2141],[48,2142,48,2150],[48,2151,48,2159],[48,2160,48,2168],[48,2079,48,2087],[48,2088,48,2096],[48,2097,48,2105],[48,2106,48,2114],[48,2115,48,2123],[48,2034,48,2042],[48,2043,48,2051],[48,2052,48,2060],[48,2061,48,2069],[48,2070,48,2078],[48,1989,48,1997],[48,1998,48,2006],[48,2007,48,2015],[48,2016,48,2024],[48,2025,48,2033],[48,2304,48,2312],[48,2313,48,2321],[48,2322,48,2330],[48,2331,48,2339],[48,2340,48,2348],[48,2259,48,2267],[48,2268,48,2276],[48,2277,48,2285],[48,2286,48,2294],[48,2295,48,2303],[48,2214,48,2222],[48,2223,48,2231],[48,2232,48,2240],[48,2241,48,2249],[48,2250,48,2258],[48,2169,48,2177],[48,2178,48,2186],[48,2187,48,2195],[48,2196,48,2204],[48,2205,48,2213],[48,2484,48,2492],[48,2493,48,2501],[48,2502,48,2510],[48,2511,48,2519],[48,2520,48,2528],[48,2439,48,2447],[48,2448,48,2456],[48,2457,48,2465],[48,2466,48,2474],[48,2475,48,2483],[48,2394,48,2402],[48,2403,48,2411],[48,2412,48,2420],[48,2421,48,2429],[48,2430,48,2438],[48,2349,48,2357],[48,2358,48,2366],[48,2367,48,2375],[48,2376,48,2384],[48,2385,48,2393],[48,2664,48,2672],[48,2673,48,2681],[48,2682,48,2690],[48,2691,48,2699],[48,2700,48,2708],[48,2619,48,2627],[48,2628,48,2636],[48,2637,48,2645],[48,2646,48,2654],[48,2655,48,2663],[48,2574,48,2582],[48,2583,48,2591],[48,2592,48,2600],[48,2601,48,2609],[48,2610,48,2618],[48,2529,48,2537],[48,2538,48,2546],[48,2547,48,2555],[48,2556,48,2564],[48,2565,48,2573],[48,2844,48,2852],[48,2853,48,2861],[48,2862,48,2870],[48,2871,48,2879],[48,2880,48,2888],[48,2799,48,2807],[48,2808,48,2816],[48,2817,48,2825],[48,2826,48,2834],[48,2835,48,2843],[48,2754,48,2762],[48,2763,48,2771],[48,2772,48,2780],[48,2781,48,2789],[48,2790,48,2798],[48,2709,48,2717],[48,2718,48,2726],[48,2727,48,2735],[48,2736,48,2744],[48,2745,48,2753],[48,3024,48,3032],[48,3033,48,3041],[48,3042,48,3050],[48,3051,48,3059],[48,3060,48,3068],[48,2979,48,2987],[48,2988,48,2996],[48,2997,48,3005],[48,3006,48,3014],[48,3015,48,3023],[48,2934,48,2942],[48,2943,48,2951],[48,2952,48,2960],[48,2961,48,2969],[48,2970,48,2978],[48,2889,48,2897],[48,2898,48,2906],[48,2907,48,2915],[48,2916,48,2924],[48,2925,48,2933],[48,3204,48,3212],[48,3213,48,3221],[48,3222,48,3230],[48,3231,48,3239],[48,3240,48,3248],[48,3159,48,3167],[48,3168,48,3176],[48,3177,48,3185],[48,3186,48,3194],[48,3195,48,3203],[48,3114,48,3122],[48,3123,48,3131],[48,3132,48,3140],[48,3141,48,3149],[48,3150,48,3158],[48,3069,48,3077],[48,3078,48,3086],[48,3087,48,3095],[48,3096,48,3104],[48,3105,48,3113],[48,3384,48,3392],[48,3393,48,3401],[48,3402,48,3410],[48,3411,48,3419],[48,3420,48,3428],[48,3339,48,3347],[48,3348,48,3356],[48,3357,48,3365],[48,3366,48,3374],[48,3375,48,3383],[48,3294,48,3302],[48,3303,48,3311],[48,3312,48,3320],[48,3321,48,3329],[48,3330,48,3338],[48,3249,48,3257],[48,3258,48,3266],[48,3267,48,3275],[48,3276,48,3284],[48,3285,48,3293],[48,3564,48,3572],[48,3573,48,3581],[48,3582,48,3590],[48,3591,48,3599],[48,3600,48,3608],[48,3519,48,3527],[48,3528,48,3536],[48,3537,48,3545],[48,3546,48,3554],[48,3555,48,3563],[48,3474,48,3482],[48,3483,48,3491],[48,3492,48,3500],[48,3501,48,3509],[48,3510,48,3518],[48,3429,48,3437],[48,3438,48,3446],[48,3447,48,3455],[48,3456,48,3464],[48,3465,48,3473],[48,3744,48,3752],[48,3753,48,3761],[48,3762,48,3770],[48,3771,48,3779],[48,3780,48,3788],[48,3699,48,3707],[48,3708,48,3716],[48,3717,48,3725],[48,3726,48,3734],[48,3735,48,3743],[48,3654,48,3662],[48,3663,48,3671],[48,3672,48,3680],[48,3681,48,3689],[48,3690,48,3698],[48,3609,48,3617],[48,3618,48,3626],[48,3627,48,3635],[48,3636,48,3644],[48,3645,48,3653],[48,3924,48,3932],[48,3933,48,3941],[48,3942,48,3950],[48,3951,48,3959],[48,3960,48,3968],[48,3879,48,3887],[48,3888,48,3896],[48,3897,48,3905],[48,3906,48,3914],[48,3915,48,3923],[48,3834,48,3842],[48,3843,48,3851],[48,3852,48,3860],[48,3861,48,3869],[48,3870,48,3878],[48,3789,48,3797],[48,3798,48,3806],[48,3807,48,3815],[48,3816,48,3824],[48,3825,48,3833],[48,4104,48,4112],[48,4113,48,4121],[48,4122,48,4130],[48,4131,48,4139],[48,4140,48,4148],[48,4059,48,4067],[48,4068,48,4076],[48,4077,48,4085],[48,4086,48,4094],[48,4095,48,4103],[48,4014,48,4022],[48,4023,48,4031],[48,4032,48,4040],[48,4041,48,4049],[48,4050,48,4058],[48,3969,48,3977],[48,3978,48,3986],[48,3987,48,3995],[48,3996,48,4004],[48,4005,48,4013],[48,4284,48,4292],[48,4293,48,4301],[48,4302,48,4310],[48,4311,48,4319],[48,4320,48,4328],[48,4239,48,4247],[48,4248,48,4256],[48,4257,48,4265],[48,4266,48,4274],[48,4275,48,4283],[48,4194,48,4202],[48,4203,48,4211],[48,4212,48,4220],[48,4221,48,4229],[48,4230,48,4238],[48,4149,48,4157],[48,4158,48,4166],[48,4167,48,4175],[48,4176,48,4184],[48,4185,48,4193],[48,4464,48,4472],[48,4473,48,4481],[48,4482,48,4490],[48,4491,48,4499],[48,4500,48,4508],[48,4419,48,4427],[48,4428,48,4436],[48,4437,48,4445],[48,4446,48,4454],[48,4455,48,4463],[48,4374,48,4382],[48,4383,48,4391],[48,4392,48,4400],[48,4401,48,4409],[48,4410,48,4418],[48,4329,48,4337],[48,4338,48,4346],[48,4347,48,4355],[48,4356,48,4364],[48,4365,48,4373],[48,4644,48,4652],[48,4653,48,4661],[48,4662,48,4670],[48,4671,48,4679],[48,4680,48,4688],[48,4599,48,4607],[48,4608,48,4616],[48,4617,48,4625],[48,4626,48,4634],[48,4635,48,4643],[48,4554,48,4562],[48,4563,48,4571],[48,4572,48,4580],[48,4581,48,4589],[48,4590,48,4598],[48,4509,48,4517],[48,4518,48,4526],[48,4527,48,4535],[48,4536,48,4544],[48,4545,48,4553],[48,4824,48,4832],[48,4833,48,4841],[48,4842,48,4850],[48,4851,48,4859],[48,4860,48,4868],[48,4779,48,4787],[48,4788,48,4796],[48,4797,48,4805],[48,4806,48,4814],[48,4815,48,4823],[48,4734,48,4742],[48,4743,48,4751],[48,4752,48,4760],[48,4761,48,4769],[48,4770,48,4778],[48,4689,48,4697],[48,4698,48,4706],[48,4707,48,4715],[48,4716,48,4724],[48,4725,48,4733],[48,5004,48,5012],[48,5013,48,5021],[48,5022,48,5030],[48,5031,48,5039],[48,5040,48,5048],[48,4959,48,4967],[48,4968,48,4976],[48,4977,48,4985],[48,4986,48,4994],[48,4995,48,5003],[48,4914,48,4922],[48,4923,48,4931],[48,4932,48,4940],[48,4941,48,4949],[48,4950,48,4958],[48,4869,48,4877],[48,4878,48,4886],[48,4887,48,4895],[48,4896,48,4904],[48,4905,48,4913],[48,5184,48,5192],[48,5193,48,5201],[48,5202,48,5210],[48,5211,48,5219],[48,5220,48,5228],[48,5139,48,5147],[48,5148,48,5156],[48,5157,48,5165],[48,5166,48,5174],[48,5175,48,5183],[48,5094,48,5102],[48,5103,48,5111],[48,5112,48,5120],[48,5121,48,5129],[48,5130,48,5138],[48,5049,48,5057],[48,5058,48,5066],[48,5067,48,5075],[48,5076,48,5084],[48,5085,48,5093],[48,5364,48,5372],[48,5373,48,5381],[48,5382,48,5390],[48,5391,48,5399],[48,5400,48,5408],[48,5319,48,5327],[48,5328,48,5336],[48,5337,48,5345],[48,5346,48,5354],[48,5355,48,5363],[48,5274,48,5282],[48,5283,48,5291],[48,5292,48,5300],[48,5301,48,5309],[48,5310,48,5318],[48,5229,48,5237],[48,5238,48,5246],[48,5247,48,5255],[48,5256,48,5264],[48,5265,48,5273],[48,5544,48,5552],[48,5553,48,5561],[48,5562,48,5570],[48,5571,48,5579],[48,5580,48,5588],[48,5499,48,5507],[48,5508,48,5516],[48,5517,48,5525],[48,5526,48,5534],[48,5535,48,5543],[48,5454,48,5462],[48,5463,48,5471],[48,5472,48,5480],[48,5481,48,5489],[48,5490,48,5498],[48,5409,48,5417],[48,5418,48,5426],[48,5427,48,5435],[48,5436,48,5444],[48,5445,48,5453],[48,5724,48,5732],[48,5733,48,5741],[48,5742,48,5750],[48,5751,48,5759],[48,5760,48,5768],[48,5679,48,5687],[48,5688,48,5696],[48,5697,48,5705],[48,5706,48,5714],[48,5715,48,5723],[48,5634,48,5642],[48,5643,48,5651],[48,5652,48,5660],[48,5661,48,5669],[48,5670,48,5678],[48,5589,48,5597],[48,5598,48,5606],[48,5607,48,5615],[48,5616,48,5624],[48,5625,48,5633],[48,5904,48,5912],[48,5913,48,5921],[48,5922,48,5930],[48,5931,48,5939],[48,5940,48,5948],[48,5859,48,5867],[48,5868,48,5876],[48,5877,48,5885],[48,5886,48,5894],[48,5895,48,5903],[48,5814,48,5822],[48,5823,48,5831],[48,5832,48,5840],[48,5841,48,5849],[48,5850,48,5858],[48,5769,48,5777],[48,5778,48,5786],[48,5787,48,5795],[48,5796,48,5804],[48,5805,48,5813],[48,6084,48,6092],[48,6093,48,6101],[48,6102,48,6110],[48,6111,48,6119],[48,6120,48,6128],[48,6039,48,6047],[48,6048,48,6056],[48,6057,48,6065],[48,6066,48,6074],[48,6075,48,6083],[48,5994,48,6002],[48,6003,48,6011],[48,6012,48,6020],[48,6021,48,6029],[48,6030,48,6038],[48,5949,48,5957],[48,5958,48,5966],[48,5967,48,5975],[48,5976,48,5984],[48,5985,48,5993],[48,6264,48,6272],[48,6273,48,6281],[48,6282,48,6290],[48,6291,48,6299],[48,6300,48,6308],[48,6219,48,6227],[48,6228,48,6236],[48,6237,48,6245],[48,6246,48,6254],[48,6255,48,6263],[48,6174,48,6182],[48,6183,48,6191],[48,6192,48,6200],[48,6201,48,6209],[48,6210,48,6218],[48,6129,48,6137],[48,6138,48,6146],[48,6147,48,6155],[48,6156,48,6164],[48,6165,48,6173],[48,6444,48,6452],[48,6453,48,6461],[48,6462,48,6470],[48,6471,48,6479],[48,6480,48,6488],[48,6399,48,6407],[48,6408,48,6416],[48,6417,48,6425],[48,6426,48,6434],[48,6435,48,6443],[48,6354,48,6362],[48,6363,48,6371],[48,6372,48,6380],[48,6381,48,6389],[48,6390,48,6398],[48,6309,48,6317],[48,6318,48,6326],[48,6327,48,6335],[48,6336,48,6344],[48,6345,48,6353],[48,6624,48,6632],[48,6633,48,6641],[48,6642,48,6650],[48,6651,48,6659],[48,6660,48,6668],[48,6579,48,6587],[48,6588,48,6596],[48,6597,48,6605],[48,6606,48,6614],[48,6615,48,6623],[48,6534,48,6542],[48,6543,48,6551],[48,6552,48,6560],[48,6561,48,6569],[48,6570,48,6578],[48,6489,48,6497],[48,6498,48,6506],[48,6507,48,6515],[48,6516,48,6524],[48,6525,48,6533],[48,6804,48,6812],[48,6813,48,6821],[48,6822,48,6830],[48,6831,48,6839],[48,6840,48,6848],[48,6759,48,6767],[48,6768,48,6776],[48,6777,48,6785],[48,6786,48,6794],[48,6795,48,6803],[48,6714,48,6722],[48,6723,48,6731],[48,6732,48,6740],[48,6741,48,6749],[48,6750,48,6758],[48,6669,48,6677],[48,6678,48,6686],[48,6687,48,6695],[48,6696,48,6704],[48,6705,48,6713],[48,6984,48,6992],[48,6993,48,7001],[48,7002,48,7010],[48,7011,48,7019],[48,7020,48,7028],[48,6939,48,6947],[48,6948,48,6956],[48,6957,48,6965],[48,6966,48,6974],[48,6975,48,6983],[48,6894,48,6902],[48,6903,48,6911],[48,6912,48,6920],[48,6921,48,6929],[48,6930,48,6938],[48,6849,48,6857],[48,6858,48,6866],[48,6867,48,6875],[48,6876,48,6884],[48,6885,48,6893],[48,7164,48,7172],[48,7173,48,7181],[48,7182,48,7190],[48,7191,48,7199],[48,7200,48,7208],[48,7119,48,7127],[48,7128,48,7136],[48,7137,48,7145],[48,7146,48,7154],[48,7155,48,7163],[48,7074,48,7082],[48,7083,48,7091],[48,7092,48,7100],[48,7101,48,7109],[48,7110,48,7118],[48,7029,48,7037],[48,7038,48,7046],[48,7047,48,7055],[48,7056,48,7064],[48,7065,48,7073],[48,7344,48,7352],[48,7353,48,7361],[48,7362,48,7370],[48,7371,48,7379],[48,7380,48,7388],[48,7299,48,7307],[48,7308,48,7316],[48,7317,48,7325],[48,7326,48,7334],[48,7335,48,7343],[48,7254,48,7262],[48,7263,48,7271],[48,7272,48,7280],[48,7281,48,7289],[48,7290,48,7298],[48,7209,48,7217],[48,7218,48,7226],[48,7227,48,7235],[48,7236,48,7244],[48,7245,48,7253],[48,7524,48,7532],[48,7533,48,7541],[48,7542,48,7550],[48,7551,48,7559],[48,7560,48,7568],[48,7479,48,7487],[48,7488,48,7496],[48,7497,48,7505],[48,7506,48,7514],[48,7515,48,7523],[48,7434,48,7442],[48,7443,48,7451],[48,7452,48,7460],[48,7461,48,7469],[48,7470,48,7478],[48,7389,48,7397],[48,7398,48,7406],[48,7407,48,7415],[48,7416,48,7424],[48,7425,48,7433],[48,7704,48,7712],[48,7713,48,7721],[48,7722,48,7730],[48,7731,48,7739],[48,7740,48,7748],[48,7659,48,7667],[48,7668,48,7676],[48,7677,48,7685],[48,7686,48,7694],[48,7695,48,7703],[48,7614,48,7622],[48,7623,48,7631],[48,7632,48,7640],[48,7641,48,7649],[48,7650,48,7658],[48,7569,48,7577],[48,7578,48,7586],[48,7587,48,7595],[48,7596,48,7604],[48,7605,48,7613],[48,7884,48,7892],[48,7893,48,7901],[48,7902,48,7910],[48,7911,48,7919],[48,7920,48,7928],[48,7839,48,7847],[48,7848,48,7856],[48,7857,48,7865],[48,7866,48,7874],[48,7875,48,7883],[48,7794,48,7802],[48,7803,48,7811],[48,7812,48,7820],[48,7821,48,7829],[48,7830,48,7838],[48,7749,48,7757],[48,7758,48,7766],[48,7767,48,7775],[48,7776,48,7784],[48,7785,48,7793],[48,8064,48,8072],[48,8073,48,8081],[48,8082,48,8090],[48,8091,48,8099],[48,8100,48,8108],[48,8019,48,8027],[48,8028,48,8036],[48,8037,48,8045],[48,8046,48,8054],[48,8055,48,8063],[48,7974,48,7982],[48,7983,48,7991],[48,7992,48,8000],[48,8001,48,8009],[48,8010,48,8018],[48,7929,48,7937],[48,7938,48,7946],[48,7947,48,7955],[48,7956,48,7964],[48,7965,48,7973],[48,8244,48,8252],[48,8253,48,8261],[48,8262,48,8270],[48,8271,48,8279],[48,8280,48,8288],[48,8199,48,8207],[48,8208,48,8216],[48,8217,48,8225],[48,8226,48,8234],[48,8235,48,8243],[48,8154,48,8162],[48,8163,48,8171],[48,8172,48,8180],[48,8181,48,8189],[48,8190,48,8198],[48,8109,48,8117],[48,8118,48,8126],[48,8127,48,8135],[48,8136,48,8144],[48,8145,48,8153],[48,8424,48,8432],[48,8433,48,8441],[48,8442,48,8450],[48,8451,48,8459],[48,8460,48,8468],[48,8379,48,8387],[48,8388,48,8396],[48,8397,48,8405],[48,8406,48,8414],[48,8415,48,8423],[48,8334,48,8342],[48,8343,48,8351],[48,8352,48,8360],[48,8361,48,8369],[48,8370,48,8378],[48,8289,48,8297],[48,8298,48,8306],[48,8307,48,8315],[48,8316,48,8324],[48,8325,48,8333],[48,8604,48,8612],[48,8613,48,8621],[48,8622,48,8630],[48,8631,48,8639],[48,8640,48,8648],[48,8559,48,8567],[48,8568,48,8576],[48,8577,48,8585],[48,8586,48,8594],[48,8595,48,8603],[48,8514,48,8522],[48,8523,48,8531],[48,8532,48,8540],[48,8541,48,8549],[48,8550,48,8558],[48,8469,48,8477],[48,8478,48,8486],[48,8487,48,8495],[48,8496,48,8504],[48,8505,48,8513],[48,8784,48,8792],[48,8793,48,8801],[48,8802,48,8810],[48,8811,48,8819],[48,8820,48,8828],[48,8739,48,8747],[48,8748,48,8756],[48,8757,48,8765],[48,8766,48,8774],[48,8775,48,8783],[48,8694,48,8702],[48,8703,48,8711],[48,8712,48,8720],[48,8721,48,8729],[48,8730,48,8738],[48,8649,48,8657],[48,8658,48,8666],[48,8667,48,8675],[48,8676,48,8684],[48,8685,48,8693],[48,8964,48,8972],[48,8973,48,8981],[48,8982,48,8990],[48,8991,48,8999]],"merged_total":3651,"flags":["merged_cut"]}
["Name of Insurance Intermediary:-",null,{"$f":"'Form 1'!C1","v":0},null,null,null,"Year ended : ",{"$f":"'Form 1'!I1","v":""}]
[]
[]
["Form 5"]
["Total Premiums, Total Commissions and Other Income"]
[]
[]
["Total Premiums and Commissions"]
[]
["A. Long Term Business"]
[]
[null,"Authorised Undertakings",null,"\"Approved\" Undertakings ",null,"Unauthorised Undertakings ",null,"Total"]
[null,"Premiums","Commission","Premiums","Commission","Premiums","Commission","Premiums","Commission"]
[null,{"$f":"IF('Cover Sheet'!$E$25=\"\",\"\",'Cover Sheet'!$E$25)","v":""},{"$f":"IF('Cover Sheet'!$E$25=\"\",\"\",'Cover Sheet'!$E$25)","v":""},{"$f":"IF('Cover Sheet'!$E$25=\"\",\"\",'Cover Sheet'!$E$25)","v":""},{"$f":"IF('Cover Sheet'!$E$25=\"\",\"\",'Cover Sheet'!$E$25)","v":""},{"$f":"IF('Cover Sheet'!$E$25=\"\",\"\",'Cover Sheet'!$E$25)","v":""},{"$f":"IF('Cover Sheet'!$E$25=\"\",\"\",'Cover Sheet'!$E$25)","v":""},{"$f":"IF('Cover Sheet'!$E$25=\"\",\"\",'Cover Sheet'!$E$25)","v":""},{"$f":"IF('Cover Sheet'!$E$25=\"\",\"\",'Cover Sheet'!$E$25)","v":""}]
["Insurance premiums written and commissions received and receivable in relation to commitments where Malta is the country of commitment",{"$f":"'Form 1'!C16","v":0},{"$f":"'Form 1'!D16","v":0},{"$f":"'Form 1'!E16","v":0},{"$f":"'Form 1'!F16","v":0},null,null,{"$f":"B15+D15+F15","v":0},0,null,101]
["Reinsurance premiums written and commissions received and receivable in relation to commitments where Malta is the country of commitment",{"$f":"'Form 3'!C16","v":0},{"$f":"'Form 3'!D16","v":0},null,null,{"$f":"'Form 3'!E16","v":0},{"$f":"'Form 3'!F16","v":0},0,0,null,102]
["Insurance premiums written and commissions received and receivable in relation to commitments where Malta is not the country of commitment",{"$f":"'Form 2'!C16","v":0},{"$f":"'Form 2'!D16","v":0},{"$f":"'Form 2'!E16","v":0},{"$f":"'Form 2'!F16","v":0},null,null,0,0,null,103]
["Reinsurance premiums written and commissions received and receivable in relation to commitments where Malta is not the country of commitment",{"$f":"'Form 4'!C16","v":0},{"$f":"'Form 4'!D16","v":0},null,null,{"$f":"'Form 4'!E16","v":0},{"$f":"'Form 4'!F16","v":0},0,0,null,104]
["TOTAL PREMIUMS AND COMMISSION",{"$f":"SUM(B15:B18)","v":0},0,0,0,0,0,0,0,null,1]
[]
[]
["B. General Business"]
[]
[null,"Authorised Undertakings",null,"\"Approved\" Undertakings ",null,"Unauthorised Undertakings ",null,"Total"]
[null,"Premiums","Commission","Premiums","Commission","Premiums","Commission","Premiums","Commission"]
[null,{"$f":"IF('Cover Sheet'!$E$25=\"\",\"\",'Cover Sheet'!$E$25)","v":""},{"$f":"IF('Cover Sheet'!$E$25=\"\",\"\",'Cover Sheet'!$E$25)","v":""},{"$f":"IF('Cover Sheet'!$E$25=\"\",\"\",'Cover Sheet'!$E$25)","v":""},{"$f":"IF('Cover Sheet'!$E$25=\"\",\"\",'Cover Sheet'!$E$25)","v":""},{"$f":"IF('Cover Sheet'!$E$25=\"\",\"\",'Cover Sheet'!$E$25)","v":""},{"$f":"IF('Cover Sheet'!$E$25=\"\",\"\",'Cover Sheet'!$E$25)","v":""},{"$f":"IF('Cover Sheet'!$E$25=\"\",\"\",'Cover Sheet'!$E$25)","v":""},{"$f":"IF('Cover Sheet'!$E$25=\"\",\"\",'Cover Sheet'!$E$25)","v":""}]
["Insurance premiums written and commissions received and receivable in relation to risks situated in Malta",{"$f":"'Form 1'!C31","v":0},{"$f":"'Form 1'!D31","v":0},{"$f":"'Form 1'!E31","v":0},{"$f":"'Form 1'!F31","v":0},{"$f":"'Form 1'!G31","v":0},{"$f":"'Form 1'!H31","v":0},{"$f":"B27+D27+F27","v":0},0,null,201]
["Reinsurance premiums written and commissions received and receivable in relation to risks situated in Malta",{"$f":"'Form 3'!C31","v":100000},{"$f":"'Form 3'!D31","v":50000},null,null,{"$f":"'Form 3'!E31","v":0},{"$f":"'Form 3'!F31","v":0},100000,50000,null,202]
["Insurance premiums written and commissions received and receivable in relation to risks situated outside Malta",{"$f":"'Form 2'!C31","v":100000},{"$f":"'Form 2'!D31","v":50000},{"$f":"'Form 2'!E31","v":0},{"$f":"'Form 2'!F31","v":0},null,null,100000,50000,null,203]
["Reinsurance premiums written and commissions received and receivable in relation to risks situated outside Malta",{"$f":"'Form 4'!C31","v":0},{"$f":"'Form 4'!D31","v":0},null,null,{"$f":"'Form 4'!E31","v":0},{"$f":"'Form 4'!F31","v":0},0,0,null,204]
["TOTAL PREMIUMS AND COMMISSION",{"$f":"SUM(B27:B30)","v":200000},100000,0,0,0,0,200000,100000,null,2]
[]
[]
["Total Gross Commission as per Form 5",null,null,null,null,null,{"$f":"I19+I31","v":100000}]
["Commission as per audited Financial Statements"]
[]
["Commission Check1",null,null,null,null,null,{"$f":"G34-G35","v":100000}]
[]
[]
["Other Income"]
["Other income relating or arising from insurance intermediaries activities2"]
[]
[]
[]
[]
["Notes"]
[]
["1     If the discrepancy is material, please attach a reconcilation of Gross Commission as per Form 5 with Commission as per the audited Financial Statements"]
["2     Please attach a breakdown of such income"]

{"sheet":"F5","index":13,"n_rows":81,"n_cols":6,"rows_kept":81,"cut":false,"hidden":true,"merged":[]}
["SheetCode","FieldCode","FICode","Date","ColNum","Value"]
["F5",101,{"$f":"'Cover Sheet'!$E$19","v":0},{"$f":"'Cover Sheet'!$E$23","v":"00:00:00"},1,{"$f":"'Form 5'!B15/'Cover Sheet'!$E$27","v":{"$error":"#DIV/0!"}}]
["F5",102,{"$f":"'Cover Sheet'!$E$19","v":0},{"$f":"'Cover Sheet'!$E$23","v":"00:00:00"},1,{"$f":"'Form 5'!B16/'Cover Sheet'!$E$27","v":{"$error":"#DIV/0!"}}]
["F5",103,{"$f":"'Cover Sheet'!$E$19","v":0},{"$f":"'Cover Sheet'!$E$23","v":"00:00:00"},1,{"$f":"'Form 5'!B17/'Cover Sheet'!$E$27","v":{"$error":"#DIV/0!"}}]
["F5",104,{"$f":"'Cover Sheet'!$E$19","v":0},{"$f":"'Cover Sheet'!$E$23","v":"00:00:00"},1,{"$f":"'Form 5'!B18/'Cover Sheet'!$E$27","v":{"$error":"#DIV/0!"}}]
["F5",1,{"$f":"'Cover Sheet'!$E$19","v":0},{"$f":"'Cover Sheet'!$E$23","v":"00:00:00"},1,{"$f":"'Form 5'!B19/'Cover Sheet'!$E$27","v":{"$error":"#DIV/0!"}}]
["F5",201,{"$f":"'Cover Sheet'!$E$19","v":0},{"$f":"'Cover Sheet'!$E$23","v":"00:00:00"},1,{"$f":"'Form 5'!B27/'Cover Sheet'!$E$27","v":{"$error":"#DIV/0!"}}]
["F5",202,{"$f":"'Cover Sheet'!$E$19","v":0},{"$f":"'Cover Sheet'!$E$23","v":"00:00:00"},1,{"$f":"'Form 5'!B28/'Cover Sheet'!$E$27","v":{"$error":"#DIV/0!"}}]
["F5",203,{"$f":"'Cover Sheet'!$E$19","v":0},{"$f":"'Cover Sheet'!$E$23","v":"00:00:00"},1,{"$f":"'Form 5'!B29/'Cover Sheet'!$E$27","v":{"$error":"#DIV/0!"}}]
["F5",204,{"$f":"'Cover Sheet'!$E$19","v":0},{"$f":"'Cover Sheet'!$E$23","v":"00:00:00"},1,{"$f":"'Form 5'!B30/'Cover Sheet'!$E$27","v":{"$error":"#DIV/0!"}}]
["F5",2,{"$f":"'Cover Sheet'!$E$19","v":0},{"$f":"'Cover Sheet'!$E$23","v":"00:00:00"},1,{"$f":"'Form 5'!B31/'Cover Sheet'!$E$27","v":{"$error":"#DIV/0!"}}]
["F5",101,{"$f":"'Cover Sheet'!$E$19","v":0},{"$f":"'Cover Sheet'!$E$23","v":"00:00:00"},2,{"$f":"'Form 5'!C15/'Cover Sheet'!$E$27","v":{"$error":"#DIV/0!"}}]
["F5",102,{"$f":"'Cover Sheet'!$E$19","v":0},{"$f":"'Cover Sheet'!$E$23","v":"00:00:00"},2,{"$f":"'Form 5'!C16/'Cover Sheet'!$E$27","v":{"$error":"#DIV/0!"}}]
["F5",103,{"$f":"'Cover Sheet'!$E$19","v":0},{"$f":"'Cover Sheet'!$E$23","v":"00:00:00"},2,{"$f":"'Form 5'!C17/'Cover Sheet'!$E$27","v":{"$error":"#DIV/0!"}}]
["F5",104,{"$f":"'Cover Sheet'!$E$19","v":0},{"$f":"'Cover Sheet'!$E$23","v":"00:00:00"},2,{"$f":"'Form 5'!C18/'Cover Sheet'!$E$27","v":{"$error":"#DIV/0!"}}]
["F5",1,{"$f":"'Cover Sheet'!$E$19","v":0},{"$f":"'Cover Sheet'!$E$23","v":"00:00:00"},2,{"$f":"'Form 5'!C19/'Cover Sheet'!$E$27","v":{"$error":"#DIV/0!"}}]
["F5",201,{"$f":"'Cover Sheet'!$E$19","v":0},{"$f":"'Cover Sheet'!$E$23","v":"00:00:00"},2,{"$f":"'Form 5'!D27/'Cover Sheet'!$E$27","v":{"$error":"#DIV/0!"}}]
["F5",202,{"$f":"'Cover Sheet'!$E$19","v":0},{"$f":"'Cover Sheet'!$E$23","v":"00:00:00"},2,{"$f":"'Form 5'!D28/'Cover Sheet'!$E$27","v":{"$error":"#DIV/0!"}}]
["F5",203,{"$f":"'Cover Sheet'!$E$19","v":0},{"$f":"'Cover Sheet'!$E$23","v":"00:00:00"},2,{"$f":"'Form 5'!D29/'Cover Sheet'!$E$27","v":{"$error":"#DIV/0!"}}]
["F5",204,{"$f":"'Cover Sheet'!$E$19","v":0},{"$f":"'Cover Sheet'!$E$23","v":"00:00:00"},2,{"$f":"'Form 5'!D30/'Cover Sheet'!$E$27","v":{"$error":"#DIV/0!"}}]
["F5",2,{"$f":"'Cover Sheet'!$E$19","v":0},{"$f":"'Cover Sheet'!$E$23","v":"00:00:00"},2,{"$f":"'Form 5'!D31/'Cover Sheet'!$E$27","v":{"$error":"#DIV/0!"}}]
["F5",101,{"$f":"'Cover Sheet'!$E$19","v":0},{"$f":"'Cover Sheet'!$E$23","v":"00:00:00"},3,{"$f":"'Form 5'!D15/'Cover Sheet'!$E$27","v":{"$error":"#DIV/0!"}}]
["F5",102,{"$f":"'Cover Sheet'!$E$19","v":0},{"$f":"'Cover Sheet'!$E$23","v":"00:00:00"},3,{"$f":"'Form 5'!D16/'Cover Sheet'!$E$27","v":{"$error":"#DIV/0!"}}]
["F5",103,{"$f":"'Cover Sheet'!$E$19","v":0},{"$f":"'Cover Sheet'!$E$23","v":"00:00:00"},3,{"$f":"'Form 5'!D17/'Cover Sheet'!$E$27","v":{"$error":"#DIV/0!"}}]
["F5",104,{"$f":"'Cover Sheet'!$E$19","v":0},{"$f":"'Cover Sheet'!$E$23","v":"00:00:00"},3,{"$f":"'Form 5'!D18/'Cover Sheet'!$E$27","v":{"$error":"#DIV/0!"}}]
["F5",1,{"$f":"'Cover Sheet'!$E$19","v":0},{"$f":"'Cover Sheet'!$E$23","v":"00:00:00"},3,{"$f":"'Form 5'!D19/'Cover Sheet'!$E$27","v":{"$error":"#DIV/0!"}}]
["F5",201,{"$f":"'Cover Sheet'!$E$19","v":0},{"$f":"'Cover Sheet'!$E$23","v":"00:00:00"},3,{"$f":"'Form 5'!D27/'Cover Sheet'!$E$27","v":{"$error":"#DIV/0!"}}]
["F5",202,{"$f":"'Cover Sheet'!$E$19","v":0},{"$f":"'Cover Sheet'!$E$23","v":"00:00:00"},3,{"$f":"'Form 5'!D28/'Cover Sheet'!$E$27","v":{"$error":"#DIV/0!"}}]
["F5",203,{"$f":"'Cover Sheet'!$E$19","v":0},{"$f":"'Cover Sheet'!$E$23","v":"00:00:00"},3,{"$f":"'Form 5'!D29/'Cover Sheet'!$E$27","v":{"$error":"#DIV/0!"}}]
["F5",204,{"$f":"'Cover Sheet'!$E$19","v":0},{"$f":"'Cover Sheet'!$E$23","v":"00:00:00"},3,{"$f":"'Form 5'!D30/'Cover Sheet'!$E$27","v":{"$error":"#DIV/0!"}}]
["F5",2,{"$f":"'Cover Sheet'!$E$19","v":0},{"$f":"'Cover Sheet'!$E$23","v":"00:00:00"},3,{"$f":"'Form 5'!D31/'Cover Sheet'!$E$27","v":{"$error":"#DIV/0!"}}]
["F5",101,{"$f":"'Cover Sheet'!$E$19","v":0},{"$f":"'Cover Sheet'!$E$23","v":"00:00:00"},4,{"$f":"'Form 5'!E15/'Cover Sheet'!$E$27","v":{"$error":"#DIV/0!"}}]
["F5",102,{"$f":"'Cover Sheet'!$E$19","v":0},{"$f":"'Cover Sheet'!$E$23","v":"00:00:00"},4,{"$f":"'Form 5'!E16/'Cover Sheet'!$E$27","v":{"$error":"#DIV/0!"}}]
["F5",103,{"$f":"'Cover Sheet'!$E$19","v":0},{"$f":"'Cover Sheet'!$E$23","v":"00:00:00"},4,{"$f":"'Form 5'!E17/'Cover Sheet'!$E$27","v":{"$error":"#DIV/0!"}}]
["F5",104,{"$f":"'Cover Sheet'!$E$19","v":0},{"$f":"'Cover Sheet'!$E$23","v":"00:00:00"},4,{"$f":"'Form 5'!E18/'Cover Sheet'!$E$27","v":{"$error":"#DIV/0!"}}]
["F5",1,{"$f":"'Cover Sheet'!$E$19","v":0},{"$f":"'Cover Sheet'!$E$23","v":"00:00:00"},4,{"$f":"'Form 5'!E19/'Cover Sheet'!$E$27","v":{"$error":"#DIV/0!"}}]
["F5",201,{"$f":"'Cover Sheet'!$E$19","v":0},{"$f":"'Cover Sheet'!$E$23","v":"00:00:00"},4,{"$f":"'Form 5'!E27/'Cover Sheet'!$E$27","v":{"$error":"#DIV/0!"}}]
["F5",202,{"$f":"'Cover Sheet'!$E$19","v":0},{"$f":"'Cover Sheet'!$E$23","v":"00:00:00"},4,{"$f":"'Form 5'!E28/'Cover Sheet'!$E$27","v":{"$error":"#DIV/0!"}}]
["F5",203,{"$f":"'Cover Sheet'!$E$19","v":0},{"$f":"'Cover Sheet'!$E$23","v":"00:00:00"},4,{"$f":"'Form 5'!E29/'Cover Sheet'!$E$27","v":{"$error":"#DIV/0!"}}]
["F5",204,{"$f":"'Cover Sheet'!$E$19","v":0},{"$f":"'Cover Sheet'!$E$23","v":"00:00:00"},4,{"$f":"'Form 5'!E30/'Cover Sheet'!$E$27","v":{"$error":"#DIV/0!"}}]
["F5",2,{"$f":"'Cover Sheet'!$E$19","v":0},{"$f":"'Cover Sheet'!$E$23","v":"00:00:00"},4,{"$f":"'Form 5'!E31/'Cover Sheet'!$E$27","v":{"$error":"#DIV/0!"}}]
["F5",101,{"$f":"'Cover Sheet'!$E$19","v":0},{"$f":"'Cover Sheet'!$E$23","v":"00:00:00"},5,{"$f":"'Form 5'!F15/'Cover Sheet'!$E$27","v":{"$error":"#DIV/0!"}}]
["F5",102,{"$f":"'Cover Sheet'!$E$19","v":0},{"$f":"'Cover Sheet'!$E$23","v":"00:00:00"},5,{"$f":"'Form 5'!F16/'Cover Sheet'!$E$27","v":{"$error":"#DIV/0!"}}]
["F5",103,{"$f":"'Cover Sheet'!$E$19","v":0},{"$f":"'Cover Sheet'!$E$23","v":"00:00:00"},5,{"$f":"'Form 5'!F17/'Cover Sheet'!$E$27","v":{"$error":"#DIV/0!"}}]
["F5",104,{"$f":"'Cover Sheet'!$E$19","v":0},{"$f":"'Cover Sheet'!$E$23","v":"00:00:00"},5,{"$f":"'Form 5'!F18/'Cover Sheet'!$E$27","v":{"$error":"#DIV/0!"}}]
["F5",1,{"$f":"'Cover Sheet'!$E$19","v":0},{"$f":"'Cover Sheet'!$E$23","v":"00:00:00"},5,{"$f":"'Form 5'!F19/'Cover Sheet'!$E$27","v":{"$error":"#DIV/0!"}}]
["F5",201,{"$f":"'Cover Sheet'!$E$19","v":0},{"$f":"'Cover Sheet'!$E$23","v":"00:00:00"},5,{"$f":"'Form 5'!F27/'Cover Sheet'!$E$27","v":{"$error":"#DIV/0!"}}]
["F5",202,{"$f":"'Cover Sheet'!$E$19","v":0},{"$f":"'Cover Sheet'!$E$23","v":"00:00:00"},5,{"$f":"'Form 5'!F28/'Cover Sheet'!$E$27","v":{"$error":"#DIV/0!"}}]
["F5",203,{"$f":"'Cover Sheet'!$E$19","v":0},{"$f":"'Cover Sheet'!$E$23","v":"00:00:00"},5,{"$f":"'Form 5'!F29/'Cover Sheet'!$E$27","v":{"$error":"#DIV/0!"}}]
["F5",204,{"$f":"'Cover Sheet'!$E$19","v":0},{"$f":"'Cover Sheet'!$E$23","v":"00:00:00"},5,{"$f":"'Form 5'!F30/'Cover Sheet'!$E$27","v":{"$error":"#DIV/0!"}}]
["F5",2,{"$f":"'Cover Sheet'!$E$19","v":0},{"$f":"'Cover Sheet'!$E$23","v":"00:00:00"},5,{"$f":"'Form 5'!F31/'Cover Sheet'!$E$27","v":{"$error":"#DIV/0!"}}]
["F5",101,{"$f":"'Cover Sheet'!$E$19","v":0},{"$f":"'Cover Sheet'!$E$23","v":"00:00:00"},6,{"$f":"'Form 5'!G15/'Cover Sheet'!$E$27","v":{"$error":"#DIV/0!"}}]
["F5",102,{"$f":"'Cover Sheet'!$E$19","v":0},{"$f":"'Cover Sheet'!$E$23","v":"00:00:00"},6,{"$f":"'Form 5'!G16/'Cover Sheet'!$E$27","v":{"$error":"#DIV/0!"}}]
["F5",103,{"$f":"'Cover Sheet'!$E$19","v":0},{"$f":"'Cover Sheet'!$E$23","v":"00:00:00"},6,{"$f":"'Form 5'!G17/'Cover Sheet'!$E$27","v":{"$error":"#DIV/0!"}}]
["F5",104,{"$f":"'Cover Sheet'!$E$19","v":0},{"$f":"'Cover Sheet'!$E$23","v":"00:00:00"},6,{"$f":"'Form 5'!G18/'Cover Sheet'!$E$27","v":{"$error":"#DIV/0!"}}]
["F5",1,{"$f":"'Cover Sheet'!$E$19","v":0},{"$f":"'Cover Sheet'!$E$23","v":"00:00:00"},6,{"$f":"'Form 5'!G19/'Cover Sheet'!$E$27","v":{"$error":"#DIV/0!"}}]
["F5",201,{"$f":"'Cover Sheet'!$E$19","v":0},{"$f":"'Cover Sheet'!$E$23","v":"00:00:00"},6,{"$f":"'Form 5'!G27/'Cover Sheet'!$E$27","v":{"$error":"#DIV/0!"}}]
["F5",202,{"$f":"'Cover Sheet'!$E$19","v":0},{"$f":"'Cover Sheet'!$E$23","v":"00:00:00"},6,{"$f":"'Form 5'!G28/'Cover Sheet'!$E$27","v":{"$error":"#DIV/0!"}}]
["F5",203,{"$f":"'Cover Sheet'!$E$19","v":0},{"$f":"'Cover Sheet'!$E$23","v":"00:00:00"},6,{"$f":"'Form 5'!G29/'Cover Sheet'!$E$27","v":{"$error":"#DIV/0!"}}]
["F5",204,{"$f":"'Cover Sheet'!$E$19","v":0},{"$f":"'Cover Sheet'!$E$23","v":"00:00:00"},6,{"$f":"'Form 5'!G30/'Cover Sheet'!$E$27","v":{"$error":"#DIV/0!"}}]
["F5",2,{"$f":"'Cover Sheet'!$E$19","v":0},{"$f":"'Cover Sheet'!$E$23","v":"00:00:00"},6,{"$f":"'Form 5'!G31/'Cover Sheet'!$E$27","v":{"$error":"#DIV/0!"}}]
["F5",101,{"$f":"'Cover Sheet'!$E$19","v":0},{"$f":"'Cover Sheet'!$E$23","v":"00:00:00"},7,{"$f":"'Form 5'!H15/'Cover Sheet'!$E$27","v":{"$error":"#DIV/0!"}}]
["F5",102,{"$f":"'Cover Sheet'!$E$19","v":0},{"$f":"'Cover Sheet'!$E$23","v":"00:00:00"},7,{"$f":"'Form 5'!H16/'Cover Sheet'!$E$27","v":{"$error":"#DIV/0!"}}]
["F5",103,{"$f":"'Cover Sheet'!$E$19","v":0},{"$f":"'Cover Sheet'!$E$23","v":"00:00:00"},7,{"$f":"'Form 5'!H17/'Cover Sheet'!$E$27","v":{"$error":"#DIV/0!"}}]
["F5",104,{"$f":"'Cover Sheet'!$E$19","v":0},{"$f":"'Cover Sheet'!$E$23","v":"00:00:00"},7,{"$f":"'Form 5'!H18/'Cover Sheet'!$E$27","v":{"$error":"#DIV/0!"}}]
["F5",1,{"$f":"'Cover Sheet'!$E$19","v":0},{"$f":"'Cover Sheet'!$E$23","v":"00:00:00"},7,{"$f":"'Form 5'!H19/'Cover Sheet'!$E$27","v":{"$error":"#DIV/0!"}}]
["F5",201,{"$f":"'Cover Sheet'!$E$19","v":0},{"$f":"'Cover Sheet'!$E$23","v":"00:00:00"},7,{"$f":"'Form 5'!H27/'Cover Sheet'!$E$27","v":{"$error":"#DIV/0!"}}]
["F5",202,{"$f":"'Cover Sheet'!$E$19","v":0},{"$f":"'Cover Sheet'!$E$23","v":"00:00:00"},7,{"$f":"'Form 5'!H28/'Cover Sheet'!$E$27","v":{"$error":"#DIV/0!"}}]
["F5",203,{"$f":"'Cover Sheet'!$E$19","v":0},{"$f":"'Cover Sheet'!$E$23","v":"00:00:00"},7,{"$f":"'Form 5'!H29/'Cover Sheet'!$E$27","v":{"$error":"#DIV/0!"}}]
["F5",204,{"$f":"'Cover Sheet'!$E$19","v":0},{"$f":"'Cover Sheet'!$E$23","v":"00:00:00"},7,{"$f":"'Form 5'!H30/'Cover Sheet'!$E$27","v":{"$error":"#DIV/0!"}}]
["F5",2,{"$f":"'Cover Sheet'!$E$19","v":0},{"$f":"'Cover Sheet'!$E$23","v":"00:00:00"},7,{"$f":"'Form 5'!H31/'Cover Sheet'!$E$27","v":{"$error":"#DIV/0!"}}]
["F5",101,{"$f":"'Cover Sheet'!$E$19","v":0},{"$f":"'Cover Sheet'!$E$23","v":"00:00:00"},8,{"$f":"'Form 5'!I15/'Cover Sheet'!$E$27","v":{"$error":"#DIV/0!"}}]
["F5",102,{"$f":"'Cover Sheet'!$E$19","v":0},{"$f":"'Cover Sheet'!$E$23","v":"00:00:00"},8,{"$f":"'Form 5'!I16/'Cover Sheet'!$E$27","v":{"$error":"#DIV/0!"}}]
["F5",103,{"$f":"'Cover Sheet'!$E$19","v":0},{"$f":"'Cover Sheet'!$E$23","v":"00:00:00"},8,{"$f":"'Form 5'!I17/'Cover Sheet'!$E$27","v":{"$error":"#DIV/0!"}}]
["F5",104,{"$f":"'Cover Sheet'!$E$19","v":0},{"$f":"'Cover Sheet'!$E$23","v":"00:00:00"},8,{"$f":"'Form 5'!I18/'Cover Sheet'!$E$27","v":{"$error":"#DIV/0!"}}]
["F5",1,{"$f":"'Cover Sheet'!$E$19","v":0},{"$f":"'Cover Sheet'!$E$23","v":"00:00:00"},8,{"$f":"'Form 5'!I19/'Cover Sheet'!$E$27","v":{"$error":"#DIV/0!"}}]
["F5",201,{"$f":"'Cover Sheet'!$E$19","v":0},{"$f":"'Cover Sheet'!$E$23","v":"00:00:00"},8,{"$f":"'Form 5'!I27/'Cover Sheet'!$E$27","v":{"$error":"#DIV/0!"}}]
["F5",202,{"$f":"'Cover Sheet'!$E$19","v":0},{"$f":"'Cover Sheet'!$E$23","v":"00:00:00"},8,{"$f":"'Form 5'!I28/'Cover Sheet'!$E$27","v":{"$error":"#DIV/0!"}}]
["F5",203,{"$f":"'Cover Sheet'!$E$19","v":0},{"$f":"'Cover Sheet'!$E$23","v":"00:00:00"},8,{"$f":"'Form 5'!I29/'Cover Sheet'!$E$27","v":{"$error":"#DIV/0!"}}]
["F5",204,{"$f":"'Cover Sheet'!$E$19","v":0},{"$f":"'Cover Sheet'!$E$23","v":"00:00:00"},8,{"$f":"'Form 5'!I30/'Cover Sheet'!$E$27","v":{"$error":"#DIV/0!"}}]
["F5",2,{"$f":"'Cover Sheet'!$E$19","v":0},{"$f":"'Cover Sheet'!$E$23","v":"00:00:00"},8,{"$f":"'Form 5'!I31/'Cover Sheet'!$E$27","v":{"$error":"#DIV/0!"}}]

{"sheet":"Form 6","index":14,"n_rows":19,"n_cols":11,"rows_kept":19,"cut":false,"hidden":false,"merged":[[18,1,18,10],[0,4,0,7],[9,0,9,6],[10,0,10,6],[11,0,11,6],[13,0,13,6],[17,1,17,10]]}
["Name of Insurance Intermediary:-",null,null,null,{"$f":"'Cover Sheet'!E17","v":0},null,null,null,"Year ended :",{"$f":"'Cover Sheet'!E23","v":"00:00:00"}]
[]
["Form 6"]
["Debtors and Creditors in Respect of Insurance Transactions"]
[]
[]
[]
[null,null,null,null,null,null,null,"Current               i.e. due for less than 3 months","Due for 3 - 12 months","Due for 12 months and over","TOTAL"]
[null,null,null,null,null,null,null,"","","",""]
["Gross debtors in respect of insurance transactions at the end of the year",null,null,null,null,null,null,null,null,null,{"$f":"SUM(H10:J10)","v":0}]
["Provision for doubtful debts at the end of the year",null,null,null,null,null,null,null,null,null,{"$f":"SUM(H11:J11)","v":0}]
["Net debtors in respect of insurance transactions at the end of the year 1",null,null,null,null,null,null,{"$f":"H10-H11","v":0},{"$f":"I10-I11","v":0},{"$f":"J10-J11","v":0},{"$f":"SUM(H12:J12)","v":0}]
[]
["Creditors in respect of insurance transactions at the end of the year 2",null,null,null,null,null,null,null,null,null,{"$f":"SUM(H14:J14)","v":0}]
[]
[]
["Notes"]
[1,"Where total net debtors in respect of insurance transactions is not equal to trade debtors as per audited financial statements, please attach a reconciliation."]
[2,"Where total creditors in respect of insurance transactions is not equal to trade creditors as per audited financial statements, please attach a reconciliation."]

{"sheet":"Form 7","index":15,"n_rows":50,"n_cols":13,"rows_kept":50,"cut":false,"hidden":false,"merged":[[0,0,0,2],[0,3,0,7],[7,1,7,12],[49,1,49,12]]}
["Name of Insurance Intermediary:-",null,null,{"$f":"'Cover Sheet'!E17","v":0},null,null,null,null,null,"Year ended : ",null,{"$f":"'Cover Sheet'!E23","v":"00:00:00"}]
[]
["Form 7"]
["Monies Held in a Fiduciary Capacity - Chapter 8 in Part B of the Insurance Distribution Rules"]
[]
[null,"Jan","Feb","Mar","Apr","May","Jun","Jul","Aug","Sep","Oct","Nov","Dec"]
[null,"","","","","","","","","","","",""]
["Business of Insurance Intermediaries Account/s (Bank name and account number)","Balances at the end of each month as per accounting records"]
[]
[]
[]
[]
[]
[]
[]
[]
[]
[]
[]
[]
[]
[]
[]
[]
[]
[]
[]
[]
["Total balances of business of insurance intermediaries accounts",{"$f":"SUM(B9:B28)","v":0},0,0,0,0,0,0,0,0,0,0,0]
[]
["Approved short term assets (please provide descriprion)"]
[]
[]
[]
[]
[]
[]
[]
[]
["Total of approved short term assets",{"$f":"SUM(B32:B39)","v":0},0,0,0,0,0,0,0,0,0,0,0]
[]
["Net debtors in respect of insurance transactions",null,null,null,null,null,null,null,null,null,null,null,{"$f":"'Form 6'!K12","v":0}]
[]
["Total insurance transaction assets",{"$f":"B40+B42+B29","v":0},0,0,0,0,0,0,0,0,0,0,0]
[]
["Creditors in respect of insurance transactions (total insurance transactions liabilities)",null,null,null,null,null,null,null,null,null,null,null,{"$f":"'Form 6'!K14","v":0}]
[]
["Insurance Transactions Assets Less Liabilities",{"$f":"B44-B46","v":0},0,0,0,0,0,0,0,0,0,0,0]
[]
["Business of Insurance Intermediaries Account/s (Bank name and account number)","Balances at the end of each month as per bank statements"]

{"sheet":"Form 8A","index":16,"n_rows":33,"n_cols":6,"rows_kept":33,"cut":false,"hidden":false,"merged":[[16,1,16,4],[0,2,0,3],[4,1,4,4],[13,1,13,4],[14,1,14,4],[15,1,15,4],[28,1,28,4],[17,1,17,4],[18,1,18,4],[19,1,19,4],[20,1,20,4],[21,1,21,4],[22,1,22,4],[23,1,23,4],[24,1,24,4],[25,1,25,4],[26,1,26,4],[27,1,27,4]]}
["Name of Insurance Intermediary:-",null,{"$f":"'Cover Sheet'!E17","v":0},null,"                      Year ended:",{"$f":"'Cover Sheet'!E23","v":"00:00:00"}]
[]
["Form 8A: Own Funds of Enrolled Companies - Chapter 4 of the Insurance Distribution Rules"]
[]
[null,"Description",null,null,null,""]
[null,"Shareholders' Funds"]
[null,"Paid Up Share Capital"]
[null,"Retained Earnings"]
[null,"Other Reserves"]
[null,"Total Shareholders' Funds",null,null,null,{"$f":"F7+F8+F9","v":0}]
[]
[null,"Less: Inadmissible Assets (Paragraph 4.6.3 of Chapter 4 of the Insurance Distribution Rules)"]
["a","Any asset which is deemed to be an intangible asset by International Financial Reporting Standards/GAPSME"]
["b","Any asset in respect of which the expected future economic benefits will only be derived if sufficient future taxable profits are earned, including deferred tax"]
["c","Any asset which is not controlled by the company by virtue of legal ownership"]
["d","Prepayments and accrued income"]
["e","Any earnest/deposit given in respect of the execution of a promise of sale/transfer of movable or immovable property"]
["f","Immovable property which serves, or is intended to serve, as a place of habitation"]
["g","Movable property which does not form part of the administrative services and organisation of the company for securing business"]
["h","Assets which are hypothecated, pledged or given as guarantee in any manner to third parties"]
["i","Any direct or indirect interest in any of the company’s own shares"]
["j","Shares in enrolled companies or authorised undertakings, other than securities listed on a recognised investment exchange in Malta "]
["k","Debts in respect of insurance transactions outstanding for more than 12 months from invoice date (net of provisions for doubtful debts)",null,null,null,{"$f":"'Form 6'!J12","v":0}]
["l","Loans and advances which are not secured to the satisfaction of the competent authority"]
["m","Credits resulting from cheques, drafts, notes or other bills of exchange returned unpaid"]
["n","Loans in excess of 25% of total assets less the value of items specified in  (a) to (m) above"]
["o","Loans, investments in equities/debentures/bonds, to/of any one company/institution, in excess of 10% of total assets less items (a) to (m) above"]
["p","Investment property/properties in excess of 10% of total assets less the value of items (a) to (m) above. "]
[null,"Total Inadmissible Assets",null,null,null,{"$f":"SUM(F13:F28)","v":0}]
[]
[null,"Actual Own Funds",null,null,null,{"$f":"F10-F29","v":0}]
[null,"Required Own Funds (Schedule to Chapter 4 of the Insurance Distribution Rules)"]
[null,"Excess/Deficiency in Own Funds",null,null,null,{"$f":"F31-F32","v":0}]

{"sheet":"Form 8B","index":17,"n_rows":26,"n_cols":7,"rows_kept":26,"cut":false,"hidden":false,"merged":[[0,9,0,10],[9,5,9,6],[11,5,11,6],[13,5,13,6],[15,5,15,6]]}
["Name of Insurance Intermediary:-",null,null,null,{"$f":"'Cover Sheet'!E17","v":0},"Year ended:",{"$f":"'Cover Sheet'!E23","v":"00:00:00"}]
[]
["Form 8B: "]
["Own Funds of Enrolled Individuals"]
["Chapter 4 of the Insurance Distribution Rules"]
[]
[]
[]
[]
[null,null,"Form of Own Funds:-"]
[]
[null,null,"Name of Bank or Credit Institution:-"]
[]
[null,null,"Branch (if applicable) :-"]
[]
[null,null,"Renewal date of bank guarantee or letter of credit (if applicable):-"]
[]
[]
[]
[null,null,null,null,null,null,""]
[]
[null,null,"Actual Own Funds (i.e. value of bank guarantee or letter of credit)"]
[]
[null,null,"Required Own Funds (Schedule to the Rule)"]
[]
[null,null,"Excess/Deficiency in Own Funds",null,null,null,{"$f":"G22-G24","v":0}]

{"sheet":"Form 9","index":18,"n_rows":28,"n_cols":10,"rows_kept":28,"cut":false,"hidden":false,"merged":[[12,0,13,8],[12,9,13,9],[0,4,0,7],[8,0,9,8],[8,9,9,9],[10,0,11,8],[10,9,11,9],[14,0,15,8],[14,9,15,9],[16,0,17,8],[16,9,17,9],[18,0,19,8],[18,9,19,9]]}
["Name of Insurance Intermediary:-",null,null,null,{"$f":"'Cover Sheet'!E17","v":0},null,null,null,"Year ended : ",{"$f":"'Cover Sheet'!E23","v":"00:00:00"}]
[]
["Form 9"]
["Fidelity Bond"]
["Chapter 9 of the Insurance Distribution Rules"]
[]
[]
[null,null,null,null,null,null,null,null,null,""]
["(1) Average amount of outstanding debts in respect of insurance intermediaries transactions (net of provision for doubtful debts) during the year                                                                  ",null,null,null,null,null,null,null,null,{"$f":"'Form 6'!K12","v":0}]
[]
["(2) Document duty charged on policies and endorsements thereon during the year"]
[]
["(3) 25% of the sum of gross premiums receivable and document duty charged during the year",null,null,null,null,null,null,null,null,{"$f":"0.25*(J11+'Form 5'!H19+'Form 5'!H31)","v":50000}]
[]
["(4) Excess of outstanding debts over premium computation [(1) - (3)]",null,null,null,null,null,null,null,null,{"$f":"J9-J13","v":-50000}]
[]
["(5) Excess of actual own funds over required own funds i.e. excess own funds",null,null,null,null,null,null,null,null,{"$f":"IF('Form 8B'!G26=0,'Form 8A'!F33,'Form 8B'!G26)","v":0}]
[]
["(6) Required amount of fidelity bond for the next year [(4)-(5)]",null,null,null,null,null,null,null,null,{"$f":"IF(J15>0,IF(J17>0,IF(J15-J17>0, J15-J17,0),J15),0)","v":0}]
[]
[]
[]
[]
[]
["Existing amount of fidelity bond (if applicable)"]
[]
["Required increase in fidelity bond",null,null,null,null,null,null,null,null,{"$f":"IF(J19>J25,ROUND(J19-J25,0),\"Not applicable\")","v":"Not applicable"}]
["Amount by which fidelity bond can be decreased",null,null,null,null,null,null,null,null,{"$f":"IF(J25>J19,ROUND(J25-J19,0),\"Not applicable\")","v":"Not applicable"}]

{"sheet":"Form 10A","index":19,"n_rows":1810,"n_cols":25,"rows_kept":1810,"cut":false,"hidden":false,"merged":[[1124,19,1124,21],[0,1,0,2],[4,0,4,24],[7,0,9,0],[7,1,9,1],[7,2,7,10],[7,11,7,13],[7,14,7,21],[7,22,7,24],[1124,8,1124,10]]}
["Name of Insurance Intermediary:-",{"$f":"'Cover Sheet'!E17","v":0},null,"Year ended : ",{"$f":"IF('Cover Sheet'!$E$23=\"\",\"\",'Cover Sheet'!$E$23)","v":""}]
[]
["Form 10A"]
["Spread of Business by Class of Business of Enrolled Insurance Brokers"]
["Details of the names of insurance undertakings (whether authorised or not) and the amount of premiums placed with each undertaking"]
[]
[]
["Name of  insurer or association of underwriters ","Insurance/      Reinsurance","Long Term Business Classes",null,null,null,null,null,null,null,null,"Long Term Business",null,null,"General Business Groups of Classes",null,null,null,null,null,null,null,"General Business"]
[null,null,"Life & Annuity","Marriage & Birth","Linked Long Term","Permanent Health","Tontines","Capital Redemption","Pension Fund Management","Collective insurance","Social Insurance","Total Premiums","Risk Transfer ","Percentage","Accident & Health","Motor","Marine & Transport","Aviation","Fire & Other Damage to Property","Liability","Credit & Suretyship","General","Total Premiums","Risk Transfer","Percentage"]
[null,null,"I","II","III","IV","V","VI","VII","VIII","IX",{"$f":"IF('Cover Sheet'!$E$25=\"\",\"\",'Cover Sheet'!$E$25)","v":""},"YES or NO","%",1,2,3,4,5,6,7,8,{"$f":"IF('Cover Sheet'!$E$25=\"\",\"\",'Cover Sheet'!$E$25)","v":""},"Y/N","%"]
["Authorised Undertakings with Head Office in Malta"]
[null,null,null,null,null,null,null,null,null,null,null,{"$f":"SUM(C12:K12)","v":0},null,{"$f":"L12/$L$1121*100","v":{"$error":"#DIV/0!"}},null,null,null,null,null,null,null,null,{"$f":"SUM(O12:V12)","v":0},null,{"$f":"W12/$W$1121*100","v":{"$error":"#DIV/0!"}}]
[null,null,null,null,null,null,null,null,null,null,null,{"$f":"SUM(C13:K13)","v":0},null,{"$f":"L13/$L$1121*100","v":{"$error":"#DIV/0!"}},null,null,null,null,null,null,null,null,{"$f":"SUM(O13:V13)","v":0},null,{"$f":"W13/$W$1121*100","v":{"$error":"#DIV/0!"}}]
[null,null,null,null,null,null,null,null,null,null,null,0,null,{"$error":"#DIV/0!"},null,null,null,null,null,null,null,null,0,null,{"$error":"#DIV/0!"}]
[null,null,null,null,null,null,null,null,null,null,null,0,null,{"$error":"#DIV/0!"},null,null,null,null,null,null,null,null,0,null,{"$error":"#DIV/0!"}]
[null,null,null,null,null,null,null,null,null,null,null,0,null,{"$error":"#DIV/0!"},null,null,null,null,null,null,null,null,0,null,{"$error":"#DIV/0!"}]
[null,null,null,null,null,null,null,null,null,null,null,0,null,{"$error":"#DIV/0!"},null,null,null,null,null,null,null,null,0,null,{"$error":"#DIV/0!"}]
[null,null,null,null,null,null,null,null,null,null,null,0,null,{"$error":"#DIV/0!"},null,null,null,null,null,null,null,null,0,null,{"$error":"#DIV/0!"}]
[null,null,null,null,null,null,null,null,null,null,null,0,null,{"$error":"#DIV/0!"},null,null,null,null,null,null,null,null,0,null,{"$error":"#DIV/0!"}]
[null,null,null,null,null,null,null,null,null,null,null,0,null,{"$error":"#DIV/0!"},null,null,null,null,null,null,null,null,0,null,{"$error":"#DIV/0!"}]
[null,null,null,null,null,null,null,null,null,null,null,0,null,{"$error":"#DIV/0!"},null,null,null,null,null,null,null,null,0,null,{"$error":"#DIV/0!"}]
[null,null,null,null,null,null,null,null,null,null,null,0,null,{"$error":"#DIV/0!"},null,null,null,null,null,null,null,null,0,null,{"$error":"#DIV/0!"}]
[null,null,null,null,null,null,null,null,null,null,null,0,null,{"$error":"#DIV/0!"},null,null,null,null,null,null,null,null,0,null,{"$error":"#DIV/0!"}]
[null,null,null,null,null,null,null,null,null,null,null,0,null,{"$error":"#DIV/0!"},null,null,null,null,null,null,null,null,0,null,{"$error":"#DIV/0!"}]
[null,null,null,null,null,null,null,null,null,null,null,0,null,{"$error":"#DIV/0!"},null,null,null,null,null,null,null,null,0,null,{"$error":"#DIV/0!"}]
[null,null,null,null,null,null,null,null,null,null,null,0,null,{"$error":"#DIV/0!"},null,null,null,null,null,null,null,null,0,null,{"$error":"#DIV/0!"}]
[null,null,null,null,null,null,null,null,null,null,null,0,null,{"$error":"#DIV/0!"},null,null,null,null,null,null,null,null,0,null,{"$error":"#DIV/0!"}]
[null,null,null,null,null,null,null,null,null,null,null,0,null,{"$error":"#DIV/0!"},null,null,null,null,null,null,null,null,0,null,{"$error":"#DIV/0!"}]
[null,null,null,null,null,null,null,null,null,null,null,0,null,{"$error":"#DIV/0!"},null,null,null,null,null,null,null,null,0,null,{"$error":"#DIV/0!"}]
[null,null,null,null,null,null,null,null,null,null,null,0,null,{"$error":"#DIV/0!"},null,null,null,null,null,null,null,null,0,null,{"$error":"#DIV/0!"}]
[null,null,null,null,null,null,null,null,null,null,null,0,null,{"$error":"#DIV/0!"},null,null,null,null,null,null,null,null,0,null,{"$error":"#DIV/0!"}]
[null,null,null,null,null,null,null,null,null,null,null,0,null,{"$error":"#DIV/0!"},null,null,null,null,null,null,null,null,0,null,{"$error":"#DIV/0!"}]
[null,null,null,null,null,null,null,null,null,null,null,0,null,{"$error":"#DIV/0!"},null,null,null,null,null,null,null,null,0,null,{"$error":"#DIV/0!"}]
[null,null,null,null,null,null,null,null,null,null,null,0,null,{"$error":"#DIV/0!"},null,null,null,null,null,null,null,null,0,null,{"$error":"#DIV/0!"}]
[null,null,null,null,null,null,null,null,null,null,null,0,null,{"$error":"#DIV/0!"},null,null,null,null,null,null,null,null,0,null,{"$error":"#DIV/0!"}]
[null,null,null,null,null,null,null,null,null,null,null,0,null,{"$error":"#DIV/0!"},null,null,null,null,null,null,null,null,0,null,{"$error":"#DIV/0!"}]
[null,null,null,null,null,null,null,null,null,null,null,0,null,{"$error":"#DIV/0!"},null,null,null,null,null,null,null,null,0,null,{"$error":"#DIV/0!"}]
[null,null,null,null,null,null,null,null,null,null,null,0,null,{"$error":"#DIV/0!"},null,null,null,null,null,null,null,null,0,null,{"$error":"#DIV/0!"}]
[null,null,null,null,null,null,null,null,null,null,null,0,null,{"$error":"#DIV/0!"},null,null,null,null,null,null,null,null,0,null,{"$error":"#DIV/0!"}]
[null,null,null,null,null,null,null,null,null,null,null,0,null,{"$error":"#DIV/0!"},null,null,null,null,null,null,null,null,0,null,{"$error":"#DIV/0!"}]
[null,null,null,null,null,null,null,null,null,null,null,0,null,{"$error":"#DIV/0!"},null,null,null,null,null,null,null,null,0,null,{"$error":"#DIV/0!"}]
[null,null,null,null,null,null,null,null,null,null,null,0,null,{"$error":"#DIV/0!"},null,null,null,null,null,null,null,null,0,null,{"$error":"#DIV/0!"}]
[null,null,null,null,null,null,null,null,null,null,null,0,null,{"$error":"#DIV/0!"},null,null,null,null,null,null,null,null,0,null,{"$error":"#DIV/0!"}]
[null,null,null,null,null,null,null,null,null,null,null,0,null,{"$error":"#DIV/0!"},null,null,null,null,null,null,null,null,0,null,{"$error":"#DIV/0!"}]
[null,null,null,null,null,null,null,null,null,null,null,0,null,{"$error":"#DIV/0!"},null,null,null,null,null,null,null,null,0,null,{"$error":"#DIV/0!"}]
[null,null,null,null,null,null,null,null,null,null,null,0,null,{"$error":"#DIV/0!"},null,null,null,null,null,null,null,null,0,null,{"$error":"#DIV/0!"}]
[null,null,null,null,null,null,null,null,null,null,null,0,null,{"$error":"#DIV/0!"},null,null,null,null,null,null,null,null,0,null,{"$error":"#DIV/0!"}]
[null,null,null,null,null,null,null,null,null,null,null,0,null,{"$error":"#DIV/0!"},null,null,null,null,null,null,null,null,0,null,{"$error":"#DIV/0!"}]
[null,null,null,null,null,null,null,null,null,null,null,0,null,{"$error":"#DIV/0!"},null,null,null,null,null,null,null,null,0,null,{"$error":"#DIV/0!"}]
[null,null,null,null,null,null,null,null,null,null,null,0,null,{"$error":"#DIV/0!"},null,null,null,null,null,null,null,null,0,null,{"$error":"#DIV/0!"}]
[null,null,null,null,null,null,null,null,null,null,null,0,null,{"$error":"#DIV/0!"},null,null,null,null,null,null,null,null,0,null,{"$error":"#DIV/0!"}]
[null,null,null,null,null,null,null,null,null,null,null,0,null,{"$error":"#DIV/0!"},null,null,null,null,null,null,null,null,0,null,{"$error":"#DIV/0!"}]
[null,null,null,null,null,null,null,null,null,null,null,0,null,{"$error":"#DIV/0!"},null,null,null,null,null,null,null,null,0,null,{"$error":"#DIV/0!"}]
[null,null,null,null,null,null,null,null,null,null,null,0,null,{"$error":"#DIV/0!"},null,null,null,null,null,null,null,null,0,null,{"$error":"#DIV/0!"}]
[null,null,null,null,null,null,null,null,null,null,null,0,null,{"$error":"#DIV/0!"},null,null,null,null,null,null,null,null,0,null,{"$error":"#DIV/0!"}]
[null,null,null,null,null,null,null,null,null,null,null,0,null,{"$error":"#DIV/0!"},null,null,null,null,null,null,null,null,0,null,{"$error":"#DIV/0!"}]
[null,null,null,null,null,null,null,null,null,null,null,0,null,{"$error":"#DIV/0!"},null,null,null,null,null,null,null,null,0,null,{"$error":"#DIV/0!"}]
[null,null,null,null,null,null,null,null,null,null,null,0,null,{"$error":"#DIV/0!"},null,null,null,null,null,null,null,null,0,null,{"$error":"#DIV/0!"}]
[null,null,null,null,null,null,null,null,null,null,null,0,null,{"$error":"#DIV/0!"},null,null,null,null,null,null,null,null,0,null,{"$error":"#DIV/0!"}]
[null,null,null,null,null,null,null,null,null,null,null,0,null,{"$error":"#DIV/0!"},null,null,null,null,null,null,null,null,0,null,{"$error":"#DIV/0!"}]
[null,null,null,null,null,null,null,null,null,null,null,0,null,{"$error":"#DIV/0!"},null,null,null,null,null,null,null,null,0,null,{"$error":"#DIV/0!"}]
[null,null,null,null,null,null,null,null,null,null,null,0,null,{"$error":"#DIV/0!"},null,null,null,null,null,null,null,null,0,null,{"$error":"#DIV/0!"}]
[null,null,null,null,null,null,null,null,null,null,null,0,null,{"$error":"#DIV/0!"},null,null,null,null,null,null,null,null,0,null,{"$error":"#DIV/0!"}]
[null,null,null,null,null,null,null,null,null,null,null,0,null,{"$error":"#DIV/0!"},null,null,null,null,null,null,null,null,0,null,{"$error":"#DIV/0!"}]
[null,null,null,null,null,null,null,null,null,null,null,0,null,{"$error":"#DIV/0!"},null,null,null,null,null,null,null,null,0,null,{"$error":"#DIV/0!"}]
[null,null,null,null,null,null,null,null,null,null,null,0,null,{"$error":"#DIV/0!"},null,null,null,null,null,null,null,null,0,null,{"$error":"#DIV/0!"}]
[null,null,null,null,null,null,null,null,null,null,null,0,null,{"$error":"#DIV/0!"},null,null,null,null,null,null,null,null,0,null,{"$error":"#DIV/0!"}]
[null,null,null,null,null,null,null,null,null,null,null,0,null,{"$error":"#DIV/0!"},null,null,null,null,null,null,null,null,0,null,{"$error":"#DIV/0!"}]
[null,null,null,null,null,null,null,null,null,null,null,0,null,{"$error":"#DIV/0!"},null,null,null,null,null,null,null,null,0,null,{"$error":"#DIV/0!"}]
[null,null,null,null,null,null,null,null,null,null,null,0,null,{"$error":"#DIV/0!"},null,null,null,null,null,null,null,null,0,null,{"$error":"#DIV/0!"}]
[null,null,null,null,null,null,null,null,null,null,null,0,null,{"$error":"#DIV/0!"},null,null,null,null,null,null,null,null,0,null,{"$error":"#DIV/0!"}]
[null,null,null,null,null,null,null,null,null,null,null,0,null,{"$error":"#DIV/0!"},null,null,null,null,null,null,null,null,0,null,{"$error":"#DIV/0!"}]
[null,null,null,null,null,null,null,null,null,null,null,0,null,{"$error":"#DIV/0!"},null,null,null,null,null,null,null,null,0,null,{"$error":"#DIV/0!"}]
[null,null,null,null,null,null,null,null,null,null,null,0,null,{"$error":"#DIV/0!"},null,null,null,null,null,null,null,null,0,null,{"$error":"#DIV/0!"}]
[null,null,null,null,null,null,null,null,null,null,null,0,null,{"$error":"#DIV/0!"},null,null,null,null,null,null,null,null,0,null,{"$error":"#DIV/0!"}]
[null,null,null,null,null,null,null,null,null,null,null,0,null,{"$error":"#DIV/0!"},null,null,null,null,null,null,null,null,0,null,{"$error":"#DIV/0!"}]
[null,null,null,null,null,null,null,null,null,null,null,{"$f":"SUM(C77:K77)","v":0},null,{"$f":"L77/$L$1121*100","v":{"$error":"#DIV/0!"}},null,null,null,null,null,null,null,null,{"$f":"SUM(O77:V77)","v":0},null,{"$f":"W77/$W$1121*100","v":{"$error":"#DIV/0!"}}]
[null,null,null,null,null,null,null,null,null,null,null,0,null,{"$error":"#DIV/0!"},null,null,null,null,null,null,null,null,0,null,{"$error":"#DIV/0!"}]
[null,null,null,null,null,null,null,null,null,null,null,0,null,{"$error":"#DIV/0!"},null,null,null,null,null,null,null,null,0,null,{"$error":"#DIV/0!"}]
[null,null,null,null,null,null,null,null,null,null,null,0,null,{"$error":"#DIV/0!"},null,null,null,null,null,null,null,null,0,null,{"$error":"#DIV/0!"}]
[null,null,null,null,null,null,null,null,null,null,null,0,null,{"$error":"#DIV/0!"},null,null,null,null,null,null,null,null,0,null,{"$error":"#DIV/0!"}]
[null,null,null,null,null,null,null,null,null,null,null,0,null,{"$error":"#DIV/0!"},null,null,null,null,null,null,null,null,0,null,{"$error":"#DIV/0!"}]
[null,null,null,null,null,null,null,null,null,null,null,0,null,{"$error":"#DIV/0!"},null,null,null,null,null,null,null,null,0,null,{"$error":"#DIV/0!"}]
[null,null,null,null,null,null,null,null,null,null,null,0,null,{"$error":"#DIV/0!"},null,null,null,null,null,null,null,null,0,null,{"$error":"#DIV/0!"}]
[null,null,null,null,null,null,null,null,null,null,null,0,null,{"$error":"#DIV/0!"},null,null,null,null,null,null,null,null,0,null,{"$error":"#DIV/0!"}]
[null,null,null,null,null,null,null,null,null,null,null,0,null,{"$error":"#DIV/0!"},null,null,null,null,null,null,null,null,0,null,{"$error":"#DIV/0!"}]
[null,null,null,null,null,null,null,null,null,null,null,0,null,{"$error":"#DIV/0!"},null,null,null,null,null,null,null,null,0,null,{"$error":"#DIV/0!"}]
[null,null,null,null,null,null,null,null,null,null,null,0,null,{"$error":"#DIV/0!"},null,null,null,null,null,null,null,null,0,null,{"$error":"#DIV/0!"}]
[null,null,null,null,null,null,null,null,null,null,null,0,null,{"$error":"#DIV/0!"},null,null,null,null,null,null,null,null,0,null,{"$error":"#DIV/0!"}]
[null,null,null,null,null,null,null,null,null,null,null,0,null,{"$error":"#DIV/0!"},null,null,null,null,null,null,null,null,0,null,{"$error":"#DIV/0!"}]
[null,null,null,null,null,null,null,null,null,null,null,0,null,{"$error":"#DIV/0!"},null,null,null,null,null,null,null,null,0,null,{"$error":"#DIV/0!"}]
[null,null,null,null,null,null,null,null,null,null,null,0,null,{"$error":"#DIV/0!"},null,null,null,null,null,null,null,null,0,null,{"$error":"#DIV/0!"}]
[null,null,null,null,null,null,null,null,null,null,null,0,null,{"$error":"#DIV/0!"},null,null,null,null,null,null,null,null,0,null,{"$error":"#DIV/0!"}]
[null,null,null,null,null,null,null,null,null,null,null,0,null,{"$error":"#DIV/0!"},null,null,null,null,null,null,null,null,0,null,{"$error":"#DIV/0!"}]
[null,null,null,null,null,null,null,null,null,null,null,0,null,{"$error":"#DIV/0!"},null,null,null,null,null,null,null,null,0,null,{"$error":"#DIV/0!"}]
[null,null,null,null,null,null,null,null,null,null,null,0,null,{"$error":"#DIV/0!"},null,null,null,null,null,null,null,null,0,null,{"$error":"#DIV/0!"}]
[null,null,null,null,null,null,null,null,null,null,null,0,null,{"$error":"#DIV/0!"},null,null,null,null,null,null,null,null,0,null,{"$error":"#DIV/0!"}]
[null,null,null,null,null,null,null,null,null,null,null,0,null,{"$error":"#DIV/0!"},null,null,null,null,null,null,null,null,0,null,{"$error":"#DIV/0!"}]
[null,null,null,null,null,null,null,null,null,null,null,0,null,{"$error":"#DIV/0!"},null,null,null,null,null,null,null,null,0,null,{"$error":"#DIV/0!"}]
[null,null,null,null,null,null,null,null,null,null,null,0,null,{"$error":"#DIV/0!"},null,null,null,null,null,null,null,null,0,null,{"$error":"#DIV/0!"}]
[null,null,null,null,null,null,null,null,null,null,null,0,null,{"$error":"#DIV/0!"},null,null,null,null,null,null,null,null,0,null,{"$error":"#DIV/0!"}]
[null,null,null,null,null,null,null,null,null,null,null,0,null,{"$error":"#DIV/0!"},null,null,null,null,null,null,null,null,0,null,{"$error":"#DIV/0!"}]
[null,null,null,null,null,null,null,null,null,null,null,0,null,{"$error":"#DIV/0!"},null,null,null,null,null,null,null,null,0,null,{"$error":"#DIV/0!"}]
[null,null,null,null,null,null,null,null,null,null,null,0,null,{"$error":"#DIV/0!"},null,null,null,null,null,null,null,null,0,null,{"$error":"#DIV/0!"}]
[null,null,null,null,null,null,null,null,null,null,null,0,null,{"$error":"#DIV/0!"},null,null,null,null,null,null,null,null,0,null,{"$error":"#DIV/0!"}]
[null,null,null,null,null,null,null,null,null,null,null,0,null,{"$error":"#DIV/0!"},null,null,null,null,null,null,null,null,0,null,{"$error":"#DIV/0!"}]
[null,null,null,null,null,null,null,null,null,null,null,0,null,{"$error":"#DIV/0!"},null,null,null,null,null,null,null,null,0,null,{"$error":"#DIV/0!"}]
[null,null,null,null,null,null,null,null,null,null,null,0,null,{"$error":"#DIV/0!"},null,null,null,null,null,null,null,null,0,null,{"$error":"#DIV/0!"}]
[null,null,null,null,null,null,null,null,null,null,null,0,null,{"$error":"#DIV/0!"},null,null,null,null,null,null,null,null,0,null,{"$error":"#DIV/0!"}]
[null,null,null,null,null,null,null,null,null,null,null,0,null,{"$error":"#DIV/0!"},null,null,null,null,null,null,null,null,0,null,{"$error":"#DIV/0!"}]
[null,null,null,null,null,null,null,null,null,null,null,0,null,{"$error":"#DIV/0!"},null,null,null,null,null,null,null,null,0,null,{"$error":"#DIV/0!"}]
[]
["Freedom of Establishment"]
[null,null,null,null,null,null,null,null,null,null,null,{"$f":"SUM(C114:K114)","v":0},null,{"$f":"L114/$L$1121*100","v":{"$error":"#DIV/0!"}},null,null,null,null,null,null,null,null,{"$f":"SUM(O114:V114)","v":0},null,{"$f":"W114/$W$1121*100","v":{"$error":"#DIV/0!"}}]
[null,null,null,null,null,null,null,null,null,null,null,0,null,{"$f":"L115/$L$1121*100","v":{"$error":"#DIV/0!"}},null,null,null,null,null,null,null,null,0,null,{"$f":"W115/$W$1121*100","v":{"$error":"#DIV/0!"}}]
[null,null,null,null,null,null,null,null,null,null,null,0,null,{"$error":"#DIV/0!"},null,null,null,null,null,null,null,null,0,null,{"$error":"#DIV/0!"}]
[null,null,null,null,null,null,null,null,null,null,null,0,null,{"$error":"#DIV/0!"},null,null,null,null,null,null,null,null,0,null,{"$error":"#DIV/0!"}]
[null,null,null,null,null,null,null,null,null,null,null,0,null,{"$error":"#DIV/0!"},null,null,null,null,null,null,null,null,0,null,{"$error":"#DIV/0!"}]
[null,null,null,null,null,null,null,null,null,null,null,0,null,{"$error":"#DIV/0!"},null,null,null,null,null,null,null,null,0,null,{"$error":"#DIV/0!"}]
[null,null,null,null,null,null,null,null,null,null,null,0,null,{"$error":"#DIV/0!"},null,null,null,null,null,null,null,null,0,null,{"$error":"#DIV/0!"}]
[null,null,null,null,null,null,null,null,null,null,null,0,null,{"$error":"#DIV/0!"},null,null,null,null,null,null,null,null,0,null,{"$error":"#DIV/0!"}]
[null,null,null,null,null,null,null,null,null,null,null,0,null,{"$error":"#DIV/0!"},null,null,null,null,null,null,null,null,0,null,{"$error":"#DIV/0!"}]
[null,null,null,null,null,null,null,null,null,null,null,0,null,{"$error":"#DIV/0!"},null,null,null,null,null,null,null,null,0,null,{"$error":"#DIV/0!"}]
[null,null,null,null,null,null,null,null,null,null,null,0,null,{"$error":"#DIV/0!"},null,null,null,null,null,null,null,null,0,null,{"$error":"#DIV/0!"}]
[null,null,null,null,null,null,null,null,null,null,null,0,null,{"$error":"#DIV/0!"},null,null,null,null,null,null,null,null,0,null,{"$error":"#DIV/0!"}]
[null,null,null,null,null,null,null,null,null,null,null,0,null,{"$error":"#DIV/0!"},null,null,null,null,null,null,null,null,0,null,{"$error":"#DIV/0!"}]
[null,null,null,null,null,null,null,null,null,null,null,0,null,{"$error":"#DIV/0!"},null,null,null,null,null,null,null,null,0,null,{"$error":"#DIV/0!"}]
[null,null,null,null,null,null,null,null,null,null,null,0,null,{"$error":"#DIV/0!"},null,null,null,null,null,null,null,null,0,null,{"$error":"#DIV/0!"}]
[null,null,null,null,null,null,null,null,null,null,null,0,null,{"$error":"#DIV/0!"},null,null,null,null,null,null,null,null,0,null,{"$error":"#DIV/0!"}]
[null,null,null,null,null,null,null,null,null,null,null,0,null,{"$error":"#DIV/0!"},null,null,null,null,null,null,null,null,0,null,{"$error":"#DIV/0!"}]
[null,null,null,null,null,null,null,null,null,null,null,0,null,{"$error":"#DIV/0!"},null,null,null,null,null,null,null,null,0,null,{"$error":"#DIV/0!"}]
[null,null,null,null,null,null,null,null,null,null,null,0,null,{"$error":"#DIV/0!"},null,null,null,null,null,null,null,null,0,null,{"$error":"#DIV/0!"}]
[null,null,null,null,null,null,null,null,null,null,null,0,null,{"$error":"#DIV/0!"},null,null,null,null,null,null,null,null,0,null,{"$error":"#DIV/0!"}]
[null,null,null,null,null,null,null,null,null,null,null,0,null,{"$error":"#DIV/0!"},null,null,null,null,null,null,null,null,0,null,{"$error":"#DIV/0!"}]
[null,null,null,null,null,null,null,null,null,null,null,0,null,{"$error":"#DIV/0!"},null,null,null,null,null,null,null,null,0,null,{"$error":"#DIV/0!"}]
[null,null,null,null,null,null,null,null,null,null,null,0,null,{"$error":"#DIV/0!"},null,null,null,null,null,null,null,null,0,null,{"$error":"#DIV/0!"}]
[null,null,null,null,null,null,null,null,null,null,null,0,null,{"$error":"#DIV/0!"},null,null,null,null,null,null,null,null,0,null,{"$error":"#DIV/0!"}]
[null,null,null,null,null,null,null,null,null,null,null,0,null,{"$error":"#DIV/0!"},null,null,null,null,null,null,null,null,0,null,{"$error":"#DIV/0!"}]
[null,null,null,null,null,null,null,null,null,null,null,0,null,{"$error":"#DIV/0!"},null,null,null,null,null,null,null,null,0,null,{"$error":"#DIV/0!"}]
[null,null,null,null,null,null,null,null,null,null,null,0,null,{"$error":"#DIV/0!"},null,null,null,null,null,null,null,null,0,null,{"$error":"#DIV/0!"}]
[null,null,null,null,null,null,null,null,null,null,null,0,null,{"$error":"#DIV/0!"},null,null,null,null,null,null,null,null,0,null,{"$error":"#DIV/0!"}]
[null,null,null,null,null,null,null,null,null,null,null,0,null,{"$error":"#DIV/0!"},null,null,null,null,null,null,null,null,0,null,{"$error":"#DIV/0!"}]
[null,null,null,null,null,null,null,null,null,null,null,0,null,{"$error":"#DIV/0!"},null,null,null,null,null,null,null,null,0,null,{"$error":"#DIV/0!"}]
[null,null,null,null,null,null,null,null,null,null,null,0,null,{"$error":"#DIV/0!"},null,null,null,null,null,null,null,null,0,null,{"$error":"#DIV/0!"}]
[null,null,null,null,null,null,null,null,null,null,null,0,null,{"$error":"#DIV/0!"},null,null,null,null,null,null,null,null,0,null,{"$error":"#DIV/0!"}]
[null,null,null,null,null,null,null,null,null,null,null,0,null,{"$error":"#DIV/0!"},null,null,null,null,null,null,null,null,0,null,{"$error":"#DIV/0!"}]
[null,null,null,null,null,null,null,null,null,null,null,0,null,{"$error":"#DIV/0!"},null,null,null,null,null,null,null,null,0,null,{"$error":"#DIV/0!"}]
[null,null,null,null,null,null,null,null,null,null,null,0,null,{"$error":"#DIV/0!"},null,null,null,null,null,null,null,null,0,null,{"$error":"#DIV/0!"}]
[null,null,null,null,null,null,null,null,null,null,null,0,null,{"$error":"#DIV/0!"},null,null,null,null,null,null,null,null,0,null,{"$error":"#DIV/0!"}]
[null,null,null,null,null,null,null,null,null,null,null,0,null,{"$error":"#DIV/0!"},null,null,null,null,null,null,null,null,0,null,{"$error":"#DIV/0!"}]
[null,null,null,null,null,null,null,null,null,null,null,0,null,{"$error":"#DIV/0!"},null,null,null,null,null,null,null,null,0,null,{"$error":"#DIV/0!"}]
[null,null,null,null,null,null,null,null,null,null,null,0,null,{"$error":"#DIV/0!"},null,null,null,null,null,null,null,null,0,null,{"$error":"#DIV/0!"}]
[null,null,null,null,null,null,null,null,null,null,null,0,null,{"$error":"#DIV/0!"},null,null,null,null,null,null,null,null,0,null,{"$error":"#DIV/0!"}]
[null,null,null,null,null,null,null,null,null,null,null,0,null,{"$error":"#DIV/0!"},null,null,null,null,null,null,null,null,0,null,{"$error":"#DIV/0!"}]
[null,null,null,null,null,null,null,null,null,null,null,0,null,{"$error":"#DIV/0!"},null,null,null,null,null,null,null,null,0,null,{"$error":"#DIV/0!"}]
[null,null,null,null,null,null,null,null,null,null,null,0,null,{"$error":"#DIV/0!"},null,null,null,null,null,null,null,null,0,null,{"$error":"#DIV/0!"}]
[null,null,null,null,null,null,null,null,null,null,null,0,null,{"$error":"#DIV/0!"},null,null,null,null,null,null,null,null,0,null,{"$error":"#DIV/0!"}]
[null,null,null,null,null,null,null,null,null,null,null,0,null,{"$error":"#DIV/0!"},null,null,null,null,null,null,null,null,0,null,{"$error":"#DIV/0!"}]
[null,null,null,null,null,null,null,null,null,null,null,0,null,{"$error":"#DIV/0!"},null,null,null,null,null,null,null,null,0,null,{"$error":"#DIV/0!"}]
[null,null,null,null,null,null,null,null,null,null,null,0,null,{"$error":"#DIV/0!"},null,null,null,null,null,null,null,null,0,null,{"$error":"#DIV/0!"}]
[null,null,null,null,null,null,null,null,null,null,null,0,null,{"$error":"#DIV/0!"},null,null,null,null,null,null,null,null,0,null,{"$error":"#DIV/0!"}]
[null,null,null,null,null,null,null,null,null,null,null,0,null,{"$error":"#DIV/0!"},null,null,null,null,null,null,null,null,0,null,{"$error":"#DIV/0!"}]
[null,null,null,null,null,null,null,null,null,null,null,0,null,{"$error":"#DIV/0!"},null,null,null,null,null,null,null,null,0,null,{"$error":"#DIV/0!"}]
[null,null,null,null,null,null,null,null,null,null,null,0,null,{"$error":"#DIV/0!"},null,null,null,null,null,null,null,null,0,null,{"$error":"#DIV/0!"}]
[null,null,null,null,null,null,null,null,null,null,null,0,null,{"$error":"#DIV/0!"},null,null,null,null,null,null,null,null,0,null,{"$error":"#DIV/0!"}]
[null,null,null,null,null,null,null,null,null,null,null,0,null,{"$error":"#DIV/0!"},null,null,null,null,null,null,null,null,0,null,{"$error":"#DIV/0!"}]
[null,null,null,null,null,null,null,null,null,null,null,0,null,{"$error":"#DIV/0!"},null,null,null,null,null,null,null,null,0,null,{"$error":"#DIV/0!"}]
[null,null,null,null,null,null,null,null,null,null,null,0,null,{"$error":"#DIV/0!"},null,null,null,null,null,null,null,null,0,null,{"$error":"#DIV/0!"}]
[null,null,null,null,null,null,null,null,null,null,null,0,null,{"$error":"#DIV/0!"},null,null,null,null,null,null,null,null,0,null,{"$error":"#DIV/0!"}]
[null,null,null,null,null,null,null,null,null,null,null,0,null,{"$error":"#DIV/0!"},null,null,null,null,null,null,null,null,0,null,{"$error":"#DIV/0!"}]
[null,null,null,null,null,null,null,null,null,null,null,0,null,{"$error":"#DIV/0!"},null,null,null,null,null,null,null,null,0,null,{"$error":"#DIV/0!"}]
[null,null,null,null,null,null,null,null,null,null,null,0,null,{"$error":"#DIV/0!"},null,null,null,null,null,null,null,null,0,null,{"$error":"#DIV/0!"}]
[null,null,null,null,null,null,null,null,null,null,null,0,null,{"$error":"#DIV/0!"},null,null,null,null,null,null,null,null,0,null,{"$error":"#DIV/0!"}]
[null,null,null,null,null,null,null,null,null,null,null,0,null,{"$error":"#DIV/0!"},null,null,null,null,null,null,null,null,0,null,{"$error":"#DIV/0!"}]
[null,null,null,null,null,null,null,null,null,null,null,0,null,{"$error":"#DIV/0!"},null,null,null,null,null,null,null,null,0,null,{"$error":"#DIV/0!"}]
[null,null,null,null,null,null,null,null,null,null,null,0,null,{"$error":"#DIV/0!"},null,null,null,null,null,null,null,null,0,null,{"$error":"#DIV/0!"}]
[null,null,null,null,null,null,null,null,null,null,null,0,null,{"$error":"#DIV/0!"},null,null,null,null,null,null,null,null,0,null,{"$error":"#DIV/0!"}]
[null,null,null,null,null,null,null,null,null,null,null,0,null,{"$error":"#DIV/0!"},null,null,null,null,null,null,null,null,0,null,{"$error":"#DIV/0!"}]
[null,null,null,null,null,null,null,null,null,null,null,0,null,{"$f":"L179/$L$1121*100","v":{"$error":"#DIV/0!"}},null,null,null,null,null,null,null,null,0,null,{"$f":"W179/$W$1121*100","v":{"$error":"#DIV/0!"}}]
[null,null,null,null,null,null,null,null,null,null,null,0,null,{"$error":"#DIV/0!"},null,null,null,null,null,null,null,null,0,null,{"$error":"#DIV/0!"}]
[null,null,null,null,null,null,null,null,null,null,null,0,null,{"$error":"#DIV/0!"},null,null,null,null,null,null,null,null,0,null,{"$error":"#DIV/0!"}]
[null,null,null,null,null,null,null,null,null,null,null,0,null,{"$error":"#DIV/0!"},null,null,null,null,null,null,null,null,0,null,{"$error":"#DIV/0!"}]
[null,null,null,null,null,null,null,null,null,null,null,0,null,{"$error":"#DIV/0!"},null,null,null,null,null,null,null,null,0,null,{"$error":"#DIV/0!"}]
[null,null,null,null,null,null,null,null,null,null,null,0,null,{"$error":"#DIV/0!"},null,null,null,null,null,null,null,null,0,null,{"$error":"#DIV/0!"}]
[null,null,null,null,null,null,null,null,null,null,null,0,null,{"$error":"#DIV/0!"},null,null,null,null,null,null,null,null,0,null,{"$error":"#DIV/0!"}]
[null,null,null,null,null,null,null,null,null,null,null,0,null,{"$error":"#DIV/0!"},null,null,null,null,null,null,null,null,0,null,{"$error":"#DIV/0!"}]
[null,null,null,null,null,null,null,null,null,null,null,0,null,{"$error":"#DIV/0!"},null,null,null,null,null,null,null,null,0,null,{"$error":"#DIV/0!"}]
[null,null,null,null,null,null,null,null,null,null,null,0,null,{"$error":"#DIV/0!"},null,null,null,null,null,null,null,null,0,null,{"$error":"#DIV/0!"}]
[null,null,null,null,null,null,null,null,null,null,null,0,null,{"$error":"#DIV/0!"},null,null,null,null,null,null,null,null,0,null,{"$error":"#DIV/0!"}]
[null,null,null,null,null,null,null,null,null,null,null,0,null,{"$error":"#DIV/0!"},null,null,null,null,null,null,null,null,0,null,{"$error":"#DIV/0!"}]
[null,null,null,null,null,null,null,null,null,null,null,0,null,{"$error":"#DIV/0!"},null,null,null,null,null,null,null,null,0,null,{"$error":"#DIV/0!"}]
[null,null,null,null,null,null,null,null,null,null,null,0,null,{"$error":"#DIV/0!"},null,null,null,null,null,null,null,null,0,null,{"$error":"#DIV/0!"}]
[null,null,null,null,null,null,null,null,null,null,null,0,null,{"$error":"#DIV/0!"},null,null,null,null,null,null,null,null,0,null,{"$error":"#DIV/0!"}]
[null,null,null,null,null,null,null,null,null,null,null,0,null,{"$error":"#DIV/0!"},null,null,null,null,null,null,null,null,0,null,{"$error":"#DIV/0!"}]
[null,null,null,null,null,null,null,null,null,null,null,0,null,{"$error":"#DIV/0!"},null,null,null,null,null,null,null,null,0,null,{"$error":"#DIV/0!"}]
[null,null,null,null,null,null,null,null,null,null,null,0,null,{"$error":"#DIV/0!"},null,null,null,null,null,null,null,null,0,null,{"$error":"#DIV/0!"}]
[null,null,null,null,null,null,null,null,null,null,null,0,null,{"$error":"#DIV/0!"},null,null,null,null,null,null,null,null,0,null,{"$error":"#DIV/0!"}]
[null,null,null,null,null,null,null,null,null,null,null,0,null,{"$error":"#DIV/0!"},null,null,null,null,null,null,null,null,0,null,{"$error":"#DIV/0!"}]
[null,null,null,null,null,null,null,null,null,null,null,0,null,{"$error":"#DIV/0!"},null,null,null,null,null,null,null,null,0,null,{"$error":"#DIV/0!"}]
[null,null,null,null,null,null,null,null,null,null,null,0,null,{"$error":"#DIV/0!"},null,null,null,null,null,null,null,null,0,null,{"$error":"#DIV/0!"}]
[null,null,null,null,null,null,null,null,null,null,null,0,null,{"$error":"#DIV/0!"},null,null,null,null,null,null,null,null,0,null,{"$error":"#DIV/0!"}]
[null,null,null,null,null,null,null,null,null,null,null,0,null,{"$error":"#DIV/0!"},null,null,null,null,null,null,null,null,0,null,{"$error":"#DIV/0!"}]
[null,null,null,null,null,null,null,null,null,null,null,0,null,{"$error":"#DIV/0!"},null,null,null,null,null,null,null,null,0,null,{"$error":"#DIV/0!"}]
[null,null,null,null,null,null,null,null,null,null,null,0,null,{"$error":"#DIV/0!"},null,null,null,null,null,null,null,null,0,null,{"$error":"#DIV/0!"}]
[null,null,null,null,null,null,null,null,null,null,null,0,null,{"$error":"#DIV/0!"},null,null,null,null,null,null,null,null,0,null,{"$error":"#DIV/0!"}]
[null,null,null,null,null,null,null,null,null,null,null,0,null,{"$error":"#DIV/0!"},null,null,null,null,null,null,null,null,0,null,{"$error":"#DIV/0!"}]
[null,null,null,null,null,null,null,null,null,null,null,0,null,{"$error":"#DIV/0!"},null,null,null,null,null,null,null,null,0,null,{"$error":"#DIV/0!"}]
[null,null,null,null,null,null,null,null,null,null,null,0,null,{"$error":"#DIV/0!"},null,null,null,null,null,null,null,null,0,null,{"$error":"#DIV/0!"}]
[null,null,null,null,null,null,null,null,null,null,null,0,null,{"$error":"#DIV/0!"},null,null,null,null,null,null,null,null,0,null,{"$error":"#DIV/0!"}]
[null,null,null,null,null,null,null,null,null,null,null,0,null,{"$error":"#DIV/0!"},null,null,null,null,null,null,null,null,0,null,{"$error":"#DIV/0!"}]
[null,null,null,null,null,null,null,null,null,null,null,0,null,{"$error":"#DIV/0!"},null,null,null,null,null,null,null,null,0,null,{"$error":"#DIV/0!"}]
[null,null,null,null,null,null,null,null,null,null,null,0,null,{"$error":"#DIV/0!"},null,null,null,null,null,null,null,null,0,null,{"$error":"#DIV/0!"}]
[null,null,null,null,null,null,null,null,null,null,null,0,null,{"$error":"#DIV/0!"},null,null,null,null,null,null,null,null,0,null,{"$error":"#DIV/0!"}]
[]
["Freedom of Services"]
[null,null,null,null,null,null,null,null,null,null,null,{"$f":"SUM(C216:K216)","v":0},null,{"$f":"L216/$L$1121*100","v":{"$error":"#DIV/0!"}},null,null,null,null,null,null,null,null,{"$f":"SUM(O216:V216)","v":0},null,{"$f":"W216/$W$1121*100","v":{"$error":"#DIV/0!"}}]
[null,null,null,null,null,null,null,null,null,null,null,0,null,{"$f":"L217/$L$1121*100","v":{"$error":"#DIV/0!"}},null,null,null,null,null,null,null,null,0,null,{"$f":"W217/$W$1121*100","v":{"$error":"#DIV/0!"}}]
[null,null,null,null,null,null,null,null,null,null,null,0,null,{"$error":"#DIV/0!"},null,null,null,null,null,null,null,null,0,null,{"$error":"#DIV/0!"}]
[null,null,null,null,null,null,null,null,null,null,null,0,null,{"$error":"#DIV/0!"},null,null,null,null,null,null,null,null,0,null,{"$error":"#DIV/0!"}]
[null,null,null,null,null,null,null,null,null,null,null,0,null,{"$error":"#DIV/0!"},null,null,null,null,null,null,null,null,0,null,{"$error":"#DIV/0!"}]
[null,null,null,null,null,null,null,null,null,null,null,0,null,{"$error":"#DIV/0!"},null,null,null,null,null,null,null,null,0,null,{"$error":"#DIV/0!"}]
[null,null,null,null,null,null,null,null,null,null,null,0,null,{"$error":"#DIV/0!"},null,null,null,null,null,null,null,null,0,null,{"$error":"#DIV/0!"}]
[null,null,null,null,null,null,null,null,null,null,null,0,null,{"$error":"#DIV/0!"},null,null,null,null,null,null,null,null,0,null,{"$error":"#DIV/0!"}]
[null,null,null,null,null,null,null,null,null,null,null,0,null,{"$error":"#DIV/0!"},null,null,null,null,null,null,null,null,0,null,{"$error":"#DIV/0!"}]
[null,null,null,null,null,null,null,null,null,null,null,0,null,{"$error":"#DIV/0!"},null,null,null,null,null,null,null,null,0,null,{"$error":"#DIV/0!"}]
[null,null,null,null,null,null,null,null,null,null,null,0,null,{"$error":"#DIV/0!"},null,null,null,null,null,null,null,null,0,null,{"$error":"#DIV/0!"}]
[null,null,null,null,null,null,null,null,null,null,null,0,null,{"$error":"#DIV/0!"},null,null,null,null,null,null,null,null,0,null,{"$error":"#DIV/0!"}]
[null,null,null,null,null,null,null,null,null,null,null,0,null,{"$error":"#DIV/0!"},null,null,null,null,null,null,null,null,0,null,{"$error":"#DIV/0!"}]
[null,null,null,null,null,null,null,null,null,null,null,0,null,{"$error":"#DIV/0!"},null,null,null,null,null,null,null,null,0,null,{"$error":"#DIV/0!"}]
[null,null,null,null,null,null,null,null,null,null,null,0,null,{"$error":"#DIV/0!"},null,null,null,null,null,null,null,null,0,null,{"$error":"#DIV/0!"}]
[null,null,null,null,null,null,null,null,null,null,null,0,null,{"$error":"#DIV/0!"},null,null,null,null,null,null,null,null,0,null,{"$error":"#DIV/0!"}]
[null,null,null,null,null,null,null,null,null,null,null,0,null,{"$error":"#DIV/0!"},null,null,null,null,null,null,null,null,0,null,{"$error":"#DIV/0!"}]
[null,null,null,null,null,null,null,null,null,null,null,0,null,{"$error":"#DIV/0!"},null,null,null,null,null,null,null,null,0,null,{"$error":"#DIV/0!"}]
[null,null,null,null,null,null,null,null,null,null,null,0,null,{"$error":"#DIV/0!"},null,null,null,null,null,null,null,null,0,null,{"$error":"#DIV/0!"}]
[null,null,null,null,null,null,null,null,null,null,null,0,null,{"$error":"#DIV/0!"},null,null,null,null,null,null,null,null,0,null,{"$error":"#DIV/0!"}]
[null,null,null,null,null,null,null,null,null,null,null,0,null,{"$error":"#DIV/0!"},null,null,null,null,null,null,null,null,0,null,{"$error":"#DIV/0!"}]
[null,null,null,null,null,null,null,null,null,null,null,0,null,{"$error":"#DIV/0!"},null,null,null,null,null,null,null,null,0,null,{"$error":"#DIV/0!"}]
[null,null,null,null,null,null,null,null,null,null,null,0,null,{"$error":"#DIV/0!"},null,null,null,null,null,null,null,null,0,null,{"$error":"#DIV/0!"}]
[null,null,null,null,null,null,null,null,null,null,null,0,null,{"$error":"#DIV/0!"},null,null,null,null,null,null,null,null,0,null,{"$error":"#DIV/0!"}]
[null,null,null,null,null,null,null,null,null,null,null,0,null,{"$error":"#DIV/0!"},null,null,null,null,null,null,null,null,0,null,{"$error":"#DIV/0!"}]
[null,null,null,null,null,null,null,null,null,null,null,0,null,{"$error":"#DIV/0!"},null,null,null,null,null,null,null,null,0,null,{"$error":"#DIV/0!"}]
[null,null,null,null,null,null,null,null,null,null,null,0,null,{"$error":"#DIV/0!"},null,null,null,null,null,null,null,null,0,null,{"$error":"#DIV/0!"}]
[null,null,null,null,null,null,null,null,null,null,null,0,null,{"$error":"#DIV/0!"},null,null,null,null,null,null,null,null,0,null,{"$error":"#DIV/0!"}]
[null,null,null,null,null,null,null,null,null,null,null,0,null,{"$error":"#DIV/0!"},null,null,null,null,null,null,null,null,0,null,{"$error":"#DIV/0!"}]
[null,null,null,null,null,null,null,null,null,null,null,0,null,{"$error":"#DIV/0!"},null,null,null,null,null,null,null,null,0,null,{"$error":"#DIV/0!"}]
[null,null,null,null,null,null,null,null,null,null,null,0,null,{"$error":"#DIV/0!"},null,null,null,null,null,null,null,null,0,null,{"$error":"#DIV/0!"}]
[null,null,null,null,null,null,null,null,null,null,null,0,null,{"$error":"#DIV/0!"},null,null,null,null,null,null,null,null,0,null,{"$error":"#DIV/0!"}]
[null,null,null,null,null,null,null,null,null,null,null,0,null,{"$error":"#DIV/0!"},null,null,null,null,null,null,null,null,0,null,{"$error":"#DIV/0!"}]
[null,null,null,null,null,null,null,null,null,null,null,0,null,{"$error":"#DIV/0!"},null,null,null,null,null,null,null,null,0,null,{"$error":"#DIV/0!"}]
[null,null,null,null,null,null,null,null,null,null,null,0,null,{"$error":"#DIV/0!"},null,null,null,null,null,null,null,null,0,null,{"$error":"#DIV/0!"}]
[null,null,null,null,null,null,null,null,null,null,null,0,null,{"$error":"#DIV/0!"},null,null,null,null,null,null,null,null,0,null,{"$error":"#DIV/0!"}]
[null,null,null,null,null,null,null,null,null,null,null,0,null,{"$error":"#DIV/0!"},null,null,null,null,null,null,null,null,0,null,{"$error":"#DIV/0!"}]
[null,null,null,null,null,null,null,null,null,null,null,0,null,{"$error":"#DIV/0!"},null,null,null,null,null,null,null,null,0,null,{"$error":"#DIV/0!"}]
[null,null,null,null,null,null,null,null,null,null,null,0,null,{"$error":"#DIV/0!"},null,null,null,null,null,null,null,null,0,null,{"$error":"#DIV/0!"}]
[null,null,null,null,null,null,null,null,null,null,null,0,null,{"$error":"#DIV/0!"},null,null,null,null,null,null,null,null,0,null,{"$error":"#DIV/0!"}]
[null,null,null,null,null,null,null,null,null,null,null,0,null,{"$error":"#DIV/0!"},null,null,null,null,null,null,null,null,0,null,{"$error":"#DIV/0!"}]
[null,null,null,null,null,null,null,null,null,null,null,0,null,{"$error":"#DIV/0!"},null,null,null,null,null,null,null,null,0,null,{"$error":"#DIV/0!"}]
[null,null,null,null,null,null,null,null,null,null,null,0,null,{"$error":"#DIV/0!"},null,null,null,null,null,null,null,null,0,null,{"$error":"#DIV/0!"}]
[null,null,null,null,null,null,null,null,null,null,null,0,null,{"$error":"#DIV/0!"},null,null,null,null,null,null,null,null,0,null,{"$error":"#DIV/0!"}]
[null,null,null,null,null,null,null,null,null,null,null,0,null,{"$error":"#DIV/0!"},null,null,null,null,null,null,null,null,0,null,{"$error":"#DIV/0!"}]
[null,null,null,null,null,null,null,null,null,null,null,0,null,{"$error":"#DIV/0!"},null,null,null,null,null,null,null,null,0,null,{"$error":"#DIV/0!"}]
[null,null,null,null,null,null,null,null,null,null,null,0,null,{"$error":"#DIV/0!"},null,null,null,null,null,null,null,null,0,null,{"$error":"#DIV/0!"}]
[null,null,null,null,null,null,null,null,null,null,null,0,null,{"$error":"#DIV/0!"},null,null,null,null,null,null,null,null,0,null,{"$error":"#DIV/0!"}]
[null,null,null,null,null,null,null,null,null,null,null,0,null,{"$error":"#DIV/0!"},null,null,null,null,null,null,null,null,0,null,{"$error":"#DIV/0!"}]
[null,null,null,null,null,null,null,null,null,null,null,0,null,{"$error":"#DIV/0!"},null,null,null,null,null,null,null,null,0,null,{"$error":"#DIV/0!"}]
[null,null,null,null,null,null,null,null,null,null,null,0,null,{"$error":"#DIV/0!"},null,null,null,null,null,null,null,null,0,null,{"$error":"#DIV/0!"}]
[null,null,null,null,null,null,null,null,null,null,null,0,null,{"$error":"#DIV/0!"},null,null,null,null,null,null,null,null,0,null,{"$error":"#DIV/0!"}]
[null,null,null,null,null,null,null,null,null,null,null,0,null,{"$error":"#DIV/0!"},null,null,null,null,null,null,null,null,0,null,{"$error":"#DIV/0!"}]
[null,null,null,null,null,null,null,null,null,null,null,0,null,{"$error":"#DIV/0!"},null,null,null,null,null,null,null,null,0,null,{"$error":"#DIV/0!"}]
[null,null,null,null,null,null,null,null,null,null,null,0,null,{"$error":"#DIV/0!"},null,null,null,null,null,null,null,null,0,null,{"$error":"#DIV/0!"}]
[null,null,null,null,null,null,null,null,null,null,null,0,null,{"$error":"#DIV/0!"},null,null,null,null,null,null,null,null,0,null,{"$error":"#DIV/0!"}]
[null,null,null,null,null,null,null,null,null,null,null,0,null,{"$error":"#DIV/0!"},null,null,null,null,null,null,null,null,0,null,{"$error":"#DIV/0!"}]
[null,null,null,null,null,null,null,null,null,null,null,0,null,{"$error":"#DIV/0!"},null,null,null,null,null,null,null,null,0,null,{"$error":"#DIV/0!"}]
[null,null,null,null,null,null,null,null,null,null,null,0,null,{"$error":"#DIV/0!"},null,null,null,null,null,null,null,null,0,null,{"$error":"#DIV/0!"}]
[null,null,null,null,null,null,null,null,null,null,null,0,null,{"$error":"#DIV/0!"},null,null,null,null,null,null,null,null,0,null,{"$error":"#DIV/0!"}]
[null,null,null,null,null,null,null,null,null,null,null,0,null,{"$error":"#DIV/0!"},null,null,null,null,null,null,null,null,0,null,{"$error":"#DIV/0!"}]
[null,null,null,null,null,null,null,null,null,null,null,0,null,{"$error":"#DIV/0!"},null,null,null,null,null,null,null,null,0,null,{"$error":"#DIV/0!"}]
[null,null,null,null,null,null,null,null,null,null,null,0,null,{"$error":"#DIV/0!"},null,null,null,null,null,null,null,null,0,null,{"$error":"#DIV/0!"}]
[null,null,null,null,null,null,null,null,null,null,null,0,null,{"$error":"#DIV/0!"},null,null,null,null,null,null,null,null,0,null,{"$error":"#DIV/0!"}]
[null,null,null,null,null,null,null,null,null,null,null,{"$f":"SUM(C280:K280)","v":0},null,{"$error":"#DIV/0!"},null,null,null,null,null,null,null,null,{"$f":"SUM(O280:V280)","v":0},null,{"$error":"#DIV/0!"}]
[null,null,null,null,null,null,null,null,null,null,null,0,null,{"$f":"L281/$L$1121*100","v":{"$error":"#DIV/0!"}},null,null,null,null,null,null,null,null,0,null,{"$f":"W281/$W$1121*100","v":{"$error":"#DIV/0!"}}]
[null,null,null,null,null,null,null,null,null,null,null,0,null,{"$error":"#DIV/0!"},null,null,null,null,null,null,null,null,0,null,{"$error":"#DIV/0!"}]
[null,null,null,null,null,null,null,null,null,null,null,0,null,{"$error":"#DIV/0!"},null,null,null,null,null,null,null,null,0,null,{"$error":"#DIV/0!"}]
[null,null,null,null,null,null,null,null,null,null,null,0,null,{"$error":"#DIV/0!"},null,null,null,null,null,null,null,null,0,null,{"$error":"#DIV/0!"}]
[null,null,null,null,null,null,null,null,null,null,null,0,null,{"$error":"#DIV/0!"},null,null,null,null,null,null,null,null,0,null,{"$error":"#DIV/0!"}]
[null,null,null,null,null,null,null,null,null,null,null,0,null,{"$error":"#DIV/0!"},null,null,null,null,null,null,null,null,0,null,{"$error":"#DIV/0!"}]
[null,null,null,null,null,null,null,null,null,null,null,0,null,{"$error":"#DIV/0!"},null,null,null,null,null,null,null,null,0,null,{"$error":"#DIV/0!"}]
[null,null,null,null,null,null,null,null,null,null,null,0,null,{"$error":"#DIV/0!"},null,null,null,null,null,null,null,null,0,null,{"$error":"#DIV/0!"}]
[null,null,null,null,null,null,null,null,null,null,null,0,null,{"$error":"#DIV/0!"},null,null,null,null,null,null,null,null,0,null,{"$error":"#DIV/0!"}]
[null,null,null,null,null,null,null,null,null,null,null,0,null,{"$error":"#DIV/0!"},null,null,null,null,null,null,null,null,0,null,{"$error":"#DIV/0!"}]
[null,null,null,null,null,null,null,null,null,null,null,0,null,{"$error":"#DIV/0!"},null,null,null,null,null,null,null,null,0,null,{"$error":"#DIV/0!"}]
[null,null,null,null,null,null,null,null,null,null,null,0,null,{"$error":"#DIV/0!"},null,null,null,null,null,null,null,null,0,null,{"$error":"#DIV/0!"}]
[null,null,null,null,null,null,null,null,null,null,null,0,null,{"$error":"#DIV/0!"},null,null,null,null,null,null,null,null,0,null,{"$error":"#DIV/0!"}]
[null,null,null,null,null,null,null,null,null,null,null,0,null,{"$error":"#DIV/0!"},null,null,null,null,null,null,null,null,0,null,{"$error":"#DIV/0!"}]
[null,null,null,null,null,null,null,null,null,null,null,0,null,{"$error":"#DIV/0!"},null,null,null,null,null,null,null,null,0,null,{"$error":"#DIV/0!"}]
[null,null,null,null,null,null,null,null,null,null,null,0,null,{"$error":"#DIV/0!"},null,null,null,null,null,null,null,null,0,null,{"$error":"#DIV/0!"}]
[null,null,null,null,null,null,null,null,null,null,null,0,null,{"$error":"#DIV/0!"},null,null,null,null,null,null,null,null,0,null,{"$error":"#DIV/0!"}]
[null,null,null,null,null,null,null,null,null,null,null,0,null,{"$error":"#DIV/0!"},null,null,null,null,null,null,null,null,0,null,{"$error":"#DIV/0!"}]
[null,null,null,null,null,null,null,null,null,null,null,0,null,{"$error":"#DIV/0!"},null,null,null,null,null,null,null,null,0,null,{"$error":"#DIV/0!"}]
[null,null,null,null,null,null,null,null,null,null,null,0,null,{"$error":"#DIV/0!"},null,null,null,null,null,null,null,null,0,null,{"$error":"#DIV/0!"}]
[null,null,null,null,null,null,null,null,null,null,null,0,null,{"$error":"#DIV/0!"},null,null,null,null,null,null,null,null,0,null,{"$error":"#DIV/0!"}]
[null,null,null,null,null,null,null,null,null,null,null,0,null,{"$error":"#DIV/0!"},null,null,null,null,null,null,null,null,0,null,{"$error":"#DIV/0!"}]
[null,null,null,null,null,null,null,null,null,null,null,0,null,{"$error":"#DIV/0!"},null,null,null,null,null,null,null,null,0,null,{"$error":"#DIV/0!"}]
[null,null,null,null,null,null,null,null,null,null,null,0,null,{"$error":"#DIV/0!"},null,null,null,null,null,null,null,null,0,null,{"$error":"#DIV/0!"}]
[null,null,null,null,null,null,null,null,null,null,null,0,null,{"$error":"#DIV/0!"},null,null,null,null,null,null,null,null,0,null,{"$error":"#DIV/0!"}]
[null,null,null,null,null,null,null,null,null,null,null,0,null,{"$error":"#DIV/0!"},null,null,null,null,null,null,null,null,0,null,{"$error":"#DIV/0!"}]
[null,null,null,null,null,null,null,null,null,null,null,0,null,{"$error":"#DIV/0!"},null,null,null,null,null,null,null,null,0,null,{"$error":"#DIV/0!"}]
[null,null,null,null,null,null,null,null,null,null,null,0,null,{"$error":"#DIV/0!"},null,null,null,null,null,null,null,null,0,null,{"$error":"#DIV/0!"}]
[null,null,null,null,null,null,null,null,null,null,null,0,null,{"$error":"#DIV/0!"},null,null,null,null,null,null,null,null,0,null,{"$error":"#DIV/0!"}]
[null,null,null,null,null,null,null,null,null,null,null,0,null,{"$error":"#DIV/0!"},null,null,null,null,null,null,null,null,0,null,{"$error":"#DIV/0!"}]
[null,null,null,null,null,null,null,null,null,null,null,0,null,{"$error":"#DIV/0!"},null,null,null,null,null,null,null,null,0,null,{"$error":"#DIV/0!"}]
[null,null,null,null,null,null,null,null,null,null,null,0,null,{"$error":"#DIV/0!"},null,null,null,null,null,null,null,null,0,null,{"$error":"#DIV/0!"}]
[null,null,null,null,null,null,null,null,null,null,null,0,null,{"$error":"#DIV/0!"},null,null,null,null,null,null,null,null,0,null,{"$error":"#DIV/0!"}]
[null,null,null,null,null,null,null,null,null,null,null,0,null,{"$error":"#DIV/0!"},null,null,null,null,null,null,null,null,0,null,{"$error":"#DIV/0!"}]
[null,null,null,null,null,null,null,null,null,null,null,0,null,{"$error":"#DIV/0!"},null,null,null,null,null,null,null,null,0,null,{"$error":"#DIV/0!"}]
[null,null,null,null,null,null,null,null,null,null,null,0,null,{"$error":"#DIV/0!"},null,null,null,null,null,null,null,null,0,null,{"$error":"#DIV/0!"}]
[null,null,null,null,null,null,null,null,null,null,null,0,null,{"$error":"#DIV/0!"},null,null,null,null,null,null,null,null,0,null,{"$error":"#DIV/0!"}]
[null,null,null,null,null,null,null,null,null,null,null,0,null,{"$error":"#DIV/0!"},null,null,null,null,null,null,null,null,0,null,{"$error":"#DIV/0!"}]
[null,null,null,null,null,null,null,null,null,null,null,0,null,{"$error":"#DIV/0!"},null,null,null,null,null,null,null,null,0,null,{"$error":"#DIV/0!"}]
[null,null,null,null,null,null,null,null,null,null,null,0,null,{"$error":"#DIV/0!"},null,null,null,null,null,null,null,null,0,null,{"$error":"#DIV/0!"}]
[null,null,null,null,null,null,null,null,null,null,null,0,null,{"$error":"#DIV/0!"},null,null,null,null,null,null,null,null,0,null,{"$error":"#DIV/0!"}]
[null,null,null,null,null,null,null,null,null,null,null,0,null,{"$error":"#DIV/0!"},null,null,null,null,null,null,null,null,0,null,{"$error":"#DIV/0!"}]
[null,null,null,null,null,null,null,null,null,null,null,0,null,{"$error":"#DIV/0!"},null,null,null,null,null,null,null,null,0,null,{"$error":"#DIV/0!"}]
[null,null,null,null,null,null,null,null,null,null,null,0,null,{"$error":"#DIV/0!"},null,null,null,null,null,null,null,null,0,null,{"$error":"#DIV/0!"}]
[null,null,null,null,null,null,null,null,null,null,null,0,null,{"$error":"#DIV/0!"},null,null,null,null,null,null,null,null,0,null,{"$error":"#DIV/0!"}]
[null,null,null,null,null,null,null,null,null,null,null,0,null,{"$error":"#DIV/0!"},null,null,null,null,null,null,null,null,0,null,{"$error":"#DIV/0!"}]
[null,null,null,null,null,null,null,null,null,null,null,0,null,{"$error":"#DIV/0!"},null,null,null,null,null,null,null,null,0,null,{"$error":"#DIV/0!"}]
[null,null,null,null,null,null,null,null,null,null,null,0,null,{"$error":"#DIV/0!"},null,null,null,null,null,null,null,null,0,null,{"$error":"#DIV/0!"}]
[null,null,null,null,null,null,null,null,null,null,null,0,null,{"$error":"#DIV/0!"},null,null,null,null,null,null,null,null,0,null,{"$error":"#DIV/0!"}]
[null,null,null,null,null,null,null,null,null,null,null,0,null,{"$error":"#DIV/0!"},null,null,null,null,null,null,null,null,0,null,{"$error":"#DIV/0!"}]
[null,null,null,null,null,null,null,null,null,null,null,0,null,{"$error":"#DIV/0!"},null,null,null,null,null,null,null,null,0,null,{"$error":"#DIV/0!"}]
[null,null,null,null,null,null,null,null,null,null,null,0,null,{"$error":"#DIV/0!"},null,null,null,null,null,null,null,null,0,null,{"$error":"#DIV/0!"}]
[null,null,null,null,null,null,null,null,null,null,null,0,null,{"$error":"#DIV/0!"},null,null,null,null,null,null,null,null,0,null,{"$error":"#DIV/0!"}]
[null,null,null,null,null,null,null,null,null,null,null,0,null,{"$error":"#DIV/0!"},null,null,null,null,null,null,null,null,0,null,{"$error":"#DIV/0!"}]
[null,null,null,null,null,null,null,null,null,null,null,0,null,{"$error":"#DIV/0!"},null,null,null,null,null,null,null,null,0,null,{"$error":"#DIV/0!"}]
[null,null,null,null,null,null,null,null,null,null,null,0,null,{"$error":"#DIV/0!"},null,null,null,null,null,null,null,null,0,null,{"$error":"#DIV/0!"}]
[null,null,null,null,null,null,null,null,null,null,null,0,null,{"$error":"#DIV/0!"},null,null,null,null,null,null,null,null,0,null,{"$error":"#DIV/0!"}]
[null,null,null,null,null,null,null,null,null,null,null,0,null,{"$error":"#DIV/0!"},null,null,null,null,null,null,null,null,0,null,{"$error":"#DIV/0!"}]
[null,null,null,null,null,null,null,null,null,null,null,0,null,{"$error":"#DIV/0!"},null,null,null,null,null,null,null,null,0,null,{"$error":"#DIV/0!"}]
[null,null,null,null,null,null,null,null,null,null,null,0,null,{"$error":"#DIV/0!"},null,null,null,null,null,null,null,null,0,null,{"$error":"#DIV/0!"}]
[null,null,null,null,null,null,null,null,null,null,null,0,null,{"$error":"#DIV/0!"},null,null,null,null,null,null,null,null,0,null,{"$error":"#DIV/0!"}]
[null,null,null,null,null,null,null,null,null,null,null,0,null,{"$error":"#DIV/0!"},null,null,null,null,null,null,null,null,0,null,{"$error":"#DIV/0!"}]
[null,null,null,null,null,null,null,null,null,null,null,0,null,{"$error":"#DIV/0!"},null,null,null,null,null,null,null,null,0,null,{"$error":"#DIV/0!"}]
[null,null,null,null,null,null,null,null,null,null,null,{"$f":"SUM(C344:K344)","v":0},null,{"$error":"#DIV/0!"},null,null,null,null,null,null,null,null,{"$f":"SUM(O344:V344)","v":0},null,{"$error":"#DIV/0!"}]
[null,null,null,null,null,null,null,null,null,null,null,0,null,{"$f":"L345/$L$1121*100","v":{"$error":"#DIV/0!"}},null,null,null,null,null,null,null,null,0,null,{"$f":"W345/$W$1121*100","v":{"$error":"#DIV/0!"}}]
[null,null,null,null,null,null,null,null,null,null,null,0,null,{"$error":"#DIV/0!"},null,null,null,null,null,null,null,null,0,null,{"$error":"#DIV/0!"}]
[null,null,null,null,null,null,null,null,null,null,null,0,null,{"$error":"#DIV/0!"},null,null,null,null,null,null,null,null,0,null,{"$error":"#DIV/0!"}]
[null,null,null,null,null,null,null,null,null,null,null,0,null,{"$error":"#DIV/0!"},null,null,null,null,null,null,null,null,0,null,{"$error":"#DIV/0!"}]
[null,null,null,null,null,null,null,null,null,null,null,0,null,{"$error":"#DIV/0!"},null,null,null,null,null,null,null,null,0,null,{"$error":"#DIV/0!"}]
[null,null,null,null,null,null,null,null,null,null,null,0,null,{"$error":"#DIV/0!"},null,null,null,null,null,null,null,null,0,null,{"$error":"#DIV/0!"}]
[null,null,null,null,null,null,null,null,null,null,null,0,null,{"$error":"#DIV/0!"},null,null,null,null,null,null,null,null,0,null,{"$error":"#DIV/0!"}]
[null,null,null,null,null,null,null,null,null,null,null,0,null,{"$error":"#DIV/0!"},null,null,null,null,null,null,null,null,0,null,{"$error":"#DIV/0!"}]
[null,null,null,null,null,null,null,null,null,null,null,0,null,{"$error":"#DIV/0!"},null,null,null,null,null,null,null,null,0,null,{"$error":"#DIV/0!"}]
[null,null,null,null,null,null,null,null,null,null,null,0,null,{"$error":"#DIV/0!"},null,null,null,null,null,null,null,null,0,null,{"$error":"#DIV/0!"}]
[null,null,null,null,null,null,null,null,null,null,null,0,null,{"$error":"#DIV/0!"},null,null,null,null,null,null,null,null,0,null,{"$error":"#DIV/0!"}]
[null,null,null,null,null,null,null,null,null,null,null,0,null,{"$error":"#DIV/0!"},null,null,null,null,null,null,null,null,0,null,{"$error":"#DIV/0!"}]
[null,null,null,null,null,null,null,null,null,null,null,0,null,{"$error":"#DIV/0!"},null,null,null,null,null,null,null,null,0,null,{"$error":"#DIV/0!"}]
[null,null,null,null,null,null,null,null,null,null,null,0,null,{"$error":"#DIV/0!"},null,null,null,null,null,null,null,null,0,null,{"$error":"#DIV/0!"}]
[null,null,null,null,null,null,null,null,null,null,null,0,null,{"$error":"#DIV/0!"},null,null,null,null,null,null,null,null,0,null,{"$error":"#DIV/0!"}]
[null,null,null,null,null,null,null,null,null,null,null,0,null,{"$error":"#DIV/0!"},null,null,null,null,null,null,null,null,0,null,{"$error":"#DIV/0!"}]
[null,null,null,null,null,null,null,null,null,null,null,0,null,{"$error":"#DIV/0!"},null,null,null,null,null,null,null,null,0,null,{"$error":"#DIV/0!"}]
[null,null,null,null,null,null,null,null,null,null,null,0,null,{"$error":"#DIV/0!"},null,null,null,null,null,null,null,null,0,null,{"$error":"#DIV/0!"}]
[null,null,null,null,null,null,null,null,null,null,null,0,null,{"$error":"#DIV/0!"},null,null,null,null,null,null,null,null,0,null,{"$error":"#DIV/0!"}]
[null,null,null,null,null,null,null,null,null,null,null,0,null,{"$error":"#DIV/0!"},null,null,null,null,null,null,null,null,0,null,{"$error":"#DIV/0!"}]
[null,null,null,null,null,null,null,null,null,null,null,0,null,{"$error":"#DIV/0!"},null,null,null,null,null,null,null,null,0,null,{"$error":"#DIV/0!"}]
[null,null,null,null,null,null,null,null,null,null,null,0,null,{"$error":"#DIV/0!"},null,null,null,null,null,null,null,null,0,null,{"$error":"#DIV/0!"}]
[null,null,null,null,null,null,null,null,null,null,null,0,null,{"$error":"#DIV/0!"},null,null,null,null,null,null,null,null,0,null,{"$error":"#DIV/0!"}]
[null,null,null,null,null,null,null,null,null,null,null,0,null,{"$error":"#DIV/0!"},null,null,null,null,null,null,null,null,0,null,{"$error":"#DIV/0!"}]
[null,null,null,null,null,null,null,null,null,null,null,0,null,{"$error":"#DIV/0!"},null,null,null,null,null,null,null,null,0,null,{"$error":"#DIV/0!"}]
[null,null,null,null,null,null,null,null,null,null,null,0,null,{"$error":"#DIV/0!"},null,null,null,null,null,null,null,null,0,null,{"$error":"#DIV/0!"}]
[null,null,null,null,null,null,null,null,null,null,null,0,null,{"$error":"#DIV/0!"},null,null,null,null,null,null,null,null,0,null,{"$error":"#DIV/0!"}]
[null,null,null,null,null,null,null,null,null,null,null,0,null,{"$error":"#DIV/0!"},null,null,null,null,null,null,null,null,0,null,{"$error":"#DIV/0!"}]
[null,null,null,null,null,null,null,null,null,null,null,0,null,{"$error":"#DIV/0!"},null,null,null,null,null,null,null,null,0,null,{"$error":"#DIV/0!"}]
[null,null,null,null,null,null,null,null,null,null,null,0,null,{"$error":"#DIV/0!"},null,null,null,null,null,null,null,null,0,null,{"$error":"#DIV/0!"}]
[null,null,null,null,null,null,null,null,null,null,null,0,null,{"$error":"#DIV/0!"},null,null,null,null,null,null,null,null,0,null,{"$error":"#DIV/0!"}]
[null,null,null,null,null,null,null,null,null,null,null,0,null,{"$error":"#DIV/0!"},null,null,null,null,null,null,null,null,0,null,{"$error":"#DIV/0!"}]
[null,null,null,null,null,null,null,null,null,null,null,0,null,{"$error":"#DIV/0!"},null,null,null,null,null,null,null,null,0,null,{"$error":"#DIV/0!"}]
[null,null,null,null,null,null,null,null,null,null,null,0,null,{"$error":"#DIV/0!"},null,null,null,null,null,null,null,null,0,null,{"$error":"#DIV/0!"}]
[null,null,null,null,null,null,null,null,null,null,null,0,null,{"$error":"#DIV/0!"},null,null,null,null,null,null,null,null,0,null,{"$error":"#DIV/0!"}]
[null,null,null,null,null,null,null,null,null,null,null,0,null,{"$error":"#DIV/0!"},null,null,null,null,null,null,null,null,0,null,{"$error":"#DIV/0!"}]
[null,null,null,null,null,null,null,null,null,null,null,0,null,{"$error":"#DIV/0!"},null,null,null,null,null,null,null,null,0,null,{"$error":"#DIV/0!"}]
[null,null,null,null,null,null,null,null,null,null,null,0,null,{"$error":"#DIV/0!"},null,null,null,null,null,null,null,null,0,null,{"$error":"#DIV/0!"}]
[null,null,null,null,null,null,null,null,null,null,null,0,null,{"$error":"#DIV/0!"},null,null,null,null,null,null,null,null,0,null,{"$error":"#DIV/0!"}]
[null,null,null,null,null,null,null,null,null,null,null,0,null,{"$error":"#DIV/0!"},null,null,null,null,null,null,null,null,0,null,{"$error":"#DIV/0!"}]
[null,null,null,null,null,null,null,null,null,null,null,0,null,{"$error":"#DIV/0!"},null,null,null,null,null,null,null,null,0,null,{"$error":"#DIV/0!"}]
[null,null,null,null,null,null,null,null,null,null,null,0,null,{"$error":"#DIV/0!"},null,null,null,null,null,null,null,null,0,null,{"$error":"#DIV/0!"}]
[null,null,null,null,null,null,null,null,null,null,null,0,null,{"$error":"#DIV/0!"},null,null,null,null,null,null,null,null,0,null,{"$error":"#DIV/0!"}]
[null,null,null,null,null,null,null,null,null,null,null,0,null,{"$error":"#DIV/0!"},null,null,null,null,null,null,null,null,0,null,{"$error":"#DIV/0!"}]
[null,null,null,null,null,null,null,null,null,null,null,0,null,{"$error":"#DIV/0!"},null,null,null,null,null,null,null,null,0,null,{"$error":"#DIV/0!"}]
[null,null,null,null,null,null,null,null,null,null,null,0,null,{"$error":"#DIV/0!"},null,null,null,null,null,null,null,null,0,null,{"$error":"#DIV/0!"}]
[null,null,null,null,null,null,null,null,null,null,null,0,null,{"$error":"#DIV/0!"},null,null,null,null,null,null,null,null,0,null,{"$error":"#DIV/0!"}]
[null,null,null,null,null,null,null,null,null,null,null,0,null,{"$error":"#DIV/0!"},null,null,null,null,null,null,null,null,0,null,{"$error":"#DIV/0!"}]
[null,null,null,null,null,null,null,null,null,null,null,0,null,{"$error":"#DIV/0!"},null,null,null,null,null,null,null,null,0,null,{"$error":"#DIV/0!"}]
[null,null,null,null,null,null,null,null,null,null,null,0,null,{"$error":"#DIV/0!"},null,null,null,null,null,null,null,null,0,null,{"$error":"#DIV/0!"}]
[null,null,null,null,null,null,null,null,null,null,null,0,null,{"$error":"#DIV/0!"},null,null,null,null,null,null,null,null,0,null,{"$error":"#DIV/0!"}]
[null,null,null,null,null,null,null,null,null,null,null,0,null,{"$error":"#DIV/0!"},null,null,null,null,null,null,null,null,0,null,{"$error":"#DIV/0!"}]
[null,null,null,null,null,null,null,null,null,null,null,0,null,{"$error":"#DIV/0!"},null,null,null,null,null,null,null,null,0,null,{"$error":"#DIV/0!"}]
[null,null,null,null,null,null,null,null,null,null,null,0,null,{"$error":"#DIV/0!"},null,null,null,null,null,null,null,null,0,null,{"$error":"#DIV/0!"}]
[null,null,null,null,null,null,null,null,null,null,null,0,null,{"$error":"#DIV/0!"},null,null,null,null,null,null,null,null,0,null,{"$error":"#DIV/0!"}]
[null,null,null,null,null,null,null,null,null,null,null,0,null,{"$error":"#DIV/0!"},null,null,null,null,null,null,null,null,0,null,{"$error":"#DIV/0!"}]
[null,null,null,null,null,null,null,null,null,null,null,0,null,{"$error":"#DIV/0!"},null,null,null,null,null,null,null,null,0,null,{"$error":"#DIV/0!"}]
[null,null,null,null,null,null,null,null,null,null,null,0,null,{"$error":"#DIV/0!"},null,null,null,null,null,null,null,null,0,null,{"$error":"#DIV/0!"}]
[null,null,null,null,null,null,null,null,null,null,null,0,null,{"$error":"#DIV/0!"},null,null,null,null,null,null,null,null,0,null,{"$error":"#DIV/0!"}]
[null,null,null,null,null,null,null,null,null,null,null,0,null,{"$error":"#DIV/0!"},null,null,null,null,null,null,null,null,0,null,{"$error":"#DIV/0!"}]
[null,null,null,null,null,null,null,null,null,null,null,0,null,{"$error":"#DIV/0!"},null,null,null,null,null,null,null,null,0,null,{"$error":"#DIV/0!"}]
[null,null,null,null,null,null,null,null,null,null,null,0,null,{"$error":"#DIV/0!"},null,null,null,null,null,null,null,null,0,null,{"$error":"#DIV/0!"}]
[null,null,null,null,null,null,null,null,null,null,null,0,null,{"$error":"#DIV/0!"},null,null,null,null,null,null,null,null,0,null,{"$error":"#DIV/0!"}]
[null,null,null,null,null,null,null,null,null,null,null,{"$f":"SUM(C408:K408)","v":0},null,{"$error":"#DIV/0!"},null,null,null,null,null,null,null,null,{"$f":"SUM(O408:V408)","v":0},null,{"$error":"#DIV/0!"}]
[null,null,null,null,null,null,null,null,null,null,null,0,null,{"$f":"L409/$L$1121*100","v":{"$error":"#DIV/0!"}},null,null,null,null,null,null,null,null,0,null,{"$f":"W409/$W$1121*100","v":{"$error":"#DIV/0!"}}]
[null,null,null,null,null,null,null,null,null,null,null,0,null,{"$error":"#DIV/0!"},null,null,null,null,null,null,null,null,0,null,{"$error":"#DIV/0!"}]
[null,null,null,null,null,null,null,null,null,null,null,0,null,{"$error":"#DIV/0!"},null,null,null,null,null,null,null,null,0,null,{"$error":"#DIV/0!"}]
[null,null,null,null,null,null,null,null,null,null,null,0,null,{"$error":"#DIV/0!"},null,null,null,null,null,null,null,null,0,null,{"$error":"#DIV/0!"}]
[null,null,null,null,null,null,null,null,null,null,null,0,null,{"$error":"#DIV/0!"},null,null,null,null,null,null,null,null,0,null,{"$error":"#DIV/0!"}]
[null,null,null,null,null,null,null,null,null,null,null,0,null,{"$error":"#DIV/0!"},null,null,null,null,null,null,null,null,0,null,{"$error":"#DIV/0!"}]
[null,null,null,null,null,null,null,null,null,null,null,0,null,{"$error":"#DIV/0!"},null,null,null,null,null,null,null,null,0,null,{"$error":"#DIV/0!"}]
[null,null,null,null,null,null,null,null,null,null,null,0,null,{"$error":"#DIV/0!"},null,null,null,null,null,null,null,null,0,null,{"$error":"#DIV/0!"}]
[null,null,null,null,null,null,null,null,null,null,null,0,null,{"$error":"#DIV/0!"},null,null,null,null,null,null,null,null,0,null,{"$error":"#DIV/0!"}]
[null,null,null,null,null,null,null,null,null,null,null,0,null,{"$error":"#DIV/0!"},null,null,null,null,null,null,null,null,0,null,{"$error":"#DIV/0!"}]
[null,null,null,null,null,null,null,null,null,null,null,0,null,{"$error":"#DIV/0!"},null,null,null,null,null,null,null,null,0,null,{"$error":"#DIV/0!"}]
[null,null,null,null,null,null,null,null,null,null,null,0,null,{"$error":"#DIV/0!"},null,null,null,null,null,null,null,null,0,null,{"$error":"#DIV/0!"}]
[null,null,null,null,null,null,null,null,null,null,null,0,null,{"$error":"#DIV/0!"},null,null,null,null,null,null,null,null,0,null,{"$error":"#DIV/0!"}]
[null,null,null,null,null,null,null,null,null,null,null,0,null,{"$error":"#DIV/0!"},null,null,null,null,null,null,null,null,0,null,{"$error":"#DIV/0!"}]
[null,null,null,null,null,null,null,null,null,null,null,0,null,{"$error":"#DIV/0!"},null,null,null,null,null,null,null,null,0,null,{"$error":"#DIV/0!"}]
[null,null,null,null,null,null,null,null,null,null,null,0,null,{"$error":"#DIV/0!"},null,null,null,null,null,null,null,null,0,null,{"$error":"#DIV/0!"}]
[null,null,null,null,null,null,null,null,null,null,null,0,null,{"$error":"#DIV/0!"},null,null,null,null,null,null,null,null,0,null,{"$error":"#DIV/0!"}]
[null,null,null,null,null,null,null,null,null,null,null,0,null,{"$error":"#DIV/0!"},null,null,null,null,null,null,null,null,0,null,{"$error":"#DIV/0!"}]
[null,null,null,null,null,null,null,null,null,null,null,0,null,{"$error":"#DIV/0!"},null,null,null,null,null,null,null,null,0,null,{"$error":"#DIV/0!"}]
[null,null,null,null,null,null,null,null,null,null,null,0,null,{"$error":"#DIV/0!"},null,null,null,null,null,null,null,null,0,null,{"$error":"#DIV/0!"}]
[null,null,null,null,null,null,null,null,null,null,null,0,null,{"$error":"#DIV/0!"},null,null,null,null,null,null,null,null,0,null,{"$error":"#DIV/0!"}]
[null,null,null,null,null,null,null,null,null,null,null,0,null,{"$error":"#DIV/0!"},null,null,null,null,null,null,null,null,0,null,{"$error":"#DIV/0!"}]
[null,null,null,null,null,null,null,null,null,null,null,0,null,{"$error":"#DIV/0!"},null,null,null,null,null,null,null,null,0,null,{"$error":"#DIV/0!"}]
[null,null,null,null,null,null,null,null,null,null,null,0,null,{"$error":"#DIV/0!"},null,null,null,null,null,null,null,null,0,null,{"$error":"#DIV/0!"}]
[null,null,null,null,null,null,null,null,null,null,null,0,null,{"$error":"#DIV/0!"},null,null,null,null,null,null,null,null,0,null,{"$error":"#DIV/0!"}]
[null,null,null,null,null,null,null,null,null,null,null,0,null,{"$error":"#DIV/0!"},null,null,null,null,null,null,null,null,0,null,{"$error":"#DIV/0!"}]
[null,null,null,null,null,null,null,null,null,null,null,0,null,{"$error":"#DIV/0!"},null,null,null,null,null,null,null,null,0,null,{"$error":"#DIV/0!"}]
[null,null,null,null,null,null,null,null,null,null,null,0,null,{"$error":"#DIV/0!"},null,null,null,null,null,null,null,null,0,null,{"$error":"#DIV/0!"}]
[null,null,null,null,null,null,null,null,null,null,null,0,null,{"$error":"#DIV/0!"},null,null,null,null,null,null,null,null,0,null,{"$error":"#DIV/0!"}]
[null,null,null,null,null,null,null,null,null,null,null,0,null,{"$error":"#DIV/0!"},null,null,null,null,null,null,null,null,0,null,{"$error":"#DIV/0!"}]
[null,null,null,null,null,null,null,null,null,null,null,0,null,{"$error":"#DIV/0!"},null,null,null,null,null,null,null,null,0,null,{"$error":"#DIV/0!"}]
[null,null,null,null,null,null,null,null,null,null,null,0,null,{"$error":"#DIV/0!"},null,null,null,null,null,null,null,null,0,null,{"$error":"#DIV/0!"}]
[null,null,null,null,null,null,null,null,null,null,null,0,null,{"$error":"#DIV/0!"},null,null,null,null,null,null,null,null,0,null,{"$error":"#DIV/0!"}]
[null,null,null,null,null,null,null,null,null,null,null,0,null,{"$error":"#DIV/0!"},null,null,null,null,null,null,null,null,0,null,{"$error":"#DIV/0!"}]
[null,null,null,null,null,null,null,null,null,null,null,0,null,{"$error":"#DIV/0!"},null,null,null,null,null,null,null,null,0,null,{"$error":"#DIV/0!"}]
[null,null,null,null,null,null,null,null,null,null,null,0,null,{"$error":"#DIV/0!"},null,null,null,null,null,null,null,null,0,null,{"$error":"#DIV/0!"}]
[null,null,null,null,null,null,null,null,null,null,null,0,null,{"$error":"#DIV/0!"},null,null,null,null,null,null,null,null,0,null,{"$error":"#DIV/0!"}]
[null,null,null,null,null,null,null,null,null,null,null,0,null,{"$error":"#DIV/0!"},null,null,null,null,null,null,null,null,0,null,{"$error":"#DIV/0!"}]
[null,null,null,null,null,null,null,null,null,null,null,0,null,{"$error":"#DIV/0!"},null,null,null,null,null,null,null,null,0,null,{"$error":"#DIV/0!"}]
[null,null,null,null,null,null,null,null,null,null,null,0,null,{"$error":"#DIV/0!"},null,null,null,null,null,null,null,null,0,null,{"$error":"#DIV/0!"}]
[null,null,null,null,null,null,null,null,null,null,null,0,null,{"$error":"#DIV/0!"},null,null,null,null,null,null,null,null,0,null,{"$error":"#DIV/0!"}]
[null,null,null,null,null,null,null,null,null,null,null,0,null,{"$error":"#DIV/0!"},null,null,null,null,null,null,null,null,0,null,{"$error":"#DIV/0!"}]
[null,null,null,null,null,null,null,null,null,null,null,0,null,{"$error":"#DIV/0!"},null,null,null,null,null,null,null,null,0,null,{"$error":"#DIV/0!"}]
[null,null,null,null,null,null,null,null,null,null,null,0,null,{"$error":"#DIV/0!"},null,null,null,null,null,null,null,null,0,null,{"$error":"#DIV/0!"}]
[null,null,null,null,null,null,null,null,null,null,null,0,null,{"$error":"#DIV/0!"},null,null,null,null,null,null,null,null,0,null,{"$error":"#DIV/0!"}]
[null,null,null,null,null,null,null,null,null,null,null,0,null,{"$error":"#DIV/0!"},null,null,null,null,null,null,null,null,0,null,{"$error":"#DIV/0!"}]
[null,null,null,null,null,null,null,null,null,null,null,0,null,{"$error":"#DIV/0!"},null,null,null,null,null,null,null,null,0,null,{"$error":"#DIV/0!"}]
[null,null,null,null,null,null,null,null,null,null,null,0,null,{"$error":"#DIV/0!"},null,null,null,null,null,null,null,null,0,null,{"$error":"#DIV/0!"}]
[null,null,null,null,null,null,null,null,null,null,null,0,null,{"$error":"#DIV/0!"},null,null,null,null,null,null,null,null,0,null,{"$error":"#DIV/0!"}]
[null,null,null,null,null,null,null,null,null,null,null,0,null,{"$error":"#DIV/0!"},null,null,null,null,null,null,null,null,0,null,{"$error":"#DIV/0!"}]
[null,null,null,null,null,null,null,null,null,null,null,0,null,{"$error":"#DIV/0!"},null,null,null,null,null,null,null,null,0,null,{"$error":"#DIV/0!"}]
[null,null,null,null,null,null,null,null,null,null,null,0,null,{"$error":"#DIV/0!"},null,null,null,null,null,null,null,null,0,null,{"$error":"#DIV/0!"}]
[null,null,null,null,null,null,null,null,null,null,null,0,null,{"$error":"#DIV/0!"},null,null,null,null,null,null,null,null,0,null,{"$error":"#DIV/0!"}]
[null,null,null,null,null,null,null,null,null,null,null,0,null,{"$error":"#DIV/0!"},null,null,null,null,null,null,null,null,0,null,{"$error":"#DIV/0!"}]
[null,null,null,null,null,null,null,null,null,null,null,0,null,{"$error":"#DIV/0!"},null,null,null,null,null,null,null,null,0,null,{"$error":"#DIV/0!"}]
[null,null,null,null,null,null,null,null,null,null,null,0,null,{"$error":"#DIV/0!"},null,null,null,null,null,null,null,null,0,null,{"$error":"#DIV/0!"}]
[null,null,null,null,null,null,null,null,null,null,null,0,null,{"$error":"#DIV/0!"},null,null,null,null,null,null,null,null,0,null,{"$error":"#DIV/0!"}]
[null,null,null,null,null,null,null,null,null,null,null,0,null,{"$error":"#DIV/0!"},null,null,null,null,null,null,null,null,0,null,{"$error":"#DIV/0!"}]
[null,null,null,null,null,null,null,null,null,null,null,0,null,{"$error":"#DIV/0!"},null,null,null,null,null,null,null,null,0,null,{"$error":"#DIV/0!"}]
[null,null,null,null,null,null,null,null,null,null,null,0,null,{"$error":"#DIV/0!"},null,null,null,null,null,null,null,null,0,null,{"$error":"#DIV/0!"}]
[null,null,null,null,null,null,null,null,null,null,null,0,null,{"$error":"#DIV/0!"},null,null,null,null,null,null,null,null,0,null,{"$error":"#DIV/0!"}]
[null,null,null,null,null,null,null,null,null,null,null,0,null,{"$error":"#DIV/0!"},null,null,null,null,null,null,null,null,0,null,{"$error":"#DIV/0!"}]
[null,null,null,null,null,null,null,null,null,null,null,0,null,{"$error":"#DIV/0!"},null,null,null,null,null,null,null,null,0,null,{"$error":"#DIV/0!"}]
[null,null,null,null,null,null,null,null,null,null,null,{"$f":"SUM(C472:K472)","v":0},null,{"$error":"#DIV/0!"},null,null,null,null,null,null,null,null,{"$f":"SUM(O472:V472)","v":0},null,{"$error":"#DIV/0!"}]
[null,null,null,null,null,null,null,null,null,null,null,0,null,{"$f":"L473/$L$1121*100","v":{"$error":"#DIV/0!"}},null,null,null,null,null,null,null,null,0,null,{"$f":"W473/$W$1121*100","v":{"$error":"#DIV/0!"}}]
[null,null,null,null,null,null,null,null,null,null,null,0,null,{"$error":"#DIV/0!"},null,null,null,null,null,null,null,null,0,null,{"$error":"#DIV/0!"}]
[null,null,null,null,null,null,null,null,null,null,null,0,null,{"$error":"#DIV/0!"},null,null,null,null,null,null,null,null,0,null,{"$error":"#DIV/0!"}]
[null,null,null,null,null,null,null,null,null,null,null,0,null,{"$error":"#DIV/0!"},null,null,null,null,null,null,null,null,0,null,{"$error":"#DIV/0!"}]
[null,null,null,null,null,null,null,null,null,null,null,0,null,{"$error":"#DIV/0!"},null,null,null,null,null,null,null,null,0,null,{"$error":"#DIV/0!"}]
[null,null,null,null,null,null,null,null,null,null,null,0,null,{"$error":"#DIV/0!"},null,null,null,null,null,null,null,null,0,null,{"$error":"#DIV/0!"}]
[null,null,null,null,null,null,null,null,null,null,null,0,null,{"$error":"#DIV/0!"},null,null,null,null,null,null,null,null,0,null,{"$error":"#DIV/0!"}]
[null,null,null,null,null,null,null,null,null,null,null,0,null,{"$error":"#DIV/0!"},null,null,null,null,null,null,null,null,0,null,{"$error":"#DIV/0!"}]
[null,null,null,null,null,null,null,null,null,null,null,0,null,{"$error":"#DIV/0!"},null,null,null,null,null,null,null,null,0,null,{"$error":"#DIV/0!"}]
[null,null,null,null,null,null,null,null,null,null,null,0,null,{"$error":"#DIV/0!"},null,null,null,null,null,null,null,null,0,null,{"$error":"#DIV/0!"}]
[null,null,null,null,null,null,null,null,null,null,null,0,null,{"$error":"#DIV/0!"},null,null,null,null,null,null,null,null,0,null,{"$error":"#DIV/0!"}]
[null,null,null,null,null,null,null,null,null,null,null,0,null,{"$error":"#DIV/0!"},null,null,null,null,null,null,null,null,0,null,{"$error":"#DIV/0!"}]
[null,null,null,null,null,null,null,null,null,null,null,0,null,{"$error":"#DIV/0!"},null,null,null,null,null,null,null,null,0,null,{"$error":"#DIV/0!"}]
[null,null,null,null,null,null,null,null,null,null,null,0,null,{"$error":"#DIV/0!"},null,null,null,null,null,null,null,null,0,null,{"$error":"#DIV/0!"}]
[null,null,null,null,null,null,null,null,null,null,null,0,null,{"$error":"#DIV/0!"},null,null,null,null,null,null,null,null,0,null,{"$error":"#DIV/0!"}]
[null,null,null,null,null,null,null,null,null,null,null,0,null,{"$error":"#DIV/0!"},null,null,null,null,null,null,null,null,0,null,{"$error":"#DIV/0!"}]
[null,null,null,null,null,null,null,null,null,null,null,0,null,{"$error":"#DIV/0!"},null,null,null,null,null,null,null,null,0,null,{"$error":"#DIV/0!"}]
[null,null,null,null,null,null,null,null,null,null,null,0,null,{"$error":"#DIV/0!"},null,null,null,null,null,null,null,null,0,null,{"$error":"#DIV/0!"}]
[null,null,null,null,null,null,null,null,null,null,null,0,null,{"$error":"#DIV/0!"},null,null,null,null,null,null,null,null,0,null,{"$error":"#DIV/0!"}]
[null,null,null,null,null,null,null,null,null,null,null,0,null,{"$error":"#DIV/0!"},null,null,null,null,null,null,null,null,0,null,{"$error":"#DIV/0!"}]
[null,null,null,null,null,null,null,null,null,null,null,0,null,{"$error":"#DIV/0!"},null,null,null,null,null,null,null,null,0,null,{"$error":"#DIV/0!"}]
[null,null,null,null,null,null,null,null,null,null,null,0,null,{"$error":"#DIV/0!"},null,null,null,null,null,null,null,null,0,null,{"$error":"#DIV/0!"}]
[null,null,null,null,null,null,null,null,null,null,null,0,null,{"$error":"#DIV/0!"},null,null,null,null,null,null,null,null,0,null,{"$error":"#DIV/0!"}]
[null,null,null,null,null,null,null,null,null,null,null,0,null,{"$error":"#DIV/0!"},null,null,null,null,null,null,null,null,0,null,{"$error":"#DIV/0!"}]
[null,null,null,null,null,null,null,null,null,null,null,0,null,{"$error":"#DIV/0!"},null,null,null,null,null,null,null,null,0,null,{"$error":"#DIV/0!"}]
[null,null,null,null,null,null,null,null,null,null,null,0,null,{"$error":"#DIV/0!"},null,null,null,null,null,null,null,null,0,null,{"$error":"#DIV/0!"}]
[null,null,null,null,null,null,null,null,null,null,null,0,null,{"$error":"#DIV/0!"},null,null,null,null,null,null,null,null,0,null,{"$error":"#DIV/0!"}]
[null,null,null,null,null,null,null,null,null,null,null,0,null,{"$error":"#DIV/0!"},null,null,null,null,null,null,null,null,0,null,{"$error":"#DIV/0!"}]
[null,null,null,null,null,null,null,null,null,null,null,0,null,{"$error":"#DIV/0!"},null,null,null,null,null,null,null,null,0,null,{"$error":"#DIV/0!"}]
[null,null,null,null,null,null,null,null,null,null,null,0,null,{"$error":"#DIV/0!"},null,null,null,null,null,null,null,null,0,null,{"$error":"#DIV/0!"}]
[null,null,null,null,null,null,null,null,null,null,null,0,null,{"$error":"#DIV/0!"},null,null,null,null,null,null,null,null,0,null,{"$error":"#DIV/0!"}]
[null,null,null,null,null,null,null,null,null,null,null,0,null,{"$error":"#DIV/0!"},null,null,null,null,null,null,null,null,0,null,{"$error":"#DIV/0!"}]
[null,null,null,null,null,null,null,null,null,null,null,0,null,{"$error":"#DIV/0!"},null,null,null,null,null,null,null,null,0,null,{"$error":"#DIV/0!"}]
[null,null,null,null,null,null,null,null,null,null,null,0,null,{"$error":"#DIV/0!"},null,null,null,null,null,null,null,null,0,null,{"$error":"#DIV/0!"}]
[null,null,null,null,null,null,null,null,null,null,null,0,null,{"$error":"#DIV/0!"},null,null,null,null,null,null,null,null,0,null,{"$error":"#DIV/0!"}]
[null,null,null,null,null,null,null,null,null,null,null,0,null,{"$error":"#DIV/0!"},null,null,null,null,null,null,null,null,0,null,{"$error":"#DIV/0!"}]
[null,null,null,null,null,null,null,null,null,null,null,0,null,{"$error":"#DIV/0!"},null,null,null,null,null,null,null,null,0,null,{"$error":"#DIV/0!"}]
[null,null,null,null,null,null,null,null,null,null,null,0,null,{"$error":"#DIV/0!"},null,null,null,null,null,null,null,null,0,null,{"$error":"#DIV/0!"}]
[null,null,null,null,null,null,null,null,null,null,null,0,null,{"$error":"#DIV/0!"},null,null,null,null,null,null,null,null,0,null,{"$error":"#DIV/0!"}]
[null,null,null,null,null,null,null,null,null,null,null,0,null,{"$error":"#DIV/0!"},null,null,null,null,null,null,null,null,0,null,{"$error":"#DIV/0!"}]
[null,null,null,null,null,null,null,null,null,null,null,0,null,{"$error":"#DIV/0!"},null,null,null,null,null,null,null,null,0,null,{"$error":"#DIV/0!"}]
[null,null,null,null,null,null,null,null,null,null,null,0,null,{"$error":"#DIV/0!"},null,null,null,null,null,null,null,null,0,null,{"$error":"#DIV/0!"}]
[null,null,null,null,null,null,null,null,null,null,null,0,null,{"$error":"#DIV/0!"},null,null,null,null,null,null,null,null,0,null,{"$error":"#DIV/0!"}]
[null,null,null,null,null,null,null,null,null,null,null,0,null,{"$error":"#DIV/0!"},null,null,null,null,null,null,null,null,0,null,{"$error":"#DIV/0!"}]
[null,null,null,null,null,null,null,null,null,null,null,0,null,{"$error":"#DIV/0!"},null,null,null,null,null,null,null,null,0,null,{"$error":"#DIV/0!"}]
[null,null,null,null,null,null,null,null,null,null,null,0,null,{"$error":"#DIV/0!"},null,null,null,null,null,null,null,null,0,null,{"$error":"#DIV/0!"}]
[null,null,null,null,null,null,null,null,null,null,null,0,null,{"$error":"#DIV/0!"},null,null,null,null,null,null,null,null,0,null,{"$error":"#DIV/0!"}]
[null,null,null,null,null,null,null,null,null,null,null,0,null,{"$error":"#DIV/0!"},null,null,null,null,null,null,null,null,0,null,{"$error":"#DIV/0!"}]
[null,null,null,null,null,null,null,null,null,null,null,0,null,{"$error":"#DIV/0!"},null,null,null,null,null,null,null,null,0,null,{"$error":"#DIV/0!"}]
[null,null,null,null,null,null,null,null,null,null,null,0,null,{"$error":"#DIV/0!"},null,null,null,null,null,null,null,null,0,null,{"$error":"#DIV/0!"}]
[null,null,null,null,null,null,null,null,null,null,null,0,null,{"$error":"#DIV/0!"},null,null,null,null,null,null,null,null,0,null,{"$error":"#DIV/0!"}]
[null,null,null,null,null,null,null,null,null,null,null,0,null,{"$error":"#DIV/0!"},null,null,null,null,null,null,null,null,0,null,{"$error":"#DIV/0!"}]
[null,null,null,null,null,null,null,null,null,null,null,0,null,{"$error":"#DIV/0!"},null,null,null,null,null,null,null,null,0,null,{"$error":"#DIV/0!"}]
[null,null,null,null,null,null,null,null,null,null,null,0,null,{"$error":"#DIV/0!"},null,null,null,null,null,null,null,null,0,null,{"$error":"#DIV/0!"}]
[null,null,null,null,null,null,null,null,null,null,null,0,null,{"$error":"#DIV/0!"},null,null,null,null,null,null,null,null,0,null,{"$error":"#DIV/0!"}]
[null,null,null,null,null,null,null,null,null,null,null,0,null,{"$error":"#DIV/0!"},null,null,null,null,null,null,null,null,0,null,{"$error":"#DIV/0!"}]
[null,null,null,null,null,null,null,null,null,null,null,0,null,{"$error":"#DIV/0!"},null,null,null,null,null,null,null,null,0,null,{"$error":"#DIV/0!"}]
[null,null,null,null,null,null,null,null,null,null,null,0,null,{"$error":"#DIV/0!"},null,null,null,null,null,null,null,null,0,null,{"$error":"#DIV/0!"}]
[null,null,null,null,null,null,null,null,null,null,null,0,null,{"$error":"#DIV/0!"},null,null,null,null,null,null,null,null,0,null,{"$error":"#DIV/0!"}]
[null,null,null,null,null,null,null,null,null,null,null,0,null,{"$error":"#DIV/0!"},null,null,null,null,null,null,null,null,0,null,{"$error":"#DIV/0!"}]
[null,null,null,null,null,null,null,null,null,null,null,0,null,{"$error":"#DIV/0!"},null,null,null,null,null,null,null,null,0,null,{"$error":"#DIV/0!"}]
[null,null,null,null,null,null,null,null,null,null,null,0,null,{"$error":"#DIV/0!"},null,null,null,null,null,null,null,null,0,null,{"$error":"#DIV/0!"}]
[null,null,null,null,null,null,null,null,null,null,null,0,null,{"$error":"#DIV/0!"},null,null,null,null,null,null,null,null,0,null,{"$error":"#DIV/0!"}]
[null,null,null,null,null,null,null,null,null,null,null,{"$f":"SUM(C536:K536)","v":0},null,{"$error":"#DIV/0!"},null,null,null,null,null,null,null,null,{"$f":"SUM(O536:V536)","v":0},null,{"$error":"#DIV/0!"}]
[null,null,null,null,null,null,null,null,null,null,null,0,null,{"$f":"L537/$L$1121*100","v":{"$error":"#DIV/0!"}},null,null,null,null,null,null,null,null,0,null,{"$f":"W537/$W$1121*100","v":{"$error":"#DIV/0!"}}]
[null,null,null,null,null,null,null,null,null,null,null,0,null,{"$error":"#DIV/0!"},null,null,null,null,null,null,null,null,0,null,{"$error":"#DIV/0!"}]
[null,null,null,null,null,null,null,null,null,null,null,0,null,{"$error":"#DIV/0!"},null,null,null,null,null,null,null,null,0,null,{"$error":"#DIV/0!"}]
[null,null,null,null,null,null,null,null,null,null,null,0,null,{"$error":"#DIV/0!"},null,null,null,null,null,null,null,null,0,null,{"$error":"#DIV/0!"}]
[null,null,null,null,null,null,null,null,null,null,null,0,null,{"$error":"#DIV/0!"},null,null,null,null,null,null,null,null,0,null,{"$error":"#DIV/0!"}]
[null,null,null,null,null,null,null,null,null,null,null,0,null,{"$error":"#DIV/0!"},null,null,null,null,null,null,null,null,0,null,{"$error":"#DIV/0!"}]
[null,null,null,null,null,null,null,null,null,null,null,0,null,{"$error":"#DIV/0!"},null,null,null,null,null,null,null,null,0,null,{"$error":"#DIV/0!"}]
[null,null,null,null,null,null,null,null,null,null,null,0,null,{"$error":"#DIV/0!"},null,null,null,null,null,null,null,null,0,null,{"$error":"#DIV/0!"}]
[null,null,null,null,null,null,null,null,null,null,null,0,null,{"$error":"#DIV/0!"},null,null,null,null,null,null,null,null,0,null,{"$error":"#DIV/0!"}]
[null,null,null,null,null,null,null,null,null,null,null,0,null,{"$error":"#DIV/0!"},null,null,null,null,null,null,null,null,0,null,{"$error":"#DIV/0!"}]
[null,null,null,null,null,null,null,null,null,null,null,0,null,{"$error":"#DIV/0!"},null,null,null,null,null,null,null,null,0,null,{"$error":"#DIV/0!"}]
[null,null,null,null,null,null,null,null,null,null,null,0,null,{"$error":"#DIV/0!"},null,null,null,null,null,null,null,null,0,null,{"$error":"#DIV/0!"}]
[null,null,null,null,null,null,null,null,null,null,null,0,null,{"$error":"#DIV/0!"},null,null,null,null,null,null,null,null,0,null,{"$error":"#DIV/0!"}]
[null,null,null,null,null,null,null,null,null,null,null,0,null,{"$error":"#DIV/0!"},null,null,null,null,null,null,null,null,0,null,{"$error":"#DIV/0!"}]
[null,null,null,null,null,null,null,null,null,null,null,0,null,{"$error":"#DIV/0!"},null,null,null,null,null,null,null,null,0,null,{"$error":"#DIV/0!"}]
[null,null,null,null,null,null,null,null,null,null,null,0,null,{"$error":"#DIV/0!"},null,null,null,null,null,null,null,null,0,null,{"$error":"#DIV/0!"}]
[null,null,null,null,null,null,null,null,null,null,null,0,null,{"$error":"#DIV/0!"},null,null,null,null,null,null,null,null,0,null,{"$error":"#DIV/0!"}]
[null,null,null,null,null,null,null,null,null,null,null,0,null,{"$error":"#DIV/0!"},null,null,null,null,null,null,null,null,0,null,{"$error":"#DIV/0!"}]
[null,null,null,null,null,null,null,null,null,null,null,0,null,{"$error":"#DIV/0!"},null,null,null,null,null,null,null,null,0,null,{"$error":"#DIV/0!"}]
[null,null,null,null,null,null,null,null,null,null,null,0,null,{"$error":"#DIV/0!"},null,null,null,null,null,null,null,null,0,null,{"$error":"#DIV/0!"}]
[null,null,null,null,null,null,null,null,null,null,null,0,null,{"$error":"#DIV/0!"},null,null,null,null,null,null,null,null,0,null,{"$error":"#DIV/0!"}]
[null,null,null,null,null,null,null,null,null,null,null,0,null,{"$error":"#DIV/0!"},null,null,null,null,null,null,null,null,0,null,{"$error":"#DIV/0!"}]
[null,null,null,null,null,null,null,null,null,null,null,0,null,{"$error":"#DIV/0!"},null,null,null,null,null,null,null,null,0,null,{"$error":"#DIV/0!"}]
[null,null,null,null,null,null,null,null,null,null,null,0,null,{"$error":"#DIV/0!"},null,null,null,null,null,null,null,null,0,null,{"$error":"#DIV/0!"}]
[null,null,null,null,null,null,null,null,null,null,null,0,null,{"$error":"#DIV/0!"},null,null,null,null,null,null,null,null,0,null,{"$error":"#DIV/0!"}]
[null,null,null,null,null,null,null,null,null,null,null,0,null,{"$error":"#DIV/0!"},null,null,null,null,null,null,null,null,0,null,{"$error":"#DIV/0!"}]
[null,null,null,null,null,null,null,null,null,null,null,0,null,{"$error":"#DIV/0!"},null,null,null,null,null,null,null,null,0,null,{"$error":"#DIV/0!"}]
[null,null,null,null,null,null,null,null,null,null,null,0,null,{"$error":"#DIV/0!"},null,null,null,null,null,null,null,null,0,null,{"$error":"#DIV/0!"}]
[null,null,null,null,null,null,null,null,null,null,null,0,null,{"$error":"#DIV/0!"},null,null,null,null,null,null,null,null,0,null,{"$error":"#DIV/0!"}]
[null,null,null,null,null,null,null,null,null,null,null,0,null,{"$error":"#DIV/0!"},null,null,null,null,null,null,null,null,0,null,{"$error":"#DIV/0!"}]
[null,null,null,null,null,null,null,null,null,null,null,0,null,{"$error":"#DIV/0!"},null,null,null,null,null,null,null,null,0,null,{"$error":"#DIV/0!"}]
[null,null,null,null,null,null,null,null,null,null,null,0,null,{"$error":"#DIV/0!"},null,null,null,null,null,null,null,null,0,null,{"$error":"#DIV/0!"}]
[null,null,null,null,null,null,null,null,null,null,null,0,null,{"$error":"#DIV/0!"},null,null,null,null,null,null,null,null,0,null,{"$error":"#DIV/0!"}]
[null,null,null,null,null,null,null,null,null,null,null,0,null,{"$error":"#DIV/0!"},null,null,null,null,null,null,null,null,0,null,{"$error":"#DIV/0!"}]
[null,null,null,null,null,null,null,null,null,null,null,0,null,{"$error":"#DIV/0!"},null,null,null,null,null,null,null,null,0,null,{"$error":"#DIV/0!"}]
[null,null,null,null,null,null,null,null,null,null,null,0,null,{"$error":"#DIV/0!"},null,null,null,null,null,null,null,null,0,null,{"$error":"#DIV/0!"}]
[null,null,null,null,null,null,null,null,null,null,null,0,null,{"$error":"#DIV/0!"},null,null,null,null,null,null,null,null,0,null,{"$error":"#DIV/0!"}]
[null,null,null,null,null,null,null,null,null,null,null,0,null,{"$error":"#DIV/0!"},null,null,null,null,null,null,null,null,0,null,{"$error":"#DIV/0!"}]
[null,null,null,null,null,null,null,null,null,null,null,0,null,{"$error":"#DIV/0!"},null,null,null,null,null,null,null,null,0,null,{"$error":"#DIV/0!"}]
[null,null,null,null,null,null,null,null,null,null,null,0,null,{"$error":"#DIV/0!"},null,null,null,null,null,null,null,null,0,null,{"$error":"#DIV/0!"}]
[null,null,null,null,null,null,null,null,null,null,null,0,null,{"$error":"#DIV/0!"},null,null,null,null,null,null,null,null,0,null,{"$error":"#DIV/0!"}]
[null,null,null,null,null,null,null,null,null,null,null,0,null,{"$error":"#DIV/0!"},null,null,null,null,null,null,null,null,0,null,{"$error":"#DIV/0!"}]
[null,null,null,null,null,null,null,null,null,null,null,0,null,{"$error":"#DIV/0!"},null,null,null,null,null,null,null,null,0,null,{"$error":"#DIV/0!"}]
[null,null,null,null,null,null,null,null,null,null,null,0,null,{"$error":"#DIV/0!"},null,null,null,null,null,null,null,null,0,null,{"$error":"#DIV/0!"}]
[null,null,null,null,null,null,null,null,null,null,null,0,null,{"$error":"#DIV/0!"},null,null,null,null,null,null,null,null,0,null,{"$error":"#DIV/0!"}]
[null,null,null,null,null,null,null,null,null,null,null,0,null,{"$error":"#DIV/0!"},null,null,null,null,null,null,null,null,0,null,{"$error":"#DIV/0!"}]
[null,null,null,null,null,null,null,null,null,null,null,0,null,{"$error":"#DIV/0!"},null,null,null,null,null,null,null,null,0,null,{"$error":"#DIV/0!"}]
[null,null,null,null,null,null,null,null,null,null,null,0,null,{"$error":"#DIV/0!"},null,null,null,null,null,null,null,null,0,null,{"$error":"#DIV/0!"}]
[null,null,null,null,null,null,null,null,null,null,null,0,null,{"$error":"#DIV/0!"},null,null,null,null,null,null,null,null,0,null,{"$error":"#DIV/0!"}]
[null,null,null,null,null,null,null,null,null,null,null,0,null,{"$error":"#DIV/0!"},null,null,null,null,null,null,null,null,0,null,{"$error":"#DIV/0!"}]
[null,null,null,null,null,null,null,null,null,null,null,0,null,{"$error":"#DIV/0!"},null,null,null,null,null,null,null,null,0,null,{"$error":"#DIV/0!"}]
[null,null,null,null,null,null,null,null,null,null,null,0,null,{"$error":"#DIV/0!"},null,null,null,null,null,null,null,null,0,null,{"$error":"#DIV/0!"}]
[null,null,null,null,null,null,null,null,null,null,null,0,null,{"$error":"#DIV/0!"},null,null,null,null,null,null,null,null,0,null,{"$error":"#DIV/0!"}]
[null,null,null,null,null,null,null,null,null,null,null,0,null,{"$error":"#DIV/0!"},null,null,null,null,null,null,null,null,0,null,{"$error":"#DIV/0!"}]
[null,null,null,null,null,null,null,null,null,null,null,0,null,{"$error":"#DIV/0!"},null,null,null,null,null,null,null,null,0,null,{"$error":"#DIV/0!"}]
[null,null,null,null,null,null,null,null,null,null,null,0,null,{"$error":"#DIV/0!"},null,null,null,null,null,null,null,null,0,null,{"$error":"#DIV/0!"}]
[null,null,null,null,null,null,null,null,null,null,null,0,null,{"$error":"#DIV/0!"},null,null,null,null,null,null,null,null,0,null,{"$error":"#DIV/0!"}]
[null,null,null,null,null,null,null,null,null,null,null,0,null,{"$error":"#DIV/0!"},null,null,null,null,null,null,null,null,0,null,{"$error":"#DIV/0!"}]
[null,null,null,null,null,null,null,null,null,null,null,0,null,{"$error":"#DIV/0!"},null,null,null,null,null,null,null,null,0,null,{"$error":"#DIV/0!"}]
[null,null,null,null,null,null,null,null,null,null,null,0,null,{"$error":"#DIV/0!"},null,null,null,null,null,null,null,null,0,null,{"$error":"#DIV/0!"}]
[null,null,null,null,null,null,null,null,null,null,null,0,null,{"$error":"#DIV/0!"},null,null,null,null,null,null,null,null,0,null,{"$error":"#DIV/0!"}]
[null,null,null,null,null,null,null,null,null,null,null,0,null,{"$error":"#DIV/0!"},null,null,null,null,null,null,null,null,0,null,{"$error":"#DIV/0!"}]
[null,null,null,null,null,null,null,null,null,null,null,0,null,{"$error":"#DIV/0!"},null,null,null,null,null,null,null,null,0,null,{"$error":"#DIV/0!"}]
[null,null,null,null,null,null,null,null,null,null,null,{"$f":"SUM(C600:K600)","v":0},null,{"$error":"#DIV/0!"},null,null,null,null,null,null,null,null,{"$f":"SUM(O600:V600)","v":0},null,{"$error":"#DIV/0!"}]
[null,null,null,null,null,null,null,null,null,null,null,0,null,{"$f":"L601/$L$1121*100","v":{"$error":"#DIV/0!"}},null,null,null,null,null,null,null,null,0,null,{"$f":"W601/$W$1121*100","v":{"$error":"#DIV/0!"}}]
[null,null,null,null,null,null,null,null,null,null,null,0,null,{"$error":"#DIV/0!"},null,null,null,null,null,null,null,null,0,null,{"$error":"#DIV/0!"}]
[null,null,null,null,null,null,null,null,null,null,null,0,null,{"$error":"#DIV/0!"},null,null,null,null,null,null,null,null,0,null,{"$error":"#DIV/0!"}]
[null,null,null,null,null,null,null,null,null,null,null,0,null,{"$error":"#DIV/0!"},null,null,null,null,null,null,null,null,0,null,{"$error":"#DIV/0!"}]
[null,null,null,null,null,null,null,null,null,null,null,0,null,{"$error":"#DIV/0!"},null,null,null,null,null,null,null,null,0,null,{"$error":"#DIV/0!"}]
[null,null,null,null,null,null,null,null,null,null,null,0,null,{"$error":"#DIV/0!"},null,null,null,null,null,null,null,null,0,null,{"$error":"#DIV/0!"}]
[null,null,null,null,null,null,null,null,null,null,null,0,null,{"$error":"#DIV/0!"},null,null,null,null,null,null,null,null,0,null,{"$error":"#DIV/0!"}]
[null,null,null,null,null,null,null,null,null,null,null,0,null,{"$error":"#DIV/0!"},null,null,null,null,null,null,null,null,0,null,{"$error":"#DIV/0!"}]
[null,null,null,null,null,null,null,null,null,null,null,0,null,{"$error":"#DIV/0!"},null,null,null,null,null,null,null,null,0,null,{"$error":"#DIV/0!"}]
[null,null,null,null,null,null,null,null,null,null,null,0,null,{"$error":"#DIV/0!"},null,null,null,null,null,null,null,null,0,null,{"$error":"#DIV/0!"}]
[null,null,null,null,null,null,null,null,null,null,null,0,null,{"$error":"#DIV/0!"},null,null,null,null,null,null,null,null,0,null,{"$error":"#DIV/0!"}]
[null,null,null,null,null,null,null,null,null,null,null,0,null,{"$error":"#DIV/0!"},null,null,null,null,null,null,null,null,0,null,{"$error":"#DIV/0!"}]
[null,null,null,null,null,null,null,null,null,null,null,0,null,{"$error":"#DIV/0!"},null,null,null,null,null,null,null,null,0,null,{"$error":"#DIV/0!"}]
[null,null,null,null,null,null,null,null,null,null,null,0,null,{"$error":"#DIV/0!"},null,null,null,null,null,null,null,null,0,null,{"$error":"#DIV/0!"}]
[null,null,null,null,null,null,null,null,null,null,null,0,null,{"$error":"#DIV/0!"},null,null,null,null,null,null,null,null,0,null,{"$error":"#DIV/0!"}]
[null,null,null,null,null,null,null,null,null,null,null,0,null,{"$error":"#DIV/0!"},null,null,null,null,null,null,null,null,0,null,{"$error":"#DIV/0!"}]
[null,null,null,null,null,null,null,null,null,null,null,0,null,{"$error":"#DIV/0!"},null,null,null,null,null,null,null,null,0,null,{"$error":"#DIV/0!"}]
[null,null,null,null,null,null,null,null,null,null,null,0,null,{"$error":"#DIV/0!"},null,null,null,null,null,null,null,null,0,null,{"$error":"#DIV/0!"}]
[null,null,null,null,null,null,null,null,null,null,null,0,null,{"$error":"#DIV/0!"},null,null,null,null,null,null,null,null,0,null,{"$error":"#DIV/0!"}]
[null,null,null,null,null,null,null,null,null,null,null,0,null,{"$error":"#DIV/0!"},null,null,null,null,null,null,null,null,0,null,{"$error":"#DIV/0!"}]
[null,null,null,null,null,null,null,null,null,null,null,0,null,{"$error":"#DIV/0!"},null,null,null,null,null,null,null,null,0,null,{"$error":"#DIV/0!"}]
[null,null,null,null,null,null,null,null,null,null,null,0,null,{"$error":"#DIV/0!"},null,null,null,null,null,null,null,null,0,null,{"$error":"#DIV/0!"}]
[null,null,null,null,null,null,null,null,null,null,null,0,null,{"$error":"#DIV/0!"},null,null,null,null,null,null,null,null,0,null,{"$error":"#DIV/0!"}]
[null,null,null,null,null,null,null,null,null,null,null,0,null,{"$error":"#DIV/0!"},null,null,null,null,null,null,null,null,0,null,{"$error":"#DIV/0!"}]
[null,null,null,null,null,null,null,null,null,null,null,0,null,{"$error":"#DIV/0!"},null,null,null,null,null,null,null,null,0,null,{"$error":"#DIV/0!"}]
[null,null,null,null,null,null,null,null,null,null,null,0,null,{"$error":"#DIV/0!"},null,null,null,null,null,null,null,null,0,null,{"$error":"#DIV/0!"}]
[null,null,null,null,null,null,null,null,null,null,null,0,null,{"$error":"#DIV/0!"},null,null,null,null,null,null,null,null,0,null,{"$error":"#DIV/0!"}]
[null,null,null,null,null,null,null,null,null,null,null,0,null,{"$error":"#DIV/0!"},null,null,null,null,null,null,null,null,0,null,{"$error":"#DIV/0!"}]
[null,null,null,null,null,null,null,null,null,null,null,0,null,{"$error":"#DIV/0!"},null,null,null,null,null,null,null,null,0,null,{"$error":"#DIV/0!"}]
[null,null,null,null,null,null,null,null,null,null,null,0,null,{"$error":"#DIV/0!"},null,null,null,null,null,null,null,null,0,null,{"$error":"#DIV/0!"}]
[null,null,null,null,null,null,null,null,null,null,null,0,null,{"$error":"#DIV/0!"},null,null,null,null,null,null,null,null,0,null,{"$error":"#DIV/0!"}]
[null,null,null,null,null,null,null,null,null,null,null,0,null,{"$error":"#DIV/0!"},null,null,null,null,null,null,null,null,0,null,{"$error":"#DIV/0!"}]
[null,null,null,null,null,null,null,null,null,null,null,0,null,{"$error":"#DIV/0!"},null,null,null,null,null,null,null,null,0,null,{"$error":"#DIV/0!"}]
[null,null,null,null,null,null,null,null,null,null,null,0,null,{"$error":"#DIV/0!"},null,null,null,null,null,null,null,null,0,null,{"$error":"#DIV/0!"}]
[null,null,null,null,null,null,null,null,null,null,null,0,null,{"$error":"#DIV/0!"},null,null,null,null,null,null,null,null,0,null,{"$error":"#DIV/0!"}]
[null,null,null,null,null,null,null,null,null,null,null,0,null,{"$error":"#DIV/0!"},null,null,null,null,null,null,null,null,0,null,{"$error":"#DIV/0!"}]
[null,null,null,null,null,null,null,null,null,null,null,0,null,{"$error":"#DIV/0!"},null,null,null,null,null,null,null,null,0,null,{"$error":"#DIV/0!"}]
[null,null,null,null,null,null,null,null,null,null,null,0,null,{"$error":"#DIV/0!"},null,null,null,null,null,null,null,null,0,null,{"$error":"#DIV/0!"}]
[null,null,null,null,null,null,null,null,null,null,null,0,null,{"$error":"#DIV/0!"},null,null,null,null,null,null,null,null,0,null,{"$error":"#DIV/0!"}]
[null,null,null,null,null,null,null,null,null,null,null,0,null,{"$error":"#DIV/0!"},null,null,null,null,null,null,null,null,0,null,{"$error":"#DIV/0!"}]
[null,null,null,null,null,null,null,null,null,null,null,0,null,{"$error":"#DIV/0!"},null,null,null,null,null,null,null,null,0,null,{"$error":"#DIV/0!"}]
[null,null,null,null,null,null,null,null,null,null,null,0,null,{"$error":"#DIV/0!"},null,null,null,null,null,null,null,null,0,null,{"$error":"#DIV/0!"}]
[null,null,null,null,null,null,null,null,null,null,null,0,null,{"$error":"#DIV/0!"},null,null,null,null,null,null,null,null,0,null,{"$error":"#DIV/0!"}]
[null,null,null,null,null,null,null,null,null,null,null,0,null,{"$error":"#DIV/0!"},null,null,null,null,null,null,null,null,0,null,{"$error":"#DIV/0!"}]
[null,null,null,null,null,null,null,null,null,null,null,0,null,{"$error":"#DIV/0!"},null,null,null,null,null,null,null,null,0,null,{"$error":"#DIV/0!"}]
[null,null,null,null,null,null,null,null,null,null,null,0,null,{"$error":"#DIV/0!"},null,null,null,null,null,null,null,null,0,null,{"$error":"#DIV/0!"}]
[null,null,null,null,null,null,null,null,null,null,null,0,null,{"$error":"#DIV/0!"},null,null,null,null,null,null,null,null,0,null,{"$error":"#DIV/0!"}]
[null,null,null,null,null,null,null,null,null,null,null,0,null,{"$error":"#DIV/0!"},null,null,null,null,null,null,null,null,0,null,{"$error":"#DIV/0!"}]
[null,null,null,null,null,null,null,null,null,null,null,0,null,{"$error":"#DIV/0!"},null,null,null,null,null,null,null,null,0,null,{"$error":"#DIV/0!"}]
[null,null,null,null,null,null,null,null,null,null,null,0,null,{"$error":"#DIV/0!"},null,null,null,null,null,null,null,null,0,null,{"$error":"#DIV/0!"}]
[null,null,null,null,null,null,null,null,null,null,null,0,null,{"$error":"#DIV/0!"},null,null,null,null,null,null,null,null,0,null,{"$error":"#DIV/0!"}]
[null,null,null,null,null,null,null,null,null,null,null,0,null,{"$error":"#DIV/0!"},null,null,null,null,null,null,null,null,0,null,{"$error":"#DIV/0!"}]
[null,null,null,null,null,null,null,null,null,null,null,0,null,{"$error":"#DIV/0!"},null,null,null,null,null,null,null,null,0,null,{"$error":"#DIV/0!"}]
[null,null,null,null,null,null,null,null,null,null,null,0,null,{"$error":"#DIV/0!"},null,null,null,null,null,null,null,null,0,null,{"$error":"#DIV/0!"}]
[null,null,null,null,null,null,null,null,null,null,null,0,null,{"$error":"#DIV/0!"},null,null,null,null,null,null,null,null,0,null,{"$error":"#DIV/0!"}]
[null,null,null,null,null,null,null,null,null,null,null,0,null,{"$error":"#DIV/0!"},null,null,null,null,null,null,null,null,0,null,{"$error":"#DIV/0!"}]
[null,null,null,null,null,null,null,null,null,null,null,0,null,{"$error":"#DIV/0!"},null,null,null,null,null,null,null,null,0,null,{"$error":"#DIV/0!"}]
[null,null,null,null,null,null,null,null,null,null,null,0,null,{"$error":"#DIV/0!"},null,null,null,null,null,null,null,null,0,null,{"$error":"#DIV/0!"}]
[null,null,null,null,null,null,null,null,null,null,null,0,null,{"$error":"#DIV/0!"},null,null,null,null,null,null,null,null,0,null,{"$error":"#DIV/0!"}]
[null,null,null,null,null,null,null,null,null,null,null,0,null,{"$error":"#DIV/0!"},null,null,null,null,null,null,null,null,0,null,{"$error":"#DIV/0!"}]
[null,null,null,null,null,null,null,null,null,null,null,0,null,{"$error":"#DIV/0!"},null,null,null,null,null,null,null,null,0,null,{"$error":"#DIV/0!"}]
[null,null,null,null,null,null,null,null,null,null,null,0,null,{"$error":"#DIV/0!"},null,null,null,null,null,null,null,null,0,null,{"$error":"#DIV/0!"}]
[null,null,null,null,null,null,null,null,null,null,null,0,null,{"$error":"#DIV/0!"},null,null,null,null,null,null,null,null,0,null,{"$error":"#DIV/0!"}]
[null,null,null,null,null,null,null,null,null,null,null,{"$f":"SUM(C664:K664)","v":0},null,{"$error":"#DIV/0!"},null,null,null,null,null,null,null,null,{"$f":"SUM(O664:V664)","v":0},null,{"$error":"#DIV/0!"}]
[null,null,null,null,null,null,null,null,null,null,null,0,null,{"$f":"L665/$L$1121*100","v":{"$error":"#DIV/0!"}},null,null,null,null,null,null,null,null,0,null,{"$f":"W665/$W$1121*100","v":{"$error":"#DIV/0!"}}]
[null,null,null,null,null,null,null,null,null,null,null,0,null,{"$error":"#DIV/0!"},null,null,null,null,null,null,null,null,0,null,{"$error":"#DIV/0!"}]
[null,null,null,null,null,null,null,null,null,null,null,0,null,{"$error":"#DIV/0!"},null,null,null,null,null,null,null,null,0,null,{"$error":"#DIV/0!"}]
[null,null,null,null,null,null,null,null,null,null,null,0,null,{"$error":"#DIV/0!"},null,null,null,null,null,null,null,null,0,null,{"$error":"#DIV/0!"}]
[null,null,null,null,null,null,null,null,null,null,null,0,null,{"$error":"#DIV/0!"},null,null,null,null,null,null,null,null,0,null,{"$error":"#DIV/0!"}]
[null,null,null,null,null,null,null,null,null,null,null,0,null,{"$error":"#DIV/0!"},null,null,null,null,null,null,null,null,0,null,{"$error":"#DIV/0!"}]
[null,null,null,null,null,null,null,null,null,null,null,0,null,{"$error":"#DIV/0!"},null,null,null,null,null,null,null,null,0,null,{"$error":"#DIV/0!"}]
[null,null,null,null,null,null,null,null,null,null,null,0,null,{"$error":"#DIV/0!"},null,null,null,null,null,null,null,null,0,null,{"$error":"#DIV/0!"}]
[null,null,null,null,null,null,null,null,null,null,null,0,null,{"$error":"#DIV/0!"},null,null,null,null,null,null,null,null,0,null,{"$error":"#DIV/0!"}]
[null,null,null,null,null,null,null,null,null,null,null,0,null,{"$error":"#DIV/0!"},null,null,null,null,null,null,null,null,0,null,{"$error":"#DIV/0!"}]
[null,null,null,null,null,null,null,null,null,null,null,0,null,{"$error":"#DIV/0!"},null,null,null,null,null,null,null,null,0,null,{"$error":"#DIV/0!"}]
[null,null,null,null,null,null,null,null,null,null,null,0,null,{"$error":"#DIV/0!"},null,null,null,null,null,null,null,null,0,null,{"$error":"#DIV/0!"}]
[null,null,null,null,null,null,null,null,null,null,null,0,null,{"$error":"#DIV/0!"},null,null,null,null,null,null,null,null,0,null,{"$error":"#DIV/0!"}]
[null,null,null,null,null,null,null,null,null,null,null,0,null,{"$error":"#DIV/0!"},null,null,null,null,null,null,null,null,0,null,{"$error":"#DIV/0!"}]
[null,null,null,null,null,null,null,null,null,null,null,0,null,{"$error":"#DIV/0!"},null,null,null,null,null,null,null,null,0,null,{"$error":"#DIV/0!"}]
[null,null,null,null,null,null,null,null,null,null,null,0,null,{"$error":"#DIV/0!"},null,null,null,null,null,null,null,null,0,null,{"$error":"#DIV/0!"}]
[null,null,null,null,null,null,null,null,null,null,null,0,null,{"$error":"#DIV/0!"},null,null,null,null,null,null,null,null,0,null,{"$error":"#DIV/0!"}]
[null,null,null,null,null,null,null,null,null,null,null,0,null,{"$error":"#DIV/0!"},null,null,null,null,null,null,null,null,0,null,{"$error":"#DIV/0!"}]
[null,null,null,null,null,null,null,null,null,null,null,0,null,{"$error":"#DIV/0!"},null,null,null,null,null,null,null,null,0,null,{"$error":"#DIV/0!"}]
[null,null,null,null,null,null,null,null,null,null,null,0,null,{"$error":"#DIV/0!"},null,null,null,null,null,null,null,null,0,null,{"$error":"#DIV/0!"}]
[null,null,null,null,null,null,null,null,null,null,null,0,null,{"$error":"#DIV/0!"},null,null,null,null,null,null,null,null,0,null,{"$error":"#DIV/0!"}]
[null,null,null,null,null,null,null,null,null,null,null,0,null,{"$error":"#DIV/0!"},null,null,null,null,null,null,null,null,0,null,{"$error":"#DIV/0!"}]
[null,null,null,null,null,null,null,null,null,null,null,0,null,{"$error":"#DIV/0!"},null,null,null,null,null,null,null,null,0,null,{"$error":"#DIV/0!"}]
[null,null,null,null,null,null,null,null,null,null,null,0,null,{"$error":"#DIV/0!"},null,null,null,null,null,null,null,null,0,null,{"$error":"#DIV/0!"}]
[null,null,null,null,null,null,null,null,null,null,null,0,null,{"$error":"#DIV/0!"},null,null,null,null,null,null,null,null,0,null,{"$error":"#DIV/0!"}]
[null,null,null,null,null,null,null,null,null,null,null,0,null,{"$error":"#DIV/0!"},null,null,null,null,null,null,null,null,0,null,{"$error":"#DIV/0!"}]
[null,null,null,null,null,null,null,null,null,null,null,0,null,{"$error":"#DIV/0!"},null,null,null,null,null,null,null,null,0,null,{"$error":"#DIV/0!"}]
[null,null,null,null,null,null,null,null,null,null,null,0,null,{"$error":"#DIV/0!"},null,null,null,null,null,null,null,null,0,null,{"$error":"#DIV/0!"}]
[null,null,null,null,null,null,null,null,null,null,null,0,null,{"$error":"#DIV/0!"},null,null,null,null,null,null,null,null,0,null,{"$error":"#DIV/0!"}]
[null,null,null,null,null,null,null,null,null,null,null,0,null,{"$error":"#DIV/0!"},null,null,null,null,null,null,null,null,0,null,{"$error":"#DIV/0!"}]
[null,null,null,null,null,null,null,null,null,null,null,0,null,{"$error":"#DIV/0!"},null,null,null,null,null,null,null,null,0,null,{"$error":"#DIV/0!"}]
[null,null,null,null,null,null,null,null,null,null,null,0,null,{"$error":"#DIV/0!"},null,null,null,null,null,null,null,null,0,null,{"$error":"#DIV/0!"}]
[null,null,null,null,null,null,null,null,null,null,null,0,null,{"$error":"#DIV/0!"},null,null,null,null,null,null,null,null,0,null,{"$error":"#DIV/0!"}]
[null,null,null,null,null,null,null,null,null,null,null,0,null,{"$error":"#DIV/0!"},null,null,null,null,null,null,null,null,0,null,{"$error":"#DIV/0!"}]
[null,null,null,null,null,null,null,null,null,null,null,0,null,{"$error":"#DIV/0!"},null,null,null,null,null,null,null,null,0,null,{"$error":"#DIV/0!"}]
[null,null,null,null,null,null,null,null,null,null,null,0,null,{"$error":"#DIV/0!"},null,null,null,null,null,null,null,null,0,null,{"$error":"#DIV/0!"}]
[null,null,null,null,null,null,null,null,null,null,null,0,null,{"$error":"#DIV/0!"},null,null,null,null,null,null,null,null,0,null,{"$error":"#DIV/0!"}]
[null,null,null,null,null,null,null,null,null,null,null,0,null,{"$error":"#DIV/0!"},null,null,null,null,null,null,null,null,0,null,{"$error":"#DIV/0!"}]
[null,null,null,null,null,null,null,null,null,null,null,0,null,{"$error":"#DIV/0!"},null,null,null,null,null,null,null,null,0,null,{"$error":"#DIV/0!"}]
[null,null,null,null,null,null,null,null,null,null,null,0,null,{"$error":"#DIV/0!"},null,null,null,null,null,null,null,null,0,null,{"$error":"#DIV/0!"}]
[null,null,null,null,null,null,null,null,null,null,null,0,null,{"$error":"#DIV/0!"},null,null,null,null,null,null,null,null,0,null,{"$error":"#DIV/0!"}]
[null,null,null,null,null,null,null,null,null,null,null,0,null,{"$error":"#DIV/0!"},null,null,null,null,null,null,null,null,0,null,{"$error":"#DIV/0!"}]
[null,null,null,null,null,null,null,null,null,null,null,0,null,{"$error":"#DIV/0!"},null,null,null,null,null,null,null,null,0,null,{"$error":"#DIV/0!"}]
[null,null,null,null,null,null,null,null,null,null,null,0,null,{"$error":"#DIV/0!"},null,null,null,null,null,null,null,null,0,null,{"$error":"#DIV/0!"}]
[null,null,null,null,null,null,null,null,null,null,null,0,null,{"$error":"#DIV/0!"},null,null,null,null,null,null,null,null,0,null,{"$error":"#DIV/0!"}]
[null,null,null,null,null,null,null,null,null,null,null,0,null,{"$error":"#DIV/0!"},null,null,null,null,null,null,null,null,0,null,{"$error":"#DIV/0!"}]
[null,null,null,null,null,null,null,null,null,null,null,0,null,{"$error":"#DIV/0!"},null,null,null,null,null,null,null,null,0,null,{"$error":"#DIV/0!"}]
[null,null,null,null,null,null,null,null,null,null,null,0,null,{"$error":"#DIV/0!"},null,null,null,null,null,null,null,null,0,null,{"$error":"#DIV/0!"}]
[null,null,null,null,null,null,null,null,null,null,null,0,null,{"$error":"#DIV/0!"},null,null,null,null,null,null,null,null,0,null,{"$error":"#DIV/0!"}]
[null,null,null,null,null,null,null,null,null,null,null,0,null,{"$error":"#DIV/0!"},null,null,null,null,null,null,null,null,0,null,{"$error":"#DIV/0!"}]
[null,null,null,null,null,null,null,null,null,null,null,0,null,{"$error":"#DIV/0!"},null,null,null,null,null,null,null,null,0,null,{"$error":"#DIV/0!"}]
[null,null,null,null,null,null,null,null,null,null,null,0,null,{"$error":"#DIV/0!"},null,null,null,null,null,null,null,null,0,null,{"$error":"#DIV/0!"}]
[null,null,null,null,null,null,null,null,null,null,null,0,null,{"$error":"#DIV/0!"},null,null,null,null,null,null,null,null,0,null,{"$error":"#DIV/0!"}]
[null,null,null,null,null,null,null,null,null,null,null,0,null,{"$error":"#DIV/0!"},null,null,null,null,null,null,null,null,0,null,{"$error":"#DIV/0!"}]
[null,null,null,null,null,null,null,null,null,null,null,0,null,{"$error":"#DIV/0!"},null,null,null,null,null,null,null,null,0,null,{"$error":"#DIV/0!"}]
[null,null,null,null,null,null,null,null,null,null,null,0,null,{"$error":"#DIV/0!"},null,null,null,null,null,null,null,null,0,null,{"$error":"#DIV/0!"}]
[null,null,null,null,null,null,null,null,null,null,null,0,null,{"$error":"#DIV/0!"},null,null,null,null,null,null,null,null,0,null,{"$error":"#DIV/0!"}]
[null,null,null,null,null,null,null,null,null,null,null,0,null,{"$error":"#DIV/0!"},null,null,null,null,null,null,null,null,0,null,{"$error":"#DIV/0!"}]
[null,null,null,null,null,null,null,null,null,null,null,0,null,{"$error":"#DIV/0!"},null,null,null,null,null,null,null,null,0,null,{"$error":"#DIV/0!"}]
[null,null,null,null,null,null,null,null,null,null,null,0,null,{"$error":"#DIV/0!"},null,null,null,null,null,null,null,null,0,null,{"$error":"#DIV/0!"}]
[null,null,null,null,null,null,null,null,null,null,null,0,null,{"$error":"#DIV/0!"},null,null,null,null,null,null,null,null,0,null,{"$error":"#DIV/0!"}]
[null,null,null,null,null,null,null,null,null,null,null,0,null,{"$error":"#DIV/0!"},null,null,null,null,null,null,null,null,0,null,{"$error":"#DIV/0!"}]
[null,null,null,null,null,null,null,null,null,null,null,0,null,{"$error":"#DIV/0!"},null,null,null,null,null,null,null,null,0,null,{"$error":"#DIV/0!"}]
[null,null,null,null,null,null,null,null,null,null,null,{"$f":"SUM(C728:K728)","v":0},null,{"$error":"#DIV/0!"},null,null,null,null,null,null,null,null,{"$f":"SUM(O728:V728)","v":0},null,{"$error":"#DIV/0!"}]
[null,null,null,null,null,null,null,null,null,null,null,0,null,{"$f":"L729/$L$1121*100","v":{"$error":"#DIV/0!"}},null,null,null,null,null,null,null,null,0,null,{"$f":"W729/$W$1121*100","v":{"$error":"#DIV/0!"}}]
[null,null,null,null,null,null,null,null,null,null,null,0,null,{"$error":"#DIV/0!"},null,null,null,null,null,null,null,null,0,null,{"$error":"#DIV/0!"}]
[null,null,null,null,null,null,null,null,null,null,null,0,null,{"$error":"#DIV/0!"},null,null,null,null,null,null,null,null,0,null,{"$error":"#DIV/0!"}]
[null,null,null,null,null,null,null,null,null,null,null,0,null,{"$error":"#DIV/0!"},null,null,null,null,null,null,null,null,0,null,{"$error":"#DIV/0!"}]
[null,null,null,null,null,null,null,null,null,null,null,0,null,{"$error":"#DIV/0!"},null,null,null,null,null,null,null,null,0,null,{"$error":"#DIV/0!"}]
[null,null,null,null,null,null,null,null,null,null,null,0,null,{"$error":"#DIV/0!"},null,null,null,null,null,null,null,null,0,null,{"$error":"#DIV/0!"}]
[null,null,null,null,null,null,null,null,null,null,null,0,null,{"$error":"#DIV/0!"},null,null,null,null,null,null,null,null,0,null,{"$error":"#DIV/0!"}]
[null,null,null,null,null,null,null,null,null,null,null,0,null,{"$error":"#DIV/0!"},null,null,null,null,null,null,null,null,0,null,{"$error":"#DIV/0!"}]
[null,null,null,null,null,null,null,null,null,null,null,0,null,{"$error":"#DIV/0!"},null,null,null,null,null,null,null,null,0,null,{"$error":"#DIV/0!"}]
[null,null,null,null,null,null,null,null,null,null,null,0,null,{"$error":"#DIV/0!"},null,null,null,null,null,null,null,null,0,null,{"$error":"#DIV/0!"}]
[null,null,null,null,null,null,null,null,null,null,null,0,null,{"$error":"#DIV/0!"},null,null,null,null,null,null,null,null,0,null,{"$error":"#DIV/0!"}]
[null,null,null,null,null,null,null,null,null,null,null,0,null,{"$error":"#DIV/0!"},null,null,null,null,null,null,null,null,0,null,{"$error":"#DIV/0!"}]
[null,null,null,null,null,null,null,null,null,null,null,0,null,{"$error":"#DIV/0!"},null,null,null,null,null,null,null,null,0,null,{"$error":"#DIV/0!"}]
[null,null,null,null,null,null,null,null,null,null,null,0,null,{"$error":"#DIV/0!"},null,null,null,null,null,null,null,null,0,null,{"$error":"#DIV/0!"}]
[null,null,null,null,null,null,null,null,null,null,null,0,null,{"$error":"#DIV/0!"},null,null,null,null,null,null,null,null,0,null,{"$error":"#DIV/0!"}]
[null,null,null,null,null,null,null,null,null,null,null,0,null,{"$error":"#DIV/0!"},null,null,null,null,null,null,null,null,0,null,{"$error":"#DIV/0!"}]
[null,null,null,null,null,null,null,null,null,null,null,0,null,{"$error":"#DIV/0!"},null,null,null,null,null,null,null,null,0,null,{"$error":"#DIV/0!"}]
[null,null,null,null,null,null,null,null,null,null,null,0,null,{"$error":"#DIV/0!"},null,null,null,null,null,null,null,null,0,null,{"$error":"#DIV/0!"}]
[null,null,null,null,null,null,null,null,null,null,null,0,null,{"$error":"#DIV/0!"},null,null,null,null,null,null,null,null,0,null,{"$error":"#DIV/0!"}]
[null,null,null,null,null,null,null,null,null,null,null,0,null,{"$error":"#DIV/0!"},null,null,null,null,null,null,null,null,0,null,{"$error":"#DIV/0!"}]
[null,null,null,null,null,null,null,null,null,null,null,0,null,{"$error":"#DIV/0!"},null,null,null,null,null,null,null,null,0,null,{"$error":"#DIV/0!"}]
[null,null,null,null,null,null,null,null,null,null,null,0,null,{"$error":"#DIV/0!"},null,null,null,null,null,null,null,null,0,null,{"$error":"#DIV/0!"}]
[null,null,null,null,null,null,null,null,null,null,null,0,null,{"$error":"#DIV/0!"},null,null,null,null,null,null,null,null,0,null,{"$error":"#DIV/0!"}]
[null,null,null,null,null,null,null,null,null,null,null,0,null,{"$error":"#DIV/0!"},null,null,null,null,null,null,null,null,0,null,{"$error":"#DIV/0!"}]
[null,null,null,null,null,null,null,null,null,null,null,0,null,{"$error":"#DIV/0!"},null,null,null,null,null,null,null,null,0,null,{"$error":"#DIV/0!"}]
[null,null,null,null,null,null,null,null,null,null,null,0,null,{"$error":"#DIV/0!"},null,null,null,null,null,null,null,null,0,null,{"$error":"#DIV/0!"}]
[null,null,null,null,null,null,null,null,null,null,null,0,null,{"$error":"#DIV/0!"},null,null,null,null,null,null,null,null,0,null,{"$error":"#DIV/0!"}]
[null,null,null,null,null,null,null,null,null,null,null,0,null,{"$error":"#DIV/0!"},null,null,null,null,null,null,null,null,0,null,{"$error":"#DIV/0!"}]
[null,null,null,null,null,null,null,null,null,null,null,0,null,{"$error":"#DIV/0!"},null,null,null,null,null,null,null,null,0,null,{"$error":"#DIV/0!"}]
[null,null,null,null,null,null,null,null,null,null,null,0,null,{"$error":"#DIV/0!"},null,null,null,null,null,null,null,null,0,null,{"$error":"#DIV/0!"}]
[null,null,null,null,null,null,null,null,null,null,null,0,null,{"$error":"#DIV/0!"},null,null,null,null,null,null,null,null,0,null,{"$error":"#DIV/0!"}]
[null,null,null,null,null,null,null,null,null,null,null,0,null,{"$error":"#DIV/0!"},null,null,null,null,null,null,null,null,0,null,{"$error":"#DIV/0!"}]
[null,null,null,null,null,null,null,null,null,null,null,0,null,{"$error":"#DIV/0!"},null,null,null,null,null,null,null,null,0,null,{"$error":"#DIV/0!"}]
[null,null,null,null,null,null,null,null,null,null,null,0,null,{"$error":"#DIV/0!"},null,null,null,null,null,null,null,null,0,null,{"$error":"#DIV/0!"}]
[null,null,null,null,null,null,null,null,null,null,null,0,null,{"$error":"#DIV/0!"},null,null,null,null,null,null,null,null,0,null,{"$error":"#DIV/0!"}]
[null,null,null,null,null,null,null,null,null,null,null,0,null,{"$error":"#DIV/0!"},null,null,null,null,null,null,null,null,0,null,{"$error":"#DIV/0!"}]
[null,null,null,null,null,null,null,null,null,null,null,0,null,{"$error":"#DIV/0!"},null,null,null,null,null,null,null,null,0,null,{"$error":"#DIV/0!"}]
[null,null,null,null,null,null,null,null,null,null,null,0,null,{"$error":"#DIV/0!"},null,null,null,null,null,null,null,null,0,null,{"$error":"#DIV/0!"}]
[null,null,null,null,null,null,null,null,null,null,null,0,null,{"$error":"#DIV/0!"},null,null,null,null,null,null,null,null,0,null,{"$error":"#DIV/0!"}]
[null,null,null,null,null,null,null,null,null,null,null,0,null,{"$error":"#DIV/0!"},null,null,null,null,null,null,null,null,0,null,{"$error":"#DIV/0!"}]
[null,null,null,null,null,null,null,null,null,null,null,0,null,{"$error":"#DIV/0!"},null,null,null,null,null,null,null,null,0,null,{"$error":"#DIV/0!"}]
[null,null,null,null,null,null,null,null,null,null,null,0,null,{"$error":"#DIV/0!"},null,null,null,null,null,null,null,null,0,null,{"$error":"#DIV/0!"}]
[null,null,null,null,null,null,null,null,null,null,null,0,null,{"$error":"#DIV/0!"},null,null,null,null,null,null,null,null,0,null,{"$error":"#DIV/0!"}]
[null,null,null,null,null,null,null,null,null,null,null,0,null,{"$error":"#DIV/0!"},null,null,null,null,null,null,null,null,0,null,{"$error":"#DIV/0!"}]
[null,null,null,null,null,null,null,null,null,null,null,0,null,{"$error":"#DIV/0!"},null,null,null,null,null,null,null,null,0,null,{"$error":"#DIV/0!"}]
[null,null,null,null,null,null,null,null,null,null,null,0,null,{"$error":"#DIV/0!"},null,null,null,null,null,null,null,null,0,null,{"$error":"#DIV/0!"}]
[null,null,null,null,null,null,null,null,null,null,null,0,null,{"$error":"#DIV/0!"},null,null,null,null,null,null,null,null,0,null,{"$error":"#DIV/0!"}]
[null,null,null,null,null,null,null,null,null,null,null,0,null,{"$error":"#DIV/0!"},null,null,null,null,null,null,null,null,0,null,{"$error":"#DIV/0!"}]
[null,null,null,null,null,null,null,null,null,null,null,0,null,{"$error":"#DIV/0!"},null,null,null,null,null,null,null,null,0,null,{"$error":"#DIV/0!"}]
[null,null,null,null,null,null,null,null,null,null,null,0,null,{"$error":"#DIV/0!"},null,null,null,null,null,null,null,null,0,null,{"$error":"#DIV/0!"}]
[null,null,null,null,null,null,null,null,null,null,null,0,null,{"$error":"#DIV/0!"},null,null,null,null,null,null,null,null,0,null,{"$error":"#DIV/0!"}]
[null,null,null,null,null,null,null,null,null,null,null,0,null,{"$error":"#DIV/0!"},null,null,null,null,null,null,null,null,0,null,{"$error":"#DIV/0!"}]
[null,null,null,null,null,null,null,null,null,null,null,0,null,{"$error":"#DIV/0!"},null,null,null,null,null,null,null,null,0,null,{"$error":"#DIV/0!"}]
[null,null,null,null,null,null,null,null,null,null,null,0,null,{"$error":"#DIV/0!"},null,null,null,null,null,null,null,null,0,null,{"$error":"#DIV/0!"}]
[null,null,null,null,null,null,null,null,null,null,null,0,null,{"$error":"#DIV/0!"},null,null,null,null,null,null,null,null,0,null,{"$error":"#DIV/0!"}]
[null,null,null,null,null,null,null,null,null,null,null,0,null,{"$error":"#DIV/0!"},null,null,null,null,null,null,null,null,0,null,{"$error":"#DIV/0!"}]
[null,null,null,null,null,null,null,null,null,null,null,0,null,{"$error":"#DIV/0!"},null,null,null,null,null,null,null,null,0,null,{"$error":"#DIV/0!"}]
[null,null,null,null,null,null,null,null,null,null,null,0,null,{"$error":"#DIV/0!"},null,null,null,null,null,null,null,null,0,null,{"$error":"#DIV/0!"}]
[null,null,null,null,null,null,null,null,null,null,null,0,null,{"$error":"#DIV/0!"},null,null,null,null,null,null,null,null,0,null,{"$error":"#DIV/0!"}]
[null,null,null,null,null,null,null,null,null,null,null,0,null,{"$error":"#DIV/0!"},null,null,null,null,null,null,null,null,0,null,{"$error":"#DIV/0!"}]
[null,null,null,null,null,null,null,null,null,null,null,0,null,{"$error":"#DIV/0!"},null,null,null,null,null,null,null,null,0,null,{"$error":"#DIV/0!"}]
[null,null,null,null,null,null,null,null,null,null,null,0,null,{"$error":"#DIV/0!"},null,null,null,null,null,null,null,null,0,null,{"$error":"#DIV/0!"}]
[null,null,null,null,null,null,null,null,null,null,null,0,null,{"$error":"#DIV/0!"},null,null,null,null,null,null,null,null,0,null,{"$error":"#DIV/0!"}]
[null,null,null,null,null,null,null,null,null,null,null,{"$f":"SUM(C792:K792)","v":0},null,{"$error":"#DIV/0!"},null,null,null,null,null,null,null,null,{"$f":"SUM(O792:V792)","v":0},null,{"$error":"#DIV/0!"}]
[null,null,null,null,null,null,null,null,null,null,null,0,null,{"$f":"L793/$L$1121*100","v":{"$error":"#DIV/0!"}},null,null,null,null,null,null,null,null,0,null,{"$f":"W793/$W$1121*100","v":{"$error":"#DIV/0!"}}]
[null,null,null,null,null,null,null,null,null,null,null,0,null,{"$error":"#DIV/0!"},null,null,null,null,null,null,null,null,0,null,{"$error":"#DIV/0!"}]
[null,null,null,null,null,null,null,null,null,null,null,0,null,{"$error":"#DIV/0!"},null,null,null,null,null,null,null,null,0,null,{"$error":"#DIV/0!"}]
[null,null,null,null,null,null,null,null,null,null,null,0,null,{"$error":"#DIV/0!"},null,null,null,null,null,null,null,null,0,null,{"$error":"#DIV/0!"}]
[null,null,null,null,null,null,null,null,null,null,null,0,null,{"$error":"#DIV/0!"},null,null,null,null,null,null,null,null,0,null,{"$error":"#DIV/0!"}]
[null,null,null,null,null,null,null,null,null,null,null,0,null,{"$error":"#DIV/0!"},null,null,null,null,null,null,null,null,0,null,{"$error":"#DIV/0!"}]
[null,null,null,null,null,null,null,null,null,null,null,0,null,{"$error":"#DIV/0!"},null,null,null,null,null,null,null,null,0,null,{"$error":"#DIV/0!"}]
[null,null,null,null,null,null,null,null,null,null,null,0,null,{"$error":"#DIV/0!"},null,null,null,null,null,null,null,null,0,null,{"$error":"#DIV/0!"}]
[null,null,null,null,null,null,null,null,null,null,null,0,null,{"$error":"#DIV/0!"},null,null,null,null,null,null,null,null,0,null,{"$error":"#DIV/0!"}]
[null,null,null,null,null,null,null,null,null,null,null,0,null,{"$error":"#DIV/0!"},null,null,null,null,null,null,null,null,0,null,{"$error":"#DIV/0!"}]
[null,null,null,null,null,null,null,null,null,null,null,0,null,{"$error":"#DIV/0!"},null,null,null,null,null,null,null,null,0,null,{"$error":"#DIV/0!"}]
[null,null,null,null,null,null,null,null,null,null,null,0,null,{"$error":"#DIV/0!"},null,null,null,null,null,null,null,null,0,null,{"$error":"#DIV/0!"}]
[null,null,null,null,null,null,null,null,null,null,null,0,null,{"$error":"#DIV/0!"},null,null,null,null,null,null,null,null,0,null,{"$error":"#DIV/0!"}]
[null,null,null,null,null,null,null,null,null,null,null,0,null,{"$error":"#DIV/0!"},null,null,null,null,null,null,null,null,0,null,{"$error":"#DIV/0!"}]
[null,null,null,null,null,null,null,null,null,null,null,0,null,{"$error":"#DIV/0!"},null,null,null,null,null,null,null,null,0,null,{"$error":"#DIV/0!"}]
[null,null,null,null,null,null,null,null,null,null,null,0,null,{"$error":"#DIV/0!"},null,null,null,null,null,null,null,null,0,null,{"$error":"#DIV/0!"}]
[null,null,null,null,null,null,null,null,null,null,null,0,null,{"$error":"#DIV/0!"},null,null,null,null,null,null,null,null,0,null,{"$error":"#DIV/0!"}]
[null,null,null,null,null,null,null,null,null,null,null,0,null,{"$error":"#DIV/0!"},null,null,null,null,null,null,null,null,0,null,{"$error":"#DIV/0!"}]
[null,null,null,null,null,null,null,null,null,null,null,0,null,{"$error":"#DIV/0!"},null,null,null,null,null,null,null,null,0,null,{"$error":"#DIV/0!"}]
[null,null,null,null,null,null,null,null,null,null,null,0,null,{"$error":"#DIV/0!"},null,null,null,null,null,null,null,null,0,null,{"$error":"#DIV/0!"}]
[null,null,null,null,null,null,null,null,null,null,null,0,null,{"$error":"#DIV/0!"},null,null,null,null,null,null,null,null,0,null,{"$error":"#DIV/0!"}]
[null,null,null,null,null,null,null,null,null,null,null,0,null,{"$error":"#DIV/0!"},null,null,null,null,null,null,null,null,0,null,{"$error":"#DIV/0!"}]
[null,null,null,null,null,null,null,null,null,null,null,0,null,{"$error":"#DIV/0!"},null,null,null,null,null,null,null,null,0,null,{"$error":"#DIV/0!"}]
[null,null,null,null,null,null,null,null,null,null,null,0,null,{"$error":"#DIV/0!"},null,null,null,null,null,null,null,null,0,null,{"$error":"#DIV/0!"}]
[null,null,null,null,null,null,null,null,null,null,null,0,null,{"$error":"#DIV/0!"},null,null,null,null,null,null,null,null,0,null,{"$error":"#DIV/0!"}]
[null,null,null,null,null,null,null,null,null,null,null,0,null,{"$error":"#DIV/0!"},null,null,null,null,null,null,null,null,0,null,{"$error":"#DIV/0!"}]
[null,null,null,null,null,null,null,null,null,null,null,0,null,{"$error":"#DIV/0!"},null,null,null,null,null,null,null,null,0,null,{"$error":"#DIV/0!"}]
[null,null,null,null,null,null,null,null,null,null,null,0,null,{"$error":"#DIV/0!"},null,null,null,null,null,null,null,null,0,null,{"$error":"#DIV/0!"}]
[null,null,null,null,null,null,null,null,null,null,null,0,null,{"$error":"#DIV/0!"},null,null,null,null,null,null,null,null,0,null,{"$error":"#DIV/0!"}]
[null,null,null,null,null,null,null,null,null,null,null,0,null,{"$error":"#DIV/0!"},null,null,null,null,null,null,null,null,0,null,{"$error":"#DIV/0!"}]
[null,null,null,null,null,null,null,null,null,null,null,0,null,{"$error":"#DIV/0!"},null,null,null,null,null,null,null,null,0,null,{"$error":"#DIV/0!"}]
[null,null,null,null,null,null,null,null,null,null,null,0,null,{"$error":"#DIV/0!"},null,null,null,null,null,null,null,null,0,null,{"$error":"#DIV/0!"}]
[null,null,null,null,null,null,null,null,null,null,null,0,null,{"$error":"#DIV/0!"},null,null,null,null,null,null,null,null,0,null,{"$error":"#DIV/0!"}]
[null,null,null,null,null,null,null,null,null,null,null,0,null,{"$error":"#DIV/0!"},null,null,null,null,null,null,null,null,0,null,{"$error":"#DIV/0!"}]
[null,null,null,null,null,null,null,null,null,null,null,0,null,{"$error":"#DIV/0!"},null,null,null,null,null,null,null,null,0,null,{"$error":"#DIV/0!"}]
[null,null,null,null,null,null,null,null,null,null,null,0,null,{"$error":"#DIV/0!"},null,null,null,null,null,null,null,null,0,null,{"$error":"#DIV/0!"}]
[null,null,null,null,null,null,null,null,null,null,null,0,null,{"$error":"#DIV/0!"},null,null,null,null,null,null,null,null,0,null,{"$error":"#DIV/0!"}]
[null,null,null,null,null,null,null,null,null,null,null,0,null,{"$error":"#DIV/0!"},null,null,null,null,null,null,null,null,0,null,{"$error":"#DIV/0!"}]
[null,null,null,null,null,null,null,null,null,null,null,0,null,{"$error":"#DIV/0!"},null,null,null,null,null,null,null,null,0,null,{"$error":"#DIV/0!"}]
[null,null,null,null,null,null,null,null,null,null,null,0,null,{"$error":"#DIV/0!"},null,null,null,null,null,null,null,null,0,null,{"$error":"#DIV/0!"}]
[null,null,null,null,null,null,null,null,null,null,null,0,null,{"$error":"#DIV/0!"},null,null,null,null,null,null,null,null,0,null,{"$error":"#DIV/0!"}]
[null,null,null,null,null,null,null,null,null,null,null,0,null,{"$error":"#DIV/0!"},null,null,null,null,null,null,null,null,0,null,{"$error":"#DIV/0!"}]
[null,null,null,null,null,null,null,null,null,null,null,0,null,{"$error":"#DIV/0!"},null,null,null,null,null,null,null,null,0,null,{"$error":"#DIV/0!"}]
[null,null,null,null,null,null,null,null,null,null,null,0,null,{"$error":"#DIV/0!"},null,null,null,null,null,null,null,null,0,null,{"$error":"#DIV/0!"}]
[null,null,null,null,null,null,null,null,null,null,null,0,null,{"$error":"#DIV/0!"},null,null,null,null,null,null,null,null,0,null,{"$error":"#DIV/0!"}]
[null,null,null,null,null,null,null,null,null,null,null,0,null,{"$error":"#DIV/0!"},null,null,null,null,null,null,null,null,0,null,{"$error":"#DIV/0!"}]
[null,null,null,null,null,null,null,null,null,null,null,0,null,{"$error":"#DIV/0!"},null,null,null,null,null,null,null,null,0,null,{"$error":"#DIV/0!"}]
[null,null,null,null,null,null,null,null,null,null,null,0,null,{"$error":"#DIV/0!"},null,null,null,null,null,null,null,null,0,null,{"$error":"#DIV/0!"}]
[null,null,null,null,null,null,null,null,null,null,null,0,null,{"$error":"#DIV/0!"},null,null,null,null,null,null,null,null,0,null,{"$error":"#DIV/0!"}]
[null,null,null,null,null,null,null,null,null,null,null,0,null,{"$error":"#DIV/0!"},null,null,null,null,null,null,null,null,0,null,{"$error":"#DIV/0!"}]
[null,null,null,null,null,null,null,null,null,null,null,0,null,{"$error":"#DIV/0!"},null,null,null,null,null,null,null,null,0,null,{"$error":"#DIV/0!"}]
[null,null,null,null,null,null,null,null,null,null,null,0,null,{"$error":"#DIV/0!"},null,null,null,null,null,null,null,null,0,null,{"$error":"#DIV/0!"}]
[null,null,null,null,null,null,null,null,null,null,null,0,null,{"$error":"#DIV/0!"},null,null,null,null,null,null,null,null,0,null,{"$error":"#DIV/0!"}]
[null,null,null,null,null,null,null,null,null,null,null,0,null,{"$error":"#DIV/0!"},null,null,null,null,null,null,null,null,0,null,{"$error":"#DIV/0!"}]
[null,null,null,null,null,null,null,null,null,null,null,0,null,{"$error":"#DIV/0!"},null,null,null,null,null,null,null,null,0,null,{"$error":"#DIV/0!"}]
[null,null,null,null,null,null,null,null,null,null,null,0,null,{"$error":"#DIV/0!"},null,null,null,null,null,null,null,null,0,null,{"$error":"#DIV/0!"}]
[null,null,null,null,null,null,null,null,null,null,null,0,null,{"$error":"#DIV/0!"},null,null,null,null,null,null,null,null,0,null,{"$error":"#DIV/0!"}]
[null,null,null,null,null,null,null,null,null,null,null,0,null,{"$error":"#DIV/0!"},null,null,null,null,null,null,null,null,0,null,{"$error":"#DIV/0!"}]
[null,null,null,null,null,null,null,null,null,null,null,0,null,{"$error":"#DIV/0!"},null,null,null,null,null,null,null,null,0,null,{"$error":"#DIV/0!"}]
[null,null,null,null,null,null,null,null,null,null,null,0,null,{"$error":"#DIV/0!"},null,null,null,null,null,null,null,null,0,null,{"$error":"#DIV/0!"}]
[null,null,null,null,null,null,null,null,null,null,null,0,null,{"$error":"#DIV/0!"},null,null,null,null,null,null,null,null,0,null,{"$error":"#DIV/0!"}]
[null,null,null,null,null,null,null,null,null,null,null,0,null,{"$error":"#DIV/0!"},null,null,null,null,null,null,null,null,0,null,{"$error":"#DIV/0!"}]
[null,null,null,null,null,null,null,null,null,null,null,0,null,{"$error":"#DIV/0!"},null,null,null,null,null,null,null,null,0,null,{"$error":"#DIV/0!"}]
[null,null,null,null,null,null,null,null,null,null,null,{"$f":"SUM(C856:K856)","v":0},null,{"$error":"#DIV/0!"},null,null,null,null,null,null,null,null,{"$f":"SUM(O856:V856)","v":0},null,{"$error":"#DIV/0!"}]
[null,null,null,null,null,null,null,null,null,null,null,0,null,{"$f":"L857/$L$1121*100","v":{"$error":"#DIV/0!"}},null,null,null,null,null,null,null,null,0,null,{"$f":"W857/$W$1121*100","v":{"$error":"#DIV/0!"}}]
[null,null,null,null,null,null,null,null,null,null,null,0,null,{"$error":"#DIV/0!"},null,null,null,null,null,null,null,null,0,null,{"$error":"#DIV/0!"}]
[null,null,null,null,null,null,null,null,null,null,null,0,null,{"$error":"#DIV/0!"},null,null,null,null,null,null,null,null,0,null,{"$error":"#DIV/0!"}]
[null,null,null,null,null,null,null,null,null,null,null,0,null,{"$error":"#DIV/0!"},null,null,null,null,null,null,null,null,0,null,{"$error":"#DIV/0!"}]
[null,null,null,null,null,null,null,null,null,null,null,0,null,{"$error":"#DIV/0!"},null,null,null,null,null,null,null,null,0,null,{"$error":"#DIV/0!"}]
[null,null,null,null,null,null,null,null,null,null,null,0,null,{"$error":"#DIV/0!"},null,null,null,null,null,null,null,null,0,null,{"$error":"#DIV/0!"}]
[null,null,null,null,null,null,null,null,null,null,null,0,null,{"$error":"#DIV/0!"},null,null,null,null,null,null,null,null,0,null,{"$error":"#DIV/0!"}]
[null,null,null,null,null,null,null,null,null,null,null,0,null,{"$error":"#DIV/0!"},null,null,null,null,null,null,null,null,0,null,{"$error":"#DIV/0!"}]
[null,null,null,null,null,null,null,null,null,null,null,0,null,{"$error":"#DIV/0!"},null,null,null,null,null,null,null,null,0,null,{"$error":"#DIV/0!"}]
[null,null,null,null,null,null,null,null,null,null,null,0,null,{"$error":"#DIV/0!"},null,null,null,null,null,null,null,null,0,null,{"$error":"#DIV/0!"}]
[null,null,null,null,null,null,null,null,null,null,null,0,null,{"$error":"#DIV/0!"},null,null,null,null,null,null,null,null,0,null,{"$error":"#DIV/0!"}]
[null,null,null,null,null,null,null,null,null,null,null,0,null,{"$error":"#DIV/0!"},null,null,null,null,null,null,null,null,0,null,{"$error":"#DIV/0!"}]
[null,null,null,null,null,null,null,null,null,null,null,0,null,{"$error":"#DIV/0!"},null,null,null,null,null,null,null,null,0,null,{"$error":"#DIV/0!"}]
[null,null,null,null,null,null,null,null,null,null,null,0,null,{"$error":"#DIV/0!"},null,null,null,null,null,null,null,null,0,null,{"$error":"#DIV/0!"}]
[null,null,null,null,null,null,null,null,null,null,null,0,null,{"$error":"#DIV/0!"},null,null,null,null,null,null,null,null,0,null,{"$error":"#DIV/0!"}]
[null,null,null,null,null,null,null,null,null,null,null,0,null,{"$error":"#DIV/0!"},null,null,null,null,null,null,null,null,0,null,{"$error":"#DIV/0!"}]
[null,null,null,null,null,null,null,null,null,null,null,0,null,{"$error":"#DIV/0!"},null,null,null,null,null,null,null,null,0,null,{"$error":"#DIV/0!"}]
[null,null,null,null,null,null,null,null,null,null,null,0,null,{"$error":"#DIV/0!"},null,null,null,null,null,null,null,null,0,null,{"$error":"#DIV/0!"}]
[null,null,null,null,null,null,null,null,null,null,null,0,null,{"$error":"#DIV/0!"},null,null,null,null,null,null,null,null,0,null,{"$error":"#DIV/0!"}]
[null,null,null,null,null,null,null,null,null,null,null,0,null,{"$error":"#DIV/0!"},null,null,null,null,null,null,null,null,0,null,{"$error":"#DIV/0!"}]
[null,null,null,null,null,null,null,null,null,null,null,0,null,{"$error":"#DIV/0!"},null,null,null,null,null,null,null,null,0,null,{"$error":"#DIV/0!"}]
[null,null,null,null,null,null,null,null,null,null,null,0,null,{"$error":"#DIV/0!"},null,null,null,null,null,null,null,null,0,null,{"$error":"#DIV/0!"}]
[null,null,null,null,null,null,null,null,null,null,null,0,null,{"$error":"#DIV/0!"},null,null,null,null,null,null,null,null,0,null,{"$error":"#DIV/0!"}]
[null,null,null,null,null,null,null,null,null,null,null,0,null,{"$error":"#DIV/0!"},null,null,null,null,null,null,null,null,0,null,{"$error":"#DIV/0!"}]
[null,null,null,null,null,null,null,null,null,null,null,0,null,{"$error":"#DIV/0!"},null,null,null,null,null,null,null,null,0,null,{"$error":"#DIV/0!"}]
[null,null,null,null,null,null,null,null,null,null,null,0,null,{"$error":"#DIV/0!"},null,null,null,null,null,null,null,null,0,null,{"$error":"#DIV/0!"}]
[null,null,null,null,null,null,null,null,null,null,null,0,null,{"$error":"#DIV/0!"},null,null,null,null,null,null,null,null,0,null,{"$error":"#DIV/0!"}]
[null,null,null,null,null,null,null,null,null,null,null,0,null,{"$error":"#DIV/0!"},null,null,null,null,null,null,null,null,0,null,{"$error":"#DIV/0!"}]
[null,null,null,null,null,null,null,null,null,null,null,0,null,{"$error":"#DIV/0!"},null,null,null,null,null,null,null,null,0,null,{"$error":"#DIV/0!"}]
[null,null,null,null,null,null,null,null,null,null,null,0,null,{"$error":"#DIV/0!"},null,null,null,null,null,null,null,null,0,null,{"$error":"#DIV/0!"}]
[null,null,null,null,null,null,null,null,null,null,null,0,null,{"$error":"#DIV/0!"},null,null,null,null,null,null,null,null,0,null,{"$error":"#DIV/0!"}]
[null,null,null,null,null,null,null,null,null,null,null,0,null,{"$error":"#DIV/0!"},null,null,null,null,null,null,null,null,0,null,{"$error":"#DIV/0!"}]
[null,null,null,null,null,null,null,null,null,null,null,0,null,{"$error":"#DIV/0!"},null,null,null,null,null,null,null,null,0,null,{"$error":"#DIV/0!"}]
[null,null,null,null,null,null,null,null,null,null,null,0,null,{"$error":"#DIV/0!"},null,null,null,null,null,null,null,null,0,null,{"$error":"#DIV/0!"}]
[null,null,null,null,null,null,null,null,null,null,null,0,null,{"$error":"#DIV/0!"},null,null,null,null,null,null,null,null,0,null,{"$error":"#DIV/0!"}]
[null,null,null,null,null,null,null,null,null,null,null,0,null,{"$error":"#DIV/0!"},null,null,null,null,null,null,null,null,0,null,{"$error":"#DIV/0!"}]
[null,null,null,null,null,null,null,null,null,null,null,0,null,{"$error":"#DIV/0!"},null,null,null,null,null,null,null,null,0,null,{"$error":"#DIV/0!"}]
[null,null,null,null,null,null,null,null,null,null,null,0,null,{"$error":"#DIV/0!"},null,null,null,null,null,null,null,null,0,null,{"$error":"#DIV/0!"}]
[null,null,null,null,null,null,null,null,null,null,null,0,null,{"$error":"#DIV/0!"},null,null,null,null,null,null,null,null,0,null,{"$error":"#DIV/0!"}]
[null,null,null,null,null,null,null,null,null,null,null,0,null,{"$error":"#DIV/0!"},null,null,null,null,null,null,null,null,0,null,{"$error":"#DIV/0!"}]
[null,null,null,null,null,null,null,null,null,null,null,0,null,{"$error":"#DIV/0!"},null,null,null,null,null,null,null,null,0,null,{"$error":"#DIV/0!"}]
[null,null,null,null,null,null,null,null,null,null,null,0,null,{"$error":"#DIV/0!"},null,null,null,null,null,null,null,null,0,null,{"$error":"#DIV/0!"}]
[null,null,null,null,null,null,null,null,null,null,null,0,null,{"$error":"#DIV/0!"},null,null,null,null,null,null,null,null,0,null,{"$error":"#DIV/0!"}]
[null,null,null,null,null,null,null,null,null,null,null,0,null,{"$error":"#DIV/0!"},null,null,null,null,null,null,null,null,0,null,{"$error":"#DIV/0!"}]
[null,null,null,null,null,null,null,null,null,null,null,0,null,{"$error":"#DIV/0!"},null,null,null,null,null,null,null,null,0,null,{"$error":"#DIV/0!"}]
[null,null,null,null,null,null,null,null,null,null,null,0,null,{"$error":"#DIV/0!"},null,null,null,null,null,null,null,null,0,null,{"$error":"#DIV/0!"}]
[null,null,null,null,null,null,null,null,null,null,null,0,null,{"$error":"#DIV/0!"},null,null,null,null,null,null,null,null,0,null,{"$error":"#DIV/0!"}]
[null,null,null,null,null,null,null,null,null,null,null,0,null,{"$error":"#DIV/0!"},null,null,null,null,null,null,null,null,0,null,{"$error":"#DIV/0!"}]
[null,null,null,null,null,null,null,null,null,null,null,0,null,{"$error":"#DIV/0!"},null,null,null,null,null,null,null,null,0,null,{"$error":"#DIV/0!"}]
[null,null,null,null,null,null,null,null,null,null,null,0,null,{"$error":"#DIV/0!"},null,null,null,null,null,null,null,null,0,null,{"$error":"#DIV/0!"}]
[null,null,null,null,null,null,null,null,null,null,null,0,null,{"$error":"#DIV/0!"},null,null,null,null,null,null,null,null,0,null,{"$error":"#DIV/0!"}]
[null,null,null,null,null,null,null,null,null,null,null,0,null,{"$error":"#DIV/0!"},null,null,null,null,null,null,null,null,0,null,{"$error":"#DIV/0!"}]
[null,null,null,null,null,null,null,null,null,null,null,0,null,{"$error":"#DIV/0!"},null,null,null,null,null,null,null,null,0,null,{"$error":"#DIV/0!"}]
[null,null,null,null,null,null,null,null,null,null,null,0,null,{"$error":"#DIV/0!"},null,null,null,null,null,null,null,null,0,null,{"$error":"#DIV/0!"}]
[null,null,null,null,null,null,null,null,null,null,null,0,null,{"$error":"#DIV/0!"},null,null,null,null,null,null,null,null,0,null,{"$error":"#DIV/0!"}]
[null,null,null,null,null,null,null,null,null,null,null,0,null,{"$error":"#DIV/0!"},null,null,null,null,null,null,null,null,0,null,{"$error":"#DIV/0!"}]
[null,null,null,null,null,null,null,null,null,null,null,0,null,{"$error":"#DIV/0!"},null,null,null,null,null,null,null,null,0,null,{"$error":"#DIV/0!"}]
[null,null,null,null,null,null,null,null,null,null,null,0,null,{"$error":"#DIV/0!"},null,null,null,null,null,null,null,null,0,null,{"$error":"#DIV/0!"}]
[null,null,null,null,null,null,null,null,null,null,null,0,null,{"$error":"#DIV/0!"},null,null,null,null,null,null,null,null,0,null,{"$error":"#DIV/0!"}]
[]
["\"Approved Undertakings\""]
[null,null,null,null,null,null,null,null,null,null,null,{"$f":"SUM(B918:K918)","v":0},null,{"$f":"L918/$L$1121*100","v":{"$error":"#DIV/0!"}},null,null,null,null,null,null,null,null,{"$f":"SUM(O918:V918)","v":0},null,{"$f":"W918/$W$1121*100","v":{"$error":"#DIV/0!"}}]
[null,null,null,null,null,null,null,null,null,null,null,0,null,{"$f":"L919/$L$1121*100","v":{"$error":"#DIV/0!"}},null,null,null,null,null,null,null,null,0,null,{"$f":"W919/$W$1121*100","v":{"$error":"#DIV/0!"}}]
[null,null,null,null,null,null,null,null,null,null,null,0,null,{"$error":"#DIV/0!"},null,null,null,null,null,null,null,null,0,null,{"$error":"#DIV/0!"}]
[null,null,null,null,null,null,null,null,null,null,null,0,null,{"$error":"#DIV/0!"},null,null,null,null,null,null,null,null,0,null,{"$error":"#DIV/0!"}]
[null,null,null,null,null,null,null,null,null,null,null,0,null,{"$error":"#DIV/0!"},null,null,null,null,null,null,null,null,0,null,{"$error":"#DIV/0!"}]
[null,null,null,null,null,null,null,null,null,null,null,0,null,{"$error":"#DIV/0!"},null,null,null,null,null,null,null,null,0,null,{"$error":"#DIV/0!"}]
[null,null,null,null,null,null,null,null,null,null,null,0,null,{"$error":"#DIV/0!"},null,null,null,null,null,null,null,null,0,null,{"$error":"#DIV/0!"}]
[null,null,null,null,null,null,null,null,null,null,null,0,null,{"$error":"#DIV/0!"},null,null,null,null,null,null,null,null,0,null,{"$error":"#DIV/0!"}]
[null,null,null,null,null,null,null,null,null,null,null,0,null,{"$error":"#DIV/0!"},null,null,null,null,null,null,null,null,0,null,{"$error":"#DIV/0!"}]
[null,null,null,null,null,null,null,null,null,null,null,0,null,{"$error":"#DIV/0!"},null,null,null,null,null,null,null,null,0,null,{"$error":"#DIV/0!"}]
[null,null,null,null,null,null,null,null,null,null,null,0,null,{"$error":"#DIV/0!"},null,null,null,null,null,null,null,null,0,null,{"$error":"#DIV/0!"}]
[null,null,null,null,null,null,null,null,null,null,null,0,null,{"$error":"#DIV/0!"},null,null,null,null,null,null,null,null,0,null,{"$error":"#DIV/0!"}]
[null,null,null,null,null,null,null,null,null,null,null,0,null,{"$error":"#DIV/0!"},null,null,null,null,null,null,null,null,0,null,{"$error":"#DIV/0!"}]
[null,null,null,null,null,null,null,null,null,null,null,0,null,{"$error":"#DIV/0!"},null,null,null,null,null,null,null,null,0,null,{"$error":"#DIV/0!"}]
[null,null,null,null,null,null,null,null,null,null,null,0,null,{"$error":"#DIV/0!"},null,null,null,null,null,null,null,null,0,null,{"$error":"#DIV/0!"}]
[null,null,null,null,null,null,null,null,null,null,null,0,null,{"$error":"#DIV/0!"},null,null,null,null,null,null,null,null,0,null,{"$error":"#DIV/0!"}]
[null,null,null,null,null,null,null,null,null,null,null,0,null,{"$error":"#DIV/0!"},null,null,null,null,null,null,null,null,{"$f":"SUM(O934:V934)","v":0},null,{"$error":"#DIV/0!"}]
[null,null,null,null,null,null,null,null,null,null,null,0,null,{"$error":"#DIV/0!"},null,null,null,null,null,null,null,null,0,null,{"$error":"#DIV/0!"}]
[null,null,null,null,null,null,null,null,null,null,null,0,null,{"$error":"#DIV/0!"},null,null,null,null,null,null,null,null,0,null,{"$error":"#DIV/0!"}]
[null,null,null,null,null,null,null,null,null,null,null,0,null,{"$error":"#DIV/0!"},null,null,null,null,null,null,null,null,0,null,{"$error":"#DIV/0!"}]
[null,null,null,null,null,null,null,null,null,null,null,0,null,{"$error":"#DIV/0!"},null,null,null,null,null,null,null,null,0,null,{"$error":"#DIV/0!"}]
[null,null,null,null,null,null,null,null,null,null,null,0,null,{"$error":"#DIV/0!"},null,null,null,null,null,null,null,null,0,null,{"$error":"#DIV/0!"}]
[null,null,null,null,null,null,null,null,null,null,null,0,null,{"$error":"#DIV/0!"},null,null,null,null,null,null,null,null,0,null,{"$error":"#DIV/0!"}]
[null,null,null,null,null,null,null,null,null,null,null,0,null,{"$error":"#DIV/0!"},null,null,null,null,null,null,null,null,0,null,{"$error":"#DIV/0!"}]
[null,null,null,null,null,null,null,null,null,null,null,0,null,{"$error":"#DIV/0!"},null,null,null,null,null,null,null,null,0,null,{"$error":"#DIV/0!"}]
[null,null,null,null,null,null,null,null,null,null,null,0,null,{"$error":"#DIV/0!"},null,null,null,null,null,null,null,null,0,null,{"$error":"#DIV/0!"}]
[null,null,null,null,null,null,null,null,null,null,null,0,null,{"$error":"#DIV/0!"},null,null,null,null,null,null,null,null,0,null,{"$error":"#DIV/0!"}]
[null,null,null,null,null,null,null,null,null,null,null,0,null,{"$error":"#DIV/0!"},null,null,null,null,null,null,null,null,0,null,{"$error":"#DIV/0!"}]
[null,null,null,null,null,null,null,null,null,null,null,0,null,{"$error":"#DIV/0!"},null,null,null,null,null,null,null,null,0,null,{"$error":"#DIV/0!"}]
[null,null,null,null,null,null,null,null,null,null,null,0,null,{"$error":"#DIV/0!"},null,null,null,null,null,null,null,null,0,null,{"$error":"#DIV/0!"}]
[null,null,null,null,null,null,null,null,null,null,null,0,null,{"$error":"#DIV/0!"},null,null,null,null,null,null,null,null,0,null,{"$error":"#DIV/0!"}]
[null,null,null,null,null,null,null,null,null,null,null,0,null,{"$error":"#DIV/0!"},null,null,null,null,null,null,null,null,0,null,{"$error":"#DIV/0!"}]
[null,null,null,null,null,null,null,null,null,null,null,0,null,{"$error":"#DIV/0!"},null,null,null,null,null,null,null,null,0,null,{"$error":"#DIV/0!"}]
[null,null,null,null,null,null,null,null,null,null,null,0,null,{"$error":"#DIV/0!"},null,null,null,null,null,null,null,null,0,null,{"$error":"#DIV/0!"}]
[null,null,null,null,null,null,null,null,null,null,null,0,null,{"$error":"#DIV/0!"},null,null,null,null,null,null,null,null,0,null,{"$error":"#DIV/0!"}]
[null,null,null,null,null,null,null,null,null,null,null,0,null,{"$error":"#DIV/0!"},null,null,null,null,null,null,null,null,0,null,{"$error":"#DIV/0!"}]
[null,null,null,null,null,null,null,null,null,null,null,0,null,{"$error":"#DIV/0!"},null,null,null,null,null,null,null,null,0,null,{"$error":"#DIV/0!"}]
[null,null,null,null,null,null,null,null,null,null,null,0,null,{"$error":"#DIV/0!"},null,null,null,null,null,null,null,null,0,null,{"$error":"#DIV/0!"}]
[null,null,null,null,null,null,null,null,null,null,null,0,null,{"$error":"#DIV/0!"},null,null,null,null,null,null,null,null,0,null,{"$error":"#DIV/0!"}]
[null,null,null,null,null,null,null,null,null,null,null,0,null,{"$error":"#DIV/0!"},null,null,null,null,null,null,null,null,0,null,{"$error":"#DIV/0!"}]
[null,null,null,null,null,null,null,null,null,null,null,0,null,{"$error":"#DIV/0!"},null,null,null,null,null,null,null,null,0,null,{"$error":"#DIV/0!"}]
[null,null,null,null,null,null,null,null,null,null,null,0,null,{"$error":"#DIV/0!"},null,null,null,null,null,null,null,null,0,null,{"$error":"#DIV/0!"}]
[null,null,null,null,null,null,null,null,null,null,null,0,null,{"$error":"#DIV/0!"},null,null,null,null,null,null,null,null,0,null,{"$error":"#DIV/0!"}]
[null,null,null,null,null,null,null,null,null,null,null,0,null,{"$error":"#DIV/0!"},null,null,null,null,null,null,null,null,0,null,{"$error":"#DIV/0!"}]
[null,null,null,null,null,null,null,null,null,null,null,0,null,{"$error":"#DIV/0!"},null,null,null,null,null,null,null,null,0,null,{"$error":"#DIV/0!"}]
[null,null,null,null,null,null,null,null,null,null,null,0,null,{"$error":"#DIV/0!"},null,null,null,null,null,null,null,null,0,null,{"$error":"#DIV/0!"}]
[null,null,null,null,null,null,null,null,null,null,null,0,null,{"$error":"#DIV/0!"},null,null,null,null,null,null,null,null,0,null,{"$error":"#DIV/0!"}]
[null,null,null,null,null,null,null,null,null,null,null,0,null,{"$error":"#DIV/0!"},null,null,null,null,null,null,null,null,0,null,{"$error":"#DIV/0!"}]
[null,null,null,null,null,null,null,null,null,null,null,0,null,{"$error":"#DIV/0!"},null,null,null,null,null,null,null,null,0,null,{"$error":"#DIV/0!"}]
[null,null,null,null,null,null,null,null,null,null,null,0,null,{"$error":"#DIV/0!"},null,null,null,null,null,null,null,null,0,null,{"$error":"#DIV/0!"}]
[null,null,null,null,null,null,null,null,null,null,null,0,null,{"$error":"#DIV/0!"},null,null,null,null,null,null,null,null,0,null,{"$error":"#DIV/0!"}]
[null,null,null,null,null,null,null,null,null,null,null,0,null,{"$error":"#DIV/0!"},null,null,null,null,null,null,null,null,0,null,{"$error":"#DIV/0!"}]
[null,null,null,null,null,null,null,null,null,null,null,0,null,{"$error":"#DIV/0!"},null,null,null,null,null,null,null,null,0,null,{"$error":"#DIV/0!"}]
[null,null,null,null,null,null,null,null,null,null,null,0,null,{"$error":"#DIV/0!"},null,null,null,null,null,null,null,null,0,null,{"$error":"#DIV/0!"}]
[null,null,null,null,null,null,null,null,null,null,null,0,null,{"$error":"#DIV/0!"},null,null,null,null,null,null,null,null,0,null,{"$error":"#DIV/0!"}]
[null,null,null,null,null,null,null,null,null,null,null,0,null,{"$error":"#DIV/0!"},null,null,null,null,null,null,null,null,0,null,{"$error":"#DIV/0!"}]
[null,null,null,null,null,null,null,null,null,null,null,0,null,{"$error":"#DIV/0!"},null,null,null,null,null,null,null,null,0,null,{"$error":"#DIV/0!"}]
[null,null,null,null,null,null,null,null,null,null,null,0,null,{"$error":"#DIV/0!"},null,null,null,null,null,null,null,null,0,null,{"$error":"#DIV/0!"}]
[null,null,null,null,null,null,null,null,null,null,null,0,null,{"$error":"#DIV/0!"},null,null,null,null,null,null,null,null,0,null,{"$error":"#DIV/0!"}]
[null,null,null,null,null,null,null,null,null,null,null,0,null,{"$error":"#DIV/0!"},null,null,null,null,null,null,null,null,0,null,{"$error":"#DIV/0!"}]
[null,null,null,null,null,null,null,null,null,null,null,0,null,{"$error":"#DIV/0!"},null,null,null,null,null,null,null,null,0,null,{"$error":"#DIV/0!"}]
[null,null,null,null,null,null,null,null,null,null,null,0,null,{"$error":"#DIV/0!"},null,null,null,null,null,null,null,null,0,null,{"$error":"#DIV/0!"}]
[null,null,null,null,null,null,null,null,null,null,null,0,null,{"$error":"#DIV/0!"},null,null,null,null,null,null,null,null,0,null,{"$error":"#DIV/0!"}]
[null,null,null,null,null,null,null,null,null,null,null,0,null,{"$error":"#DIV/0!"},null,null,null,null,null,null,null,null,0,null,{"$error":"#DIV/0!"}]
[null,null,null,null,null,null,null,null,null,null,null,0,null,{"$error":"#DIV/0!"},null,null,null,null,null,null,null,null,0,null,{"$error":"#DIV/0!"}]
[null,null,null,null,null,null,null,null,null,null,null,0,null,{"$f":"L983/$L$1121*100","v":{"$error":"#DIV/0!"}},null,null,null,null,null,null,null,null,0,null,{"$f":"W983/$W$1121*100","v":{"$error":"#DIV/0!"}}]
[null,null,null,null,null,null,null,null,null,null,null,0,null,{"$error":"#DIV/0!"},null,null,null,null,null,null,null,null,0,null,{"$error":"#DIV/0!"}]
[null,null,null,null,null,null,null,null,null,null,null,0,null,{"$error":"#DIV/0!"},null,null,null,null,null,null,null,null,0,null,{"$error":"#DIV/0!"}]
[null,null,null,null,null,null,null,null,null,null,null,0,null,{"$error":"#DIV/0!"},null,null,null,null,null,null,null,null,0,null,{"$error":"#DIV/0!"}]
[null,null,null,null,null,null,null,null,null,null,null,0,null,{"$error":"#DIV/0!"},null,null,null,null,null,null,null,null,0,null,{"$error":"#DIV/0!"}]
[null,null,null,null,null,null,null,null,null,null,null,0,null,{"$error":"#DIV/0!"},null,null,null,null,null,null,null,null,0,null,{"$error":"#DIV/0!"}]
[null,null,null,null,null,null,null,null,null,null,null,0,null,{"$error":"#DIV/0!"},null,null,null,null,null,null,null,null,0,null,{"$error":"#DIV/0!"}]
[null,null,null,null,null,null,null,null,null,null,null,0,null,{"$error":"#DIV/0!"},null,null,null,null,null,null,null,null,0,null,{"$error":"#DIV/0!"}]
[null,null,null,null,null,null,null,null,null,null,null,0,null,{"$error":"#DIV/0!"},null,null,null,null,null,null,null,null,0,null,{"$error":"#DIV/0!"}]
[null,null,null,null,null,null,null,null,null,null,null,0,null,{"$error":"#DIV/0!"},null,null,null,null,null,null,null,null,0,null,{"$error":"#DIV/0!"}]
[null,null,null,null,null,null,null,null,null,null,null,0,null,{"$error":"#DIV/0!"},null,null,null,null,null,null,null,null,0,null,{"$error":"#DIV/0!"}]
[null,null,null,null,null,null,null,null,null,null,null,0,null,{"$error":"#DIV/0!"},null,null,null,null,null,null,null,null,0,null,{"$error":"#DIV/0!"}]
[null,null,null,null,null,null,null,null,null,null,null,0,null,{"$error":"#DIV/0!"},null,null,null,null,null,null,null,null,0,null,{"$error":"#DIV/0!"}]
[null,null,null,null,null,null,null,null,null,null,null,0,null,{"$error":"#DIV/0!"},null,null,null,null,null,null,null,null,0,null,{"$error":"#DIV/0!"}]
[null,null,null,null,null,null,null,null,null,null,null,0,null,{"$error":"#DIV/0!"},null,null,null,null,null,null,null,null,0,null,{"$error":"#DIV/0!"}]
[null,null,null,null,null,null,null,null,null,null,null,0,null,{"$error":"#DIV/0!"},null,null,null,null,null,null,null,null,{"$f":"SUM(O998:V998)","v":0},null,{"$error":"#DIV/0!"}]
[null,null,null,null,null,null,null,null,null,null,null,0,null,{"$error":"#DIV/0!"},null,null,null,null,null,null,null,null,0,null,{"$error":"#DIV/0!"}]
[null,null,null,null,null,null,null,null,null,null,null,0,null,{"$error":"#DIV/0!"},null,null,null,null,null,null,null,null,0,null,{"$error":"#DIV/0!"}]
[null,null,null,null,null,null,null,null,null,null,null,0,null,{"$error":"#DIV/0!"},null,null,null,null,null,null,null,null,0,null,{"$error":"#DIV/0!"}]
[null,null,null,null,null,null,null,null,null,null,null,0,null,{"$error":"#DIV/0!"},null,null,null,null,null,null,null,null,0,null,{"$error":"#DIV/0!"}]
[null,null,null,null,null,null,null,null,null,null,null,0,null,{"$error":"#DIV/0!"},null,null,null,null,null,null,null,null,0,null,{"$error":"#DIV/0!"}]
[null,null,null,null,null,null,null,null,null,null,null,0,null,{"$error":"#DIV/0!"},null,null,null,null,null,null,null,null,0,null,{"$error":"#DIV/0!"}]
[null,null,null,null,null,null,null,null,null,null,null,0,null,{"$error":"#DIV/0!"},null,null,null,null,null,null,null,null,0,null,{"$error":"#DIV/0!"}]
[null,null,null,null,null,null,null,null,null,null,null,0,null,{"$error":"#DIV/0!"},null,null,null,null,null,null,null,null,0,null,{"$error":"#DIV/0!"}]
[null,null,null,null,null,null,null,null,null,null,null,0,null,{"$error":"#DIV/0!"},null,null,null,null,null,null,null,null,0,null,{"$error":"#DIV/0!"}]
[null,null,null,null,null,null,null,null,null,null,null,0,null,{"$error":"#DIV/0!"},null,null,null,null,null,null,null,null,0,null,{"$error":"#DIV/0!"}]
[null,null,null,null,null,null,null,null,null,null,null,0,null,{"$error":"#DIV/0!"},null,null,null,null,null,null,null,null,0,null,{"$error":"#DIV/0!"}]
[null,null,null,null,null,null,null,null,null,null,null,0,null,{"$error":"#DIV/0!"},null,null,null,null,null,null,null,null,0,null,{"$error":"#DIV/0!"}]
[null,null,null,null,null,null,null,null,null,null,null,0,null,{"$error":"#DIV/0!"},null,null,null,null,null,null,null,null,0,null,{"$error":"#DIV/0!"}]
[null,null,null,null,null,null,null,null,null,null,null,0,null,{"$error":"#DIV/0!"},null,null,null,null,null,null,null,null,0,null,{"$error":"#DIV/0!"}]
[null,null,null,null,null,null,null,null,null,null,null,0,null,{"$error":"#DIV/0!"},null,null,null,null,null,null,null,null,0,null,{"$error":"#DIV/0!"}]
[null,null,null,null,null,null,null,null,null,null,null,0,null,{"$error":"#DIV/0!"},null,null,null,null,null,null,null,null,0,null,{"$error":"#DIV/0!"}]
[null,null,null,null,null,null,null,null,null,null,null,0,null,{"$error":"#DIV/0!"},null,null,null,null,null,null,null,null,0,null,{"$error":"#DIV/0!"}]
[null,null,null,null,null,null,null,null,null,null,null,0,null,{"$error":"#DIV/0!"},null,null,null,null,null,null,null,null,0,null,{"$error":"#DIV/0!"}]
[null,null,null,null,null,null,null,null,null,null,null,0,null,{"$error":"#DIV/0!"},null,null,null,null,null,null,null,null,0,null,{"$error":"#DIV/0!"}]
[]
["\"Unauthorised Undertakings\""]
[null,null,null,null,null,null,null,null,null,null,null,{"$f":"SUM(C1020:K1020)","v":0},null,{"$f":"L1020/$L$1121*100","v":{"$error":"#DIV/0!"}},null,null,null,null,null,null,null,null,{"$f":"SUM(O1020:V1020)","v":0},null,{"$f":"W1020/$W$1121*100","v":{"$error":"#DIV/0!"}}]
[null,null,null,null,null,null,null,null,null,null,null,0,null,{"$f":"L1021/$L$1121*100","v":{"$error":"#DIV/0!"}},null,null,null,null,null,null,null,null,0,null,{"$f":"W1021/$W$1121*100","v":{"$error":"#DIV/0!"}}]
[null,null,null,null,null,null,null,null,null,null,null,0,null,{"$error":"#DIV/0!"},null,null,null,null,null,null,null,null,0,null,{"$error":"#DIV/0!"}]
[null,null,null,null,null,null,null,null,null,null,null,0,null,{"$error":"#DIV/0!"},null,null,null,null,null,null,null,null,0,null,{"$error":"#DIV/0!"}]
[null,null,null,null,null,null,null,null,null,null,null,0,null,{"$error":"#DIV/0!"},null,null,null,null,null,null,null,null,0,null,{"$error":"#DIV/0!"}]
[null,null,null,null,null,null,null,null,null,null,null,0,null,{"$error":"#DIV/0!"},null,null,null,null,null,null,null,null,0,null,{"$error":"#DIV/0!"}]
[null,null,null,null,null,null,null,null,null,null,null,0,null,{"$error":"#DIV/0!"},null,null,null,null,null,null,null,null,0,null,{"$error":"#DIV/0!"}]
[null,null,null,null,null,null,null,null,null,null,null,0,null,{"$error":"#DIV/0!"},null,null,null,null,null,null,null,null,0,null,{"$error":"#DIV/0!"}]
[null,null,null,null,null,null,null,null,null,null,null,0,null,{"$error":"#DIV/0!"},null,null,null,null,null,null,null,null,0,null,{"$error":"#DIV/0!"}]
[null,null,null,null,null,null,null,null,null,null,null,0,null,{"$error":"#DIV/0!"},null,null,null,null,null,null,null,null,0,null,{"$error":"#DIV/0!"}]
[null,null,null,null,null,null,null,null,null,null,null,0,null,{"$error":"#DIV/0!"},null,null,null,null,null,null,null,null,0,null,{"$error":"#DIV/0!"}]
[null,null,null,null,null,null,null,null,null,null,null,0,null,{"$error":"#DIV/0!"},null,null,null,null,null,null,null,null,0,null,{"$error":"#DIV/0!"}]
[null,null,null,null,null,null,null,null,null,null,null,0,null,{"$error":"#DIV/0!"},null,null,null,null,null,null,null,null,0,null,{"$error":"#DIV/0!"}]
[null,null,null,null,null,null,null,null,null,null,null,0,null,{"$error":"#DIV/0!"},null,null,null,null,null,null,null,null,0,null,{"$error":"#DIV/0!"}]
[null,null,null,null,null,null,null,null,null,null,null,0,null,{"$error":"#DIV/0!"},null,null,null,null,null,null,null,null,0,null,{"$error":"#DIV/0!"}]
[null,null,null,null,null,null,null,null,null,null,null,0,null,{"$error":"#DIV/0!"},null,null,null,null,null,null,null,null,0,null,{"$error":"#DIV/0!"}]
[null,null,null,null,null,null,null,null,null,null,null,0,null,{"$error":"#DIV/0!"},null,null,null,null,null,null,null,null,0,null,{"$error":"#DIV/0!"}]
[null,null,null,null,null,null,null,null,null,null,null,0,null,{"$error":"#DIV/0!"},null,null,null,null,null,null,null,null,0,null,{"$error":"#DIV/0!"}]
[null,null,null,null,null,null,null,null,null,null,null,0,null,{"$error":"#DIV/0!"},null,null,null,null,null,null,null,null,0,null,{"$error":"#DIV/0!"}]
[null,null,null,null,null,null,null,null,null,null,null,0,null,{"$error":"#DIV/0!"},null,null,null,null,null,null,null,null,0,null,{"$error":"#DIV/0!"}]
[null,null,null,null,null,null,null,null,null,null,null,0,null,{"$error":"#DIV/0!"},null,null,null,null,null,null,null,null,0,null,{"$error":"#DIV/0!"}]
[null,null,null,null,null,null,null,null,null,null,null,0,null,{"$error":"#DIV/0!"},null,null,null,null,null,null,null,null,0,null,{"$error":"#DIV/0!"}]
[null,null,null,null,null,null,null,null,null,null,null,0,null,{"$error":"#DIV/0!"},null,null,null,null,null,null,null,null,0,null,{"$error":"#DIV/0!"}]
[null,null,null,null,null,null,null,null,null,null,null,0,null,{"$error":"#DIV/0!"},null,null,null,null,null,null,null,null,0,null,{"$error":"#DIV/0!"}]
[null,null,null,null,null,null,null,null,null,null,null,0,null,{"$error":"#DIV/0!"},null,null,null,null,null,null,null,null,0,null,{"$error":"#DIV/0!"}]
[null,null,null,null,null,null,null,null,null,null,null,0,null,{"$error":"#DIV/0!"},null,null,null,null,null,null,null,null,0,null,{"$error":"#DIV/0!"}]
[null,null,null,null,null,null,null,null,null,null,null,0,null,{"$error":"#DIV/0!"},null,null,null,null,null,null,null,null,0,null,{"$error":"#DIV/0!"}]
[null,null,null,null,null,null,null,null,null,null,null,0,null,{"$error":"#DIV/0!"},null,null,null,null,null,null,null,null,0,null,{"$error":"#DIV/0!"}]
[null,null,null,null,null,null,null,null,null,null,null,0,null,{"$error":"#DIV/0!"},null,null,null,null,null,null,null,null,0,null,{"$error":"#DIV/0!"}]
[null,null,null,null,null,null,null,null,null,null,null,0,null,{"$error":"#DIV/0!"},null,null,null,null,null,null,null,null,0,null,{"$error":"#DIV/0!"}]
[null,null,null,null,null,null,null,null,null,null,null,0,null,{"$error":"#DIV/0!"},null,null,null,null,null,null,null,null,0,null,{"$error":"#DIV/0!"}]
[null,null,null,null,null,null,null,null,null,null,null,0,null,{"$error":"#DIV/0!"},null,null,null,null,null,null,null,null,0,null,{"$error":"#DIV/0!"}]
[null,null,null,null,null,null,null,null,null,null,null,0,null,{"$error":"#DIV/0!"},null,null,null,null,null,null,null,null,0,null,{"$error":"#DIV/0!"}]
[null,null,null,null,null,null,null,null,null,null,null,0,null,{"$error":"#DIV/0!"},null,null,null,null,null,null,null,null,0,null,{"$error":"#DIV/0!"}]
[null,null,null,null,null,null,null,null,null,null,null,0,null,{"$error":"#DIV/0!"},null,null,null,null,null,null,null,null,0,null,{"$error":"#DIV/0!"}]
[null,null,null,null,null,null,null,null,null,null,null,0,null,{"$error":"#DIV/0!"},null,null,null,null,null,null,null,null,0,null,{"$error":"#DIV/0!"}]
[null,null,null,null,null,null,null,null,null,null,null,0,null,{"$error":"#DIV/0!"},null,null,null,null,null,null,null,null,0,null,{"$error":"#DIV/0!"}]
[null,null,null,null,null,null,null,null,null,null,null,0,null,{"$error":"#DIV/0!"},null,null,null,null,null,null,null,null,0,null,{"$error":"#DIV/0!"}]
[null,null,null,null,null,null,null,null,null,null,null,0,null,{"$error":"#DIV/0!"},null,null,null,null,null,null,null,null,0,null,{"$error":"#DIV/0!"}]
[null,null,null,null,null,null,null,null,null,null,null,0,null,{"$error":"#DIV/0!"},null,null,null,null,null,null,null,null,0,null,{"$error":"#DIV/0!"}]
[null,null,null,null,null,null,null,null,null,null,null,0,null,{"$error":"#DIV/0!"},null,null,null,null,null,null,null,null,0,null,{"$error":"#DIV/0!"}]
[null,null,null,null,null,null,null,null,null,null,null,0,null,{"$error":"#DIV/0!"},null,null,null,null,null,null,null,null,0,null,{"$error":"#DIV/0!"}]
[null,null,null,null,null,null,null,null,null,null,null,0,null,{"$error":"#DIV/0!"},null,null,null,null,null,null,null,null,0,null,{"$error":"#DIV/0!"}]
[null,null,null,null,null,null,null,null,null,null,null,0,null,{"$error":"#DIV/0!"},null,null,null,null,null,null,null,null,0,null,{"$error":"#DIV/0!"}]
[null,null,null,null,null,null,null,null,null,null,null,0,null,{"$error":"#DIV/0!"},null,null,null,null,null,null,null,null,0,null,{"$error":"#DIV/0!"}]
[null,null,null,null,null,null,null,null,null,null,null,0,null,{"$error":"#DIV/0!"},null,null,null,null,null,null,null,null,0,null,{"$error":"#DIV/0!"}]
[null,null,null,null,null,null,null,null,null,null,null,0,null,{"$error":"#DIV/0!"},null,null,null,null,null,null,null,null,0,null,{"$error":"#DIV/0!"}]
[null,null,null,null,null,null,null,null,null,null,null,0,null,{"$error":"#DIV/0!"},null,null,null,null,null,null,null,null,0,null,{"$error":"#DIV/0!"}]
[null,null,null,null,null,null,null,null,null,null,null,0,null,{"$error":"#DIV/0!"},null,null,null,null,null,null,null,null,0,null,{"$error":"#DIV/0!"}]
[null,null,null,null,null,null,null,null,null,null,null,0,null,{"$error":"#DIV/0!"},null,null,null,null,null,null,null,null,0,null,{"$error":"#DIV/0!"}]
[null,null,null,null,null,null,null,null,null,null,null,0,null,{"$error":"#DIV/0!"},null,null,null,null,null,null,null,null,0,null,{"$error":"#DIV/0!"}]
[null,null,null,null,null,null,null,null,null,null,null,0,null,{"$error":"#DIV/0!"},null,null,null,null,null,null,null,null,0,null,{"$error":"#DIV/0!"}]
[null,null,null,null,null,null,null,null,null,null,null,0,null,{"$error":"#DIV/0!"},null,null,null,null,null,null,null,null,0,null,{"$error":"#DIV/0!"}]
[null,null,null,null,null,null,null,null,null,null,null,0,null,{"$error":"#DIV/0!"},null,null,null,null,null,null,null,null,0,null,{"$error":"#DIV/0!"}]
[null,null,null,null,null,null,null,null,null,null,null,0,null,{"$error":"#DIV/0!"},null,null,null,null,null,null,null,null,0,null,{"$error":"#DIV/0!"}]
[null,null,null,null,null,null,null,null,null,null,null,0,null,{"$error":"#DIV/0!"},null,null,null,null,null,null,null,null,0,null,{"$error":"#DIV/0!"}]
[null,null,null,null,null,null,null,null,null,null,null,0,null,{"$error":"#DIV/0!"},null,null,null,null,null,null,null,null,0,null,{"$error":"#DIV/0!"}]
[null,null,null,null,null,null,null,null,null,null,null,0,null,{"$error":"#DIV/0!"},null,null,null,null,null,null,null,null,0,null,{"$error":"#DIV/0!"}]
[null,null,null,null,null,null,null,null,null,null,null,0,null,{"$error":"#DIV/0!"},null,null,null,null,null,null,null,null,0,null,{"$error":"#DIV/0!"}]
[null,null,null,null,null,null,null,null,null,null,null,0,null,{"$error":"#DIV/0!"},null,null,null,null,null,null,null,null,0,null,{"$error":"#DIV/0!"}]
[null,null,null,null,null,null,null,null,null,null,null,0,null,{"$error":"#DIV/0!"},null,null,null,null,null,null,null,null,0,null,{"$error":"#DIV/0!"}]
[null,null,null,null,null,null,null,null,null,null,null,0,null,{"$error":"#DIV/0!"},null,null,null,null,null,null,null,null,0,null,{"$error":"#DIV/0!"}]
[null,null,null,null,null,null,null,null,null,null,null,0,null,{"$error":"#DIV/0!"},null,null,null,null,null,null,null,null,0,null,{"$error":"#DIV/0!"}]
[null,null,null,null,null,null,null,null,null,null,null,0,null,{"$error":"#DIV/0!"},null,null,null,null,null,null,null,null,0,null,{"$error":"#DIV/0!"}]
[null,null,null,null,null,null,null,null,null,null,null,0,null,{"$error":"#DIV/0!"},null,null,null,null,null,null,null,null,0,null,{"$error":"#DIV/0!"}]
[null,null,null,null,null,null,null,null,null,null,null,0,null,{"$f":"L1085/$L$1121*100","v":{"$error":"#DIV/0!"}},null,null,null,null,null,null,null,null,0,null,{"$f":"W1085/$W$1121*100","v":{"$error":"#DIV/0!"}}]
[null,null,null,null,null,null,null,null,null,null,null,0,null,{"$error":"#DIV/0!"},null,null,null,null,null,null,null,null,0,null,{"$error":"#DIV/0!"}]
[null,null,null,null,null,null,null,null,null,null,null,0,null,{"$error":"#DIV/0!"},null,null,null,null,null,null,null,null,0,null,{"$error":"#DIV/0!"}]
[null,null,null,null,null,null,null,null,null,null,null,0,null,{"$error":"#DIV/0!"},null,null,null,null,null,null,null,null,0,null,{"$error":"#DIV/0!"}]
[null,null,null,null,null,null,null,null,null,null,null,0,null,{"$error":"#DIV/0!"},null,null,null,null,null,null,null,null,0,null,{"$error":"#DIV/0!"}]
[null,null,null,null,null,null,null,null,null,null,null,0,null,{"$error":"#DIV/0!"},null,null,null,null,null,null,null,null,0,null,{"$error":"#DIV/0!"}]
[null,null,null,null,null,null,null,null,null,null,null,0,null,{"$error":"#DIV/0!"},null,null,null,null,null,null,null,null,0,null,{"$error":"#DIV/0!"}]
[null,null,null,null,null,null,null,null,null,null,null,0,null,{"$error":"#DIV/0!"},null,null,null,null,null,null,null,null,0,null,{"$error":"#DIV/0!"}]
[null,null,null,null,null,null,null,null,null,null,null,0,null,{"$error":"#DIV/0!"},null,null,null,null,null,null,null,null,0,null,{"$error":"#DIV/0!"}]
[null,null,null,null,null,null,null,null,null,null,null,0,null,{"$error":"#DIV/0!"},null,null,null,null,null,null,null,null,0,null,{"$error":"#DIV/0!"}]
[null,null,null,null,null,null,null,null,null,null,null,0,null,{"$error":"#DIV/0!"},null,null,null,null,null,null,null,null,0,null,{"$error":"#DIV/0!"}]
[null,null,null,null,null,null,null,null,null,null,null,0,null,{"$error":"#DIV/0!"},null,null,null,null,null,null,null,null,0,null,{"$error":"#DIV/0!"}]
[null,null,null,null,null,null,null,null,null,null,null,0,null,{"$error":"#DIV/0!"},null,null,null,null,null,null,null,null,0,null,{"$error":"#DIV/0!"}]
[null,null,null,null,null,null,null,null,null,null,null,0,null,{"$error":"#DIV/0!"},null,null,null,null,null,null,null,null,0,null,{"$error":"#DIV/0!"}]
[null,null,null,null,null,null,null,null,null,null,null,0,null,{"$error":"#DIV/0!"},null,null,null,null,null,null,null,null,0,null,{"$error":"#DIV/0!"}]
[null,null,null,null,null,null,null,null,null,null,null,0,null,{"$error":"#DIV/0!"},null,null,null,null,null,null,null,null,0,null,{"$error":"#DIV/0!"}]
[null,null,null,null,null,null,null,null,null,null,null,0,null,{"$error":"#DIV/0!"},null,null,null,null,null,null,null,null,0,null,{"$error":"#DIV/0!"}]
[null,null,null,null,null,null,null,null,null,null,null,0,null,{"$error":"#DIV/0!"},null,null,null,null,null,null,null,null,0,null,{"$error":"#DIV/0!"}]
[null,null,null,null,null,null,null,null,null,null,null,0,null,{"$error":"#DIV/0!"},null,null,null,null,null,null,null,null,0,null,{"$error":"#DIV/0!"}]
[null,null,null,null,null,null,null,null,null,null,null,0,null,{"$error":"#DIV/0!"},null,null,null,null,null,null,null,null,0,null,{"$error":"#DIV/0!"}]
[null,null,null,null,null,null,null,null,null,null,null,0,null,{"$error":"#DIV/0!"},null,null,null,null,null,null,null,null,0,null,{"$error":"#DIV/0!"}]
[null,null,null,null,null,null,null,null,null,null,null,0,null,{"$error":"#DIV/0!"},null,null,null,null,null,null,null,null,0,null,{"$error":"#DIV/0!"}]
[null,null,null,null,null,null,null,null,null,null,null,0,null,{"$error":"#DIV/0!"},null,null,null,null,null,null,null,null,0,null,{"$error":"#DIV/0!"}]
[null,null,null,null,null,null,null,null,null,null,null,0,null,{"$error":"#DIV/0!"},null,null,null,null,null,null,null,null,0,null,{"$error":"#DIV/0!"}]
[null,null,null,null,null,null,null,null,null,null,null,0,null,{"$error":"#DIV/0!"},null,null,null,null,null,null,null,null,0,null,{"$error":"#DIV/0!"}]
[null,null,null,null,null,null,null,null,null,null,null,0,null,{"$error":"#DIV/0!"},null,null,null,null,null,null,null,null,0,null,{"$error":"#DIV/0!"}]
[null,null,null,null,null,null,null,null,null,null,null,0,null,{"$error":"#DIV/0!"},null,null,null,null,null,null,null,null,0,null,{"$error":"#DIV/0!"}]
[null,null,null,null,null,null,null,null,null,null,null,0,null,{"$error":"#DIV/0!"},null,null,null,null,null,null,null,null,0,null,{"$error":"#DIV/0!"}]
[null,null,null,null,null,null,null,null,null,null,null,0,null,{"$error":"#DIV/0!"},null,null,null,null,null,null,null,null,0,null,{"$error":"#DIV/0!"}]
[null,null,null,null,null,null,null,null,null,null,null,0,null,{"$error":"#DIV/0!"},null,null,null,null,null,null,null,null,0,null,{"$error":"#DIV/0!"}]
[null,null,null,null,null,null,null,null,null,null,null,0,null,{"$error":"#DIV/0!"},null,null,null,null,null,null,null,null,0,null,{"$error":"#DIV/0!"}]
[null,null,null,null,null,null,null,null,null,null,null,0,null,{"$error":"#DIV/0!"},null,null,null,null,null,null,null,null,0,null,{"$error":"#DIV/0!"}]
[null,null,null,null,null,null,null,null,null,null,null,0,null,{"$error":"#DIV/0!"},null,null,null,null,null,null,null,null,0,null,{"$error":"#DIV/0!"}]
[null,null,null,null,null,null,null,null,null,null,null,0,null,{"$error":"#DIV/0!"},null,null,null,null,null,null,null,null,0,null,{"$error":"#DIV/0!"}]
[null,null,null,null,null,null,null,null,null,null,null,0,null,{"$error":"#DIV/0!"},null,null,null,null,null,null,null,null,0,null,{"$error":"#DIV/0!"}]
[]
["Total  ",{"$f":"SUM(B12:B1119)","v":0},0,0,0,0,0,0,0,0,0,0,null,null,{"$f":"SUM(O12:O1119)","v":0},0,0,0,0,0,0,0,0]
[]
[null,null,null,null,null,null,null,null,null,"Premium Long Term Business Agree to Form 5",null,{"$f":"IF('Form 5'!H19=L1121,\"YES\",IF('Form 5'!H19<'Form 10A'!L1121,\"NO\",IF('Form 5'!H19>'Form 10A'!L1121,\"NO\")))","v":"YES"},null,null,null,null,null,null,null,null,"Premium General Business Agree to Form 5",null,{"$f":"IF('Form 5'!H31=W1121,\"YES\",IF('Form 5'!H31<'Form 10A'!W1121,\"NO\",IF('Form 5'!H31>'Form 10A'!W1121,\"NO\")))","v":"NO"}]
[]
["Total Premiums excluding Risk Transfer",{"$f":"L1125+W1125","v":0},null,null,null,null,null,null,"Premium excluding Risk Transfer - Long Term ",null,null,{"$f":"SUMIF(M12:M1119,\"NO\", L12:L1119)","v":0},null,null,null,null,null,null,null,"Premium excluding Risk Transfer",null,null,{"$f":"SUMIF(X12:X1119,\"NO\", W12:W1119)","v":0}]
["Computed Own Funds ",{"$f":"B1125*4%","v":0}]
["Required Own Funds",{"$f":"IF(B1126>58250,B1126,58250)","v":58250}]
[]
[]
["Authorised Principals:-",null,"Freedom of Establishment:-"]
[]
["AAK Insurance Malta Limited",null,"Accelerant Insurance Europe SA"]
["Accredited Insurance (Europe) Limited",null,"AIG Co Markets"]
["Advent Insurance Pcc Limited ",null,"AIG Europe Limited"]
["AIG Co Markets",null,"AIG UK LIMITED"]
["AIG UK LIMITED",null,"Allianz Corporate Netherlands"]
["Arch Insurance (EU) DAC",null,"Allied World Assurance Company Europe DAC "]
["ArgoGlobal SE",null,"AMTrust International Underwriters DAC"]
["Argus Insurance Company (Europe) Limited",null,"Arch Insurance (EU) DAC"]
["Arch Insurance (EU) DAC",null,"Arch Insurance DAC"]
["Arch Insurance (EU) DAC",null,"Argus Insurance Co (Europe) Ltd "]
["Arch Insurance DAC",null,"Assekuranz-Union Versicherungs Agentur GMBH & Co"]
["ARLC Ltd",null,"Assuranceforeningen Skuld"]
["Assekuranz-Union Versicherungs Agentur GMBH & Co",null,"Aviva Insurance Ireland DAC"]
["Assuranceforeningen Skuld",null,"AXA Insurance DAC"]
["Atlas Insurance PCC Limited",null,"AXA PPP Healthcare Ltd"]
["Allianz Corporate Netherlands",null,"Baloise Belgium N.V."]
["Allied World Assurance Company Europe DAC ",null,"Beazley Solutions International Limited"]
["American Atlantic Assurance Co. Ltd.",null,"Berkshire Hathaway"]
["AMTrust International Underwriters DAC",null,"Berkshire Hathaway European Insurance DAC"]
["Aviation Insurance Limited",null,"Bupa Global DAC"]
["Aviva Insurance Ireland DAC",null,"BUPA Insurance Ltd"]
["AXA Insurance DAC",null,"CFC Underwriting Ltd"]
["Baloise Belgium N.V.",null,"Convex Europe SA"]
["Bastion Insurance Company Limited",null,"Convex Insurance (U.K.) Limited"]
["Bavaria Reinsurance Malta Limited",null,"Ensurance UK Ltd"]
["Beazley Solutions International Limited",null,"European Insurance Services GMBH"]
["Berkshire Hathaway",null,"Everest Insurance (Ireland) DAC"]
["Berkshire Hathaway European Insurance DAC",null,"Fortegra Specialty Insurance Company"]
["Berkshire Hathaway European Insurance DAC",null,"Geo Underwriting Europe B.V."]
["Bupa Global DAC",null,"Great American International Insurance EU DAC"]
["Building Block Insurance PCC Limited",null,"Hamilton Insurance DAC"]
["Cafina Assurances Limited",null,"HDI Global Specialty SE"]
["Carmobility Insurance Limited",null,"International General Insurance Co. (U.K.) Ltd"]
["CE Insurance Ltd",null,"Liberty Mutual Insurance Europe SE"]
["CFC Underwriting Ltd",null,"Lloyd's Underwriters "]
["Citadel Insurance plc",null,"Markel Insurance SE"]
["Convex Europe SA",null,"MEDICAL & COMMERCIAL INTERNATIONAL (EUROPE) TMGH"]
["Convex Europe SA",null,"Medical & Commercial Intl (Europe) GMBH"]
["Convex Europe SA",null,"Munich Re Risk Solutions Ireland Ltd"]
["Convex Insurance (U.K.) Limited",null,"Nexus Europe SARL"]
["Citadel Insurance plc",null,"North of England P&I DAC"]
["Collinson Insurance Europe Limited",null,"Polish Reinsurance Company"]
["Cowen Insurance Company Limited",null,"QBE Europe SA/NV"]
["CRH Group Insurance Services Europe Ltd",null,"Schwarzmeer und Ostsee Versicherungs-Aktiengesellschaft (SOVAG) "]
["Darag Malta Insurance and Reinsurance PCC Limited",null,"SI Insurance (Europe) SA"]
["Duiker Insurance Company Limited",null,"Spring Insure Europe Ltd"]
["Elmo Insurance Limited",null,"Starr International Europe Ltd"]
["Ensurance UK Ltd",null,"Tokio Marine Europe SA"]
["Ergon Insurance Limited",null,"UK P&I Club N.V."]
["Everest Insurance (Ireland) DAC",null,"XL Insurance Company SE"]
["EUCARE Insurance PCC Ltd"]
["European Insurance Services GMBH"]
["European Insurance Solution PCC Limited"]
["First European Title Insurance Company Ltd"]
["Fortegra Europe Insurance Company Limited"]
["Fortegra Specialty Insurance Company"]
["Fresenius Medical Care Global Insurance Limited"]
["Geo Underwriting Europe B.V."]
["Great American International Insurance EU DAC"]
["GasanMamo Insurance Limited"]
["LifeStar Insurance Limited"]
["Gossmann & Cie Insurance PCC Limited"]
["HDI Global Specialty SE"]
["HighDome PCC Limited"]
["Hillwood Limited"]
["HSBC LIFE ASSURANCE (MALTA) Limited"]
["HSF Health Plan (Malta) Ltd "]
["Hamilton Insurance DAC"]
["HDI Global Specialty SE"]
["HDI Global Specialty SE"]
["International General Insurance Co. (U.K.) Ltd"]
["International General Insurance Co. UK Ltd"]
["Liberty Mutual Insurance Europe SE"]
["IDA Insurance Limited"]
["Insurem Insurance Limited"]
["International General Insurance Company (Europe) SE"]
["IvaLife Insurance Ltd"]
["Jorge Insurance Limited"]
["Liberty Global Insurance Company Limited"]
["Lime Street Insurance PCC Limited"]
["London & Leith Insurance PCC SE"]
["Mangrove Insurance Europe PCC Limited"]
["Mapfre Middlesea plc "]
["Mapfre MSV Life plc"]
["Marco Insurance PCC Limited"]
["Monarch Assurance SE"]
["Markel Insurance SE"]
["MEDICAL & COMMERCIAL INTERNATIONAL (EUROPE) TMGH"]
["Medical & Commercial Intl (Europe) GMBH"]
["Munich Re Risk Solutions Ireland Ltd"]
["Vodafone Insurance Limited"]
["Munich Re of Malta plc"]
["Munich Re PCC Limited"]
["Nissan International Insurance Limited"]
["Nexus Europe SARL"]
["North of England P&I DAC"]
["North of England P&I DAC"]
["One Insurance Limited"]
["Oney Insurance (PCC) Limited"]
["Oney Life (PCC) Limited"]
["Orlen Insurance Limited"]
["Premium Insurance Company Limited"]
["Stellantis Insurance Europe Limited"]
["Stellantis Insurance Limited"]
["Stellantis Life Insurance Europe Limited"]
["Stellantis Life Insurance Limited"]
["Steel Plow Insurance Ltd"]
["Polish Reinsurance Company"]
["QIC Europe Limited"]
["QBE Europe SA/NV"]
["QBE Europe SA/NV"]
["RCI Insurance Limited"]
["RCI Life Limited"]
["Rhenas Insurance Limited"]
["Riverstone Insurance (Malta) "]
["SN SecureCorp Insurance Malta Limited"]
["Starr Europe Insurance Limited"]
["Stewart Title Europe Limited"]
["SI Insurance (Europe) SA"]
["SI Insurance (Europe) SA"]
["SI Insurance Europe SA"]
["Spring Insure Europe Ltd"]
["Starr International Europe Ltd"]
["Tesla Insurance Ltd"]
["TravelJigsaw Insurance Limited"]
["Trelleborg Insurance Ltd"]
["Tokio Marine Europe SA"]
["Tulip Assist Insurance Limited"]
["UK P&I Club N.V."]
["Werla Insurance Company Limited"]
["White Rock Insurance (Europe) PCC Limited"]
["White Rock Insurance (Netherlands) PCC Limited"]
["XL Insurance Company SE"]
[]
[]
[]
["Freedom of Services "]
[]
["(U)ADB \"Compensa Vienna Insurance Group\""]
["AachenMunchener Versicherung AG"]
["ABN Amro Life S.A."]
["Accelerant Insurance Europe SA"]
["Accelerant Inusrance Europe SA"]
["ACE Europe Life Ltd"]
["Achmea Schadverzekeringen NV "]
["Achmea Zorgverzekeringen N.V. "]
["Acredia Versicherung AG"]
["Adriatic - Slovenica Zavarovalna Druzba D.D. Koper"]
["AEGON Towarzystwo Ubezpieczen na Zycie S.A."]
["Aetna Health Insurance Company of Europe Ltd "]
["Aetna Insurance Company Limited"]
["Agf Belgium Insurance"]
["AIG Co Markets"]
["AIG Co Markets"]
["AIG Europe (Netherlands) NV"]
["AIG UK LIMITED"]
["Aioi Nissay Dowa Insurance Company of Europe Ltd"]
["Akine Draudimo Bendrove 'Reso Europa'"]
["Akzo Nobel Assurantie NV"]
["Alleanza Toro spa"]
["Allianz Belgium NV"]
["Allianz Compañía De Seguros y Reaseguros, Sociedad Anónima"]
["Allianz Compañía De Seguros y Reaseguros, Sociedad Anónima"]
["Allianz Corporate Netherlands"]
["Allianz Elementar Lebens Versicherungs - AG"]
["Allianz Elementar Versicherungs - AG"]
["Allianz Global Corporate and Specialty SE"]
["Allianz Global Life Limited"]
["Allianz Hungaria Biztosito Rt"]
["Allianz Hungaria Biztosito Zartkoruen Mukodo Reszvenytarsasag"]
["Allianz IARD"]
["Allianz Insurance plc"]
["Allianz Lebensversicherungs-AG"]
["Allianz Life Luxembourg S.A."]
["Allianz Pojst’ovna AS CZ – 120 00"]
["Allianz pojst'ovna"]
["Allianz Risk Transfer AG"]
["Allianz Societa per Azioni"]
["Allianz Versicherungs AG"]
["Allianz Vie"]
["Allied World Assurance Co (Europe) Ltd"]
["Allied World Assurance Company Europe DAC "]
["Alm. Brand Forsikring A/S"]
["Alterra Europe plc"]
["Altraplan Luxembourg S.A."]
["Amlin Insurance (UK) plc"]
["Amlin Insurance SE"]
["AmTrust Europe Limited"]
["Amtrust Insruance Luxembourg S.A."]
["AMTrust International Underwriters DAC"]
["Anderzorg N.V. "]
["Anker Verzekeringen N.V"]
["ARAG, Compania Internacional de Seguros Y Reaseguros, S.A."]
["Arch Insurance (EU) DAC"]
["Arch Insurance (EU) DAC"]
["Arch Insurance (EU) DAC"]
["Arch Insurance Co (Europe) Ltd"]
["Arch Insurance DAC"]
["Arisa Assurances SA, Goldbell Centre"]
["ARISCOM Compagnia di Assicurazioni Spa"]
["Aspen Insurance UK Ltd"]
["ASR Levensverzekering NV"]
["Assekuranz-Union Versicherungs Agentur GMBH & Co"]
["Asset Insurance AD"]
["Assicurazioni Generali SpA"]
["Assuranceforeningen Grad Gjensidig"]
["Assuranceforeningen Skuld"]
["Assuranceforeningen Skuld - Gjensidig"]
["Assurant General Insurance Limited"]
["Assurant Life Limited"]
["Assured Guaranty (UK) Ltd"]
["Astrenska Insurance Limited"]
["Aterforsakringsbolaget SKF"]
["Atradius Credito y Caucion S.A. de Seguros Y Reaseguros "]
["Augura Life Ireland Ltd"]
["Augusta Assicurazioni SpA"]
["Autohome Magyarorszag Biztosito Egyesulet"]
["Autohome Magyarorszag Biztosito Egyesulet"]
["Avero Achmea Zorgverzekeringen N.V. "]
["Avero Schadeverzekeringen Benelux N.V"]
["Aviabel NV"]
["Aviva Annuity UK Ltd"]
["Aviva Insurance Ireland DAC"]
["Aviva Insurance Limited"]
["Aviva Italia SpA"]
["Aviva Life and Pensions UK Ltd"]
["AWP Health & Life"]
["AWP P & C"]
["AXA Art Versicherung AG"]
["Axa Assicurazioni S.p.A."]
["AXA Assurances Vie Luxembourg"]
["AXA Biztosito Zrt. "]
["AXA Corporate Solutions Assurance"]
["AXA France IARD"]
["AXA France Vie"]
["AXA Insurance DAC"]
["AXA Insurance plc"]
["AXA Insurance UK plc "]
["AXA PPP Healthcare Ltd"]
["AXA Ubezpieczenia Towarzystwo Ubezpieczen I Reasekuracji S.A. "]
["AXA Versicherung, "]
["AXA Wealth Europe SA"]
["AXA Wealth Limited"]
["Axeria Prevoyance"]
["Axis Specialty Europe SE"]
["Azivo N.V. "]
["Baloise Belgium N.V."]
["Baloise Vie Luxembourg S.A."]
["Basler Osiguranje Zagreb d.d."]
["Basler Sachversicherungs AG"]
["Bavaria Insurance Company Ltd"]
["BAWAG Versicherung AG"]
["Bayerische Landesbrandversicherung Aktiengesellschaft"]
["Bayerischer Versicherungsverband Versicherungsaktiengesellschaft"]
["BD24 Berlin Direkt Versicherung AG"]
["Beazley Insurance Designated Activity Company"]
["Beazley Solutions International Limited"]
["Berkshire Hathaway"]
["Berkshire Hathaway European Insurance DAC"]
["Berkshire Hathaway European Insurance DAC"]
["Berkshire Hathaway International Insurance Ltd"]
["BlackRock Life Limited"]
["Bluewater Insurance ASA "]
["Brit Insurance Ltd"]
["British Engine Insurance Ltd"]
["Bulgarian Export Insurance Agency / Baez / Ead"]
["Bulstrad Life Vienna Insurance Group JSC"]
["Bupa Global DAC"]
["BUPA Insurance Limited"]
["Cali Europe"]
["Canada Life Ltd "]
["Canterbury Insurance dac"]
["CapitalLeben Versicherung AG"]
["Cardif Assurances Risques Divers"]
["Cardif Lux VIE S.A. "]
["Cardif Vie"]
["Carraig Insurance dac"]
["CartPrint Insurance AG"]
["Catlin Insurance Co (UK) Ltd"]
["CBL Insurance Europe dac"]
["Certasig - Societate de Asigurare si Reasigurare S.A. "]
["Ceska pojist'ovna a.s."]
["CFC Underwriting Ltd"]
["Chartis Europe Ltd"]
["Chartis Excess Ltd"]
["Chaucer Insurance Company Designated Activity Company"]
["China Taiping Insurance (UK) Company Ltd"]
["Chubb Bermuda International Insurance (Ireland) dac"]
["CHUBB European Group Limited"]
["Cigna Europe Insurance Co SA"]
["Cigna Life Insurance Company of Europe NV"]
["Cigna Life Insurance Company of Europe SA"]
["Clerical Medical Investment Group Ltd"]
["CNA Insurance Co Ltd"]
["CNP Luxembourg SA"]
["Codan Forsikring A/S"]
["COFACE - Compagnie Francaise d’Assurance pour le Commerce Exterieur "]
["Colonnade Insurance SA"]
["Compagnia Italiana Di Previdenza Assicurazioni e Riassicurazioni SpA"]
["Convex Europe SA"]
["Convex Europe SA"]
["Convex Europe SA"]
["Convex Insurance (U.K.) Limited"]
["Cornhill France "]
["Credendo - Short-Term Non-EU Risks SA"]
["Credendo - Single Risk Insurance AG"]
["Croatia osiguranje d.d."]
["CSOB Pojistovna a.s."]
["D.A.S. Rechtsschutz AG"]
["D.K.V. Luxembourg SA"]
["DAS Legal Expenses Insurance Company Ltd"]
["Delvag Luftfahrtversicherungs AG"]
["Delvag Versicherungs-Aktiengesellschaft"]
["Den Norske Krigsforsikring For Skib Gjensidig Forening"]
["Donau Versicherung AG Vienna Insurance Group "]
["DSV Insurance A/S"]
["Dutch Shipping Defence N.V."]
["Ecclesiastical Insurance Office plc"]
["Electric Insurance Ireland dac"]
["Electro Assurances S.A."]
["Electrolux Forsakringsaktiebolag (publ)"]
["Elips Versicherungen AG"]
["Endurance Worldwide Insurance Ltd"]
["Eni Insurance dac"]
["Ensurance UK Ltd"]
["Equitas Insurance Ltd"]
["Ergo Insurance SE"]
["Ergo Lietuva, Uadb"]
["ERGO Versicherung Aktiengesellschaft"]
["Ericsson Insurance (Forsakring) AB"]
["ERISA "]
["Euler Hermes Emporiki Credit Insurance Company S.A."]
["Euler Hermes Guarantee Plc"]
["Euler Hermes Kreditförsäkring Norden AB, "]
["Euler Hermes Magyar Hitelbiztosito Rt"]
["Euler Hermes SA/NV"]
["Euler Herms Siac, Societa Italiana Assicurazioni e Crediti SpA"]
["Euler Herms UK plc"]
["Euresa - Life S.A."]
["EurizonVita S.p.A"]
["Euromex NV"]
["Eurooppalainen Insurance Company Ltd"]
["Europ Assistance"]
["Europaische Reiseversicherung AG"]
["Europaische Reiseversicherung AG"]
["Europaiske Rejseforsikiring A/S"]
["European Insurance Services GMBH"]
["Europeiska Forsakringsatiebolaget (publ)"]
["Eurovita Assicurazioni spa"]
["Eurovita Assicurazioni spa"]
["Everest Insurance (Ireland) DAC"]
["Everest Insurance (Ireland) DAC "]
["Exeter Friendly Society Ltd"]
["Family Assurance Friendly Society Limited"]
["Fennia Mutual Insurance Company"]
["Feuersozietat Berlin Brandenburg Versicherung Aktiengesellschaft"]
["Fidelis Underwriting Ltd "]
["First Title Insurance Ltd"]
["FM Insurance Co Ltd"]
["FM Insurance Europe SA"]
["Forsakringsaktiebolaget Alandia "]
["Forsikringselksabet Privatsikiring"]
["Fortegra Specialty Insurance Company"]
["Foyer Assurances S.A."]
["Friends Life and Pensions Limited"]
["FWU Life Insurance Austria AG"]
["Gable Insurance AG"]
["GAN Eurocourtage "]
["Garantie Assistance"]
["Gard Marine & Energy Försäkring AB"]
["Gard Marine & Energy Insurance (Europe) AS"]
["Generali Espana S.A De Seguros Y Reaseguros"]
["Generali IARD"]
["Generali Osiguranje d.d."]
["Generali Pan Europe Ltd"]
["Generali Towarzystwo Ubezpieczen Spolka Akcyjna"]
["Generali Versicherung AG"]
["Generali Versicherung AG"]
["Generali Vita SpA"]
["Generali Zavarovalnica d.d."]
["Generali Zycie Towarzystwo Ubezpieczen S.A."]
["Geo Underwriting Europe B.V."]
["Gerling Polska Towarzystwo Ubezpieczen S.A."]
["GICL 2013 Limited"]
["Globality S.A."]
["Gothaer Allgemeine Versicherung AG"]
["GRAWE Eletbiztosito Zartkoruen Mukodo Reszvenytarsasag"]
["Great American International Insurance EU DAC"]
["Great Lakes Insurance SE"]
["Groupama Assicurazioni SpA"]
["Groupama Biztosito Zartkoruen Mukodo Reszvenytarsasag"]
["Groupama Rhone Alpes Auvergne"]
["Groupama Transport"]
["Hamilton Insurance DAC"]
["Hansard Europe dac"]
["Hanse-Marine Versicherung AG"]
["HanseMerkur Reiseversihcherung AG"]
["Hartford Financial Products International Ltd"]
["HCC International Insurance Co plc"]
["HDI Asekuracja Towarzystwo Ubezpieczen S.A. "]
["HDI Global SE"]
["HDI Global Specialty SE"]
["HDI Global Specialty SE"]
["HDI Global Specialty SE"]
["HDI Hannover Versicherung AG"]
["HDI Versicherung AG"]
["HDI-Gerling Verzekeringen N.V."]
["Heddington Insurance (U.K) Ltd"]
["Helvetia Assurances S.A."]
["Helvetia Schweizerische Versicherungsgesellschaft in Liechtenstein AG"]
["Helvetia Versicherungs-Aktiengesellschaft"]
["Hiscox Insurance Co Ltd"]
["Holmia Livforsakring AB"]
["Houston Casualty Co Europe Seguros y Reaseguros S.A."]
["HSB Engineering Insurance Ltd"]
["HSBC Life (Europe) Limited"]
["If P and C Insurance Co Ltd "]
["If Skadeforsakring AB"]
["INA Assitalia s.p.a"]
["Infrassure Ltd "]
["Ingonord Insurance Co.Ltd"]
["Inora Life Limited"]
["Insurance Company Euroins AD"]
["Insurance Stock Company BTA"]
["IntegraLife UK Ltd"]
["Inter Partner Assistance"]
["Interamerican Property & Casualty Insurance Co S.A."]
["International General Insurance Co. (U.K.) Ltd"]
["International General Insurance Co. (uk) Ltd"]
["International General Insurance Co. UK Ltd"]
["International Health Insurance Denmark A/S"]
["International Insurance Company of Hannover SE"]
["International Transport Intermediaries Club Ltd"]
["Interpolis Zorgverzekeringen N.V. "]
["Ironshore Europe Ltd"]
["Istituto Trentino Alto Adige per Assicurazioni"]
["IWI International Wealth Insurer"]
["IZA Zorgverzekeraar N.V. "]
["IZZ Zorgverzekeraar N.V. "]
["Justitia"]
["Kooperativa pojist'ovna, a.s. Vienna Insurance Group"]
["Kravag-Logistic Versicherungs-AG"]
["KUPEG uverova pojist'ovna, a.s."]
["La Mondiale Europartner S.A."]
["Lancashire Insurance Company (UK) Ltd"]
["Lansforsakringar Sak Forsakringsaktiebolag (publ)"]
["Le Sphinx Assurances Luxembourg SA"]
["Legal and General Assurance Society Ltd"]
["Liberty Mutual Insurance Europe Ltd"]
["Liberty Mutual Insurance Europe SE"]
["Liechtenstein Life Assurance AG"]
["Lietuvos Draudimas, AB"]
["Lloyds Insurance Company S.A."]
["Lloyds TSB General Insurance Limited"]
["Lombard International Assurance SA"]
["LV1871 Private Assurance AG"]
["Mannheimer Versicherung AG"]
["Mannheimer Versicherung AG"]
["Mapfre Asistencia Compania Internacional de Seguros y Reasseguros, S.A. "]
["Mapfre Espana Compania De Seguros Y Reaseguros SA"]
["Mapfre Global Risks Compania Internacional de Seguros Y Reaseguros S.A"]
["Markel Insurance SE"]
["Markel Insurance SE"]
["Markel International Insurance Co Ltd"]
["Marsh Sp. Z o.o."]
["MAXIMA pojistovna a.s."]
["MBIA UK Insurance Ltd"]
["MEDICAL & COMMERCIAL INTERNATIONAL (EUROPE) TMGH"]
["Medical & Commercial Intl (Europe) GMBH"]
["Medicash Health Benefits Limited"]
["Menzis N.V. "]
["Menzis Zorgverzekeraar N.V. "]
["Mercator Verzekeringen NV"]
["Merchant Investors Assurance Company Ltd"]
["Millennium Insurance Company Limited"]
["Mitsui Sumitomo Insurance Co (Europe) Ltd"]
["MMA IARD Assurances Mutuelles"]
["MMA IARD SA"]
["Monarch Assurance plc"]
["Mondial Assistance Europe NV"]
["MSIG Insurance Europe AG"]
["Multi Risk Insurance Co.Ltd"]
["Munich Re Risk Solutions Ireland Ltd"]
["N.V. Unive Zorg"]
["N.V. VGZ Care"]
["N.V. Zorgverzekeraar UMC"]
["Natexis Life S.A. "]
["National General Insurance Luxembourg SA"]
["National General Life Insurance Europe SA"]
["Nationale-Nederlanden Internationale Schadevezekering SE"]
["Nationale-Nederlanden Schadeverzekering Maatschappij NV"]
["Navigators International Insurance Company Ltd "]
["Navillus Insurance Company dac"]
["Neue Rechtsschutz-Versicherungsgesellschaft Aktiengesellschaft"]
["NEUFLIZE Vie"]
["Newell Insurance dac"]
["Newline Insurance Company Ltd"]
["Nexus Europe SARL"]
["Niederosterreichische Versicherung AG"]
["Nokatus Insurance Company dac"]
["Nord Europe Life Luxembourg"]
["Nordea Life and Pensions S.A. "]
["Nordisk Marinforsakring AB"]
["North of England P and I Association Ltd"]
["North of England P&I DAC"]
["North of England P&I DAC"]
["Norwegian Hull Club "]
["Norwegian Hull Club-Gjensidig Assurancseforening"]
["Novae Insurance Company Ltd"]
["NÜRNBERGER Allgemeine Versicherungs - AG"]
["Old Mutual International Ireland dac"]
["Onderlinge Verzekering-Maatschppij \"Noord Nederlandshe P & I Club\" U.A. "]
["OOM Global Care NV"]
["OOM Schadverzekering NV"]
["Ornua Insurance dac"]
["OWM Zorgverzekeraar Zorg en Zekerheid U.A. "]
["OZF Zorgverzekeringen N.V"]
["P&C Insurance AS"]
["Pallas Versicherung AG"]
["Pan Insurance dac"]
["PartnerRe Ireland Insurance Ltd"]
["PFA Pension, Forsikringsaktie-Selskab"]
["Phoenix Life Limited"]
["PI Indemnity Company dac"]
["Pine Indemnity dac"]
["PMI Mortgage Insurance Co.Ltd"]
["Pohjola Insurance Ltd"]
["Polish Reinsurance Company"]
["Powszechny Zaklad Ubezpieczen na Zycie Spolka Akcyjna"]
["Powszechny Zaklad Ubezpieczen S.A."]
["PrismaLife AG"]
["Prosight Speciality Managing Agency Ltd "]
["Provinzial Rheinland Versicherung AG"]
["Prudential International Assurance plc"]
["Prudential Pensions Ltd"]
["QBE Europe SA/NV"]
["QBE Europe SA/NV"]
["QBE Insurance (Europe) Ltd"]
["QBE poist'ovna a.s."]
["Quanta Europe Ltd"]
["R and V Allgemeine Versicherung Aktiengesellschaft"]
["R+V Allgemeine Versicherung AG"]
["Reasekuracji SA"]
["ReAssure Ltd"]
["Red Disk Insurance dac"]
["River Thames Insurance Company Limited"]
["RiverStone Insurance Ltd"]
["Roland Rechtsschutz-Verischerungs-AG"]
["Ronda SpA"]
["Rothesay Life plc"]
["Royal and Sun Alliance Insurance plc "]
["RSA Insurance Ireland Ltd"]
["RVS Levensverzekering NV"]
["S.C. ABC Asigurari - Reasigurari S.A."]
["S.C. Allianz - Tiriac Asigurari S.A."]
["SAARLAND Feuerversicherung Aktiengesellschaft"]
["SACE BT SpA"]
["Sappisure Forsakrings AB"]
["SCA Forskaringsaktiebolag"]
["SCOR UK Company Ltd "]
["Seamair Insurance dac"]
["SEB Life International Assurance Company Limited"]
["SI Insurance (Europe) SA"]
["SI Insurance (Europe) SA"]
["SI Insurance Europe SA"]
["SIAT - Societa Italiana Assicurazioni e Riassicurazioni per Azioni"]
["SID - Prva kreditna zavarovalnica d.d."]
["Simplyhealth Access"]
["Sirius International AB (publ)"]
["Sirius International Försäkringsaktiebolag (publ)"]
["Societa’ Reale Mutua Di Assicurazioni"]
["Societatea De Asigurari Chartis Romania S.A. "]
["Société Belge d'Assistance Internationale S.A"]
["Sogelife S.A."]
["Solid Forsakringsaktiebolag"]
["Solunion Seguros de Credito, Compania Internacional de Seguros y Reaseguros, SA"]
["Sompo Japan Nipponkoa Insurance Company of Europe Limited"]
["Sparkassen-Versicherung Sachsen Allgemeine Versicherung AG"]
["Spring Insure Europe Ltd"]
["St James's Place International plc"]
["Standard Life Assurance Ltd"]
["Standard Life International Ltd"]
["Starr Excess Liability Insurance International Ltd "]
["Starr International (Europe) Limited"]
["Starr International Europe Ltd"]
["StarStone Insurance Europe SE"]
["StarStone Insurance SE"]
["Stewart Title Ltd"]
["STM Life Assurance PCC plc"]
["Stora Enso Forsakringsaktiebolag"]
["Sun Life Assurance Company of Canada (U.K.) Limited"]
["Sunderland Marine Mutual Insurance Co Ltd"]
["SureStone Insurance dac"]
["SV SparkassenVersicherung Gebaudeversicherung AG"]
["Sveriges Angfartygs Assurans Forening"]
["Swiss Life (Liechtenstein) AG"]
["Swiss Life (Luxembourg) S.A."]
["Swiss Life Products (Luxembourg) S.A."]
["Swiss Re Copenhagen Reinsurance A/S"]
["Swiss Re International S.E."]
["Swiss Re Portfolio Partners SA"]
["Swiss Reinsurance Company UK Ltd"]
["Swisslife Prevoyance et Sante"]
["Tapiola Corporate Life Insurance Ltd"]
["Tapiola General Mutual Insurance Company"]
["Tapiola Mutla Life Assurance Company"]
["Tenecom Ltd"]
["The Association of Underwriters known as Lloyd's  "]
["The Britannia Steam Ship Insurance Association Ltd"]
["The London Steamship Owners Mutual Insurance Association Ltd"]
["The Marine Insurance Company Limited"]
["The New India Assurance Company Ltd "]
["The Ocean Marine Insurance Company Limited"]
["The OneLife Company S.A. "]
["The Prudential Assurance Company Ltd "]
["The Shipowners Mutual Protection and Indemnity Association (Luxembourg)"]
["The Shipowners Mutual Strike Insurance Association Europe "]
["The Standard Club Europe Ltd"]
["The Steamship Mutual Underwriting Association Ltd"]
["The United Kingdom Mutual Steam Ship Assurance Association (Europe) Limited"]
["The West of England"]
["Tokio Marine Europe Insurance Ltd"]
["Tokio Marine Europe SA"]
["Tokio Marine Global Ltd"]
["Towarzystvo Ubezpeiczan Euler Helmes SA"]
["Towarzystwo Ubezpieczen Allianz Polska S.A. "]
["Trans-Europe Assurance Ltd"]
["TransRe London Limited"]
["Travelers Casualty and Surety Company of Europe Limited"]
["Travelers Insurance Company Ltd"]
["Triglav Osiguranje d.d."]
["Trygg-Hansa Forsakrinaktiebolag (publ)"]
["Tryggingamiðstöðin hf."]
["TT Club Mutual Insurance Ltd"]
["TVM particulier NV"]
["UAB DK \"PZU Lietuva\""]
["UK P&I Club N.V."]
["UMS Generali Marine Ltd"]
["UnipolSai Assicurazioni s.p.a."]
["UNIQA Österreich Versicherungen AG"]
["UNIQA Versicherung Aktiengesellschaft"]
["United Kingdom Freight Demurrge and Deence Association Ltd "]
["United Kingdom Mutual War Risks Association Limited"]
["Utmost Ireland dac"]
["Uzbekinvest International Insurance Company Ltd"]
["Uzdaroji akcine gyvybes draudimo ir pensiju bedrove \"Aviva Lietuva\""]
["Valorlife Lebensversicherungs-Aktiengesellschaft"]
["VGZ Zorgverzekeraar N.V. "]
["VHV Allgemeine Versicherung AG "]
["Vienna Insurance Group AG Wiener Versicherung Gruppe"]
["Vienna-Life Lebensversicherung AG"]
["Vital Blue Insurance dac"]
["W.R. Berkley Europe AG"]
["W.R. Berkley Insurance (Europe) Ltd"]
["Warta Towarzystwo Ubezpieczen E Reasekuracji SA"]
["Wealins SA"]
["Wealth-Assurance AG"]
["White Horse Insurance Ireland dac"]
["White Rock Insurance (Gibraltar) PCC Ltd"]
["Wiener osiguranje Vienna Insurance Group d.d."]
["Wiener Stadtische Versicherung AG Vienna Insurance Group"]
["Wurttembergische Versicherung AG"]
["XL Europe Ltd"]
["XL Insurance Company plc"]
["XL Insurance Company SE"]
["XL Insurance Company SE"]
["ZAD \"Bulstrad Vienna Insurance Group\""]
["Zavarovalnica Triglav d.d."]
["Zenith Insurance plc"]
["Zilveren Kruis Ziektekostenverzekeringen N.V"]
["Zilveren Kruis Zorgverzekeringen N.V."]
["ZK \"LEV INS\" AD"]
["Zurich Assurances"]
["Zurich España, Compagñia de Seguros y Reaseguros, S.A."]
["Zurich Eurolife S.A."]
["Zurich Insurance plc "]
["Zurich Insurance plc, Dublin"]
["Zurich Versicherungs – AG"]
["Zurich Vida, Compania de Seguros y Reaseguros, S.A. "]

{"sheet":"Form 10B","index":20,"n_rows":177,"n_cols":23,"rows_kept":177,"cut":false,"hidden":false,"merged":[[28,20,28,22],[28,11,28,13],[28,14,28,16],[28,17,28,19],[28,2,28,4],[28,5,28,7],[28,8,28,10],[0,2,0,8],[16,1,16,2],[0,20,0,22],[14,1,14,2],[0,0,0,1],[12,1,12,2],[7,2,7,7],[11,2,11,7],[10,1,10,2],[9,2,9,7],[75,2,75,4],[75,5,75,7],[75,8,75,10],[41,2,41,4],[41,5,41,7],[41,8,41,10],[62,2,62,4],[62,5,62,7],[62,8,62,10],[75,14,75,16],[75,17,75,19],[96,11,96,13],[75,20,75,22],[62,11,62,13],[62,14,62,16],[62,17,62,19],[96,8,96,10],[96,20,96,22],[13,2,13,7],[15,2,15,7],[17,2,17,7],[58,0,58,20],[62,20,62,22],[41,20,41,22],[96,2,96,4],[96,5,96,7],[41,11,41,13],[41,14,41,16],[41,17,41,19],[96,14,96,16],[96,17,96,19],[75,11,75,13],[144,2,144,4],[110,2,110,4],[110,5,110,7],[110,8,110,10],[110,11,110,13],[144,20,144,22],[144,5,144,7],[144,8,144,10],[144,11,144,13],[144,14,144,16],[144,17,144,19],[110,14,110,16],[110,17,110,19],[110,20,110,22],[131,14,131,16],[131,17,131,19],[131,20,131,22],[127,0,127,19],[131,2,131,4],[131,5,131,7],[131,8,131,10],[131,11,131,13],[162,1,164,1],[162,14,162,16],[162,17,162,19],[162,20,162,22],[162,2,162,4],[162,5,162,7],[162,8,162,10],[162,11,162,13]]}
["Name of Insurance Intermediary:-",null,{"$f":"'Cover Sheet'!E17","v":0},null,null,null,null,null,null,null,null,"Year ended : ",null,{"$f":"IF('Cover Sheet'!$E$23=\"\",\"\",'Cover Sheet'!$E$23)","v":""}]
[]
["Form 10B"]
["Breakdown of Business of Enrolled Insurance Managers and Enrolled Insurance Agents with more than one appointment"]
[]
[null,"Insert name/s of undertaking/undertakings from which the manager or agent has accepted an appointment"]
[]
[null,"Appointment 1 "]
[]
[null,"Appointment 2 "]
[]
[null,"Appointment 3 "]
[]
[null,"Appointment 4"]
[]
[null,"Appointment 5 "]
[]
[null,"Appointment 6 "]
[]
[]
[]
["A. Breakdown of Data Provided in Form 1"]
[]
[]
["Insurance Premiums and Commissions in relation to commitments where Malta is the country of commitment and risks situated in Malta "]
[]
["Long Term Business"]
["Gross insurance premiums written and commissions received or receivable in respect thereof"]
["No.","Class","Appointment 1",null,null,"Appointment 2",null,null,"Appointment 3",null,null,"Appointment 4",null,null,"Appointment 5",null,null,"Appointment 6",null,null,"Total"]
[null,null,"Premiums","Commission","Risk Transfer","Premiums","Commission","Risk Transfer","Premiums","Commission","Risk Transfer","Premiums","Commission","Risk Transfer","Premiums","Commission","Risk Transfer","Premiums","Commission","Risk Transfer","Premiums","Commission","Risk Transfer"]
[null,null,"EUR","EUR","YES or NO","EUR","EUR","YES or NO","EUR","EUR","YES or NO","EUR","EUR","YES or NO","EUR","EUR","YES or NO","EUR","EUR","YES or NO","EUR","EUR","NO"]
["I"," Life and Annuity",null,null,null,null,null,null,null,null,null,null,null,null,null,null,null,null,null,null,{"$f":"C32+F32+I32+L32+O32+R32","v":0},0,{"$f":"SUMIF(E32,\"NO\",C32)+SUMIF(H32,\"NO\",F32)+SUMIF(K32,\"NO\",I32)+SUMIF(N32,\"NO\",L32)+SUMIF(Q32,\"NO\",O32)+SUMIF(T32,\"NO\",R32)","v":0}]
["II"," Marriage and Birth",null,null,null,null,null,null,null,null,null,null,null,null,null,null,null,null,null,null,0,0,{"$f":"SUMIF(E33,\"NO\",C33)+SUMIF(H33,\"NO\",F33)+SUMIF(K33,\"NO\",I33)+SUMIF(N33,\"NO\",L33)+SUMIF(Q33,\"NO\",O33)+SUMIF(T33,\"NO\",R33)","v":0}]
["III"," Linked Long Term ",null,null,null,null,null,null,null,null,null,null,null,null,null,null,null,null,null,null,0,0,{"$f":"SUMIF(E34,\"NO\",C34)+SUMIF(H34,\"NO\",F34)+SUMIF(K34,\"NO\",I34)+SUMIF(N34,\"NO\",L34)+SUMIF(Q34,\"NO\",O34)+SUMIF(T34,\"NO\",R34)","v":0}]
["IV"," Permanent Health",null,null,null,null,null,null,null,null,null,null,null,null,null,null,null,null,null,null,0,0,{"$f":"SUMIF(E35,\"NO\",C35)+SUMIF(H35,\"NO\",F35)+SUMIF(K35,\"NO\",I35)+SUMIF(N35,\"NO\",L35)+SUMIF(Q35,\"NO\",O35)+SUMIF(T35,\"NO\",R35)","v":0}]
[null," Other Classes ",null,null,null,null,null,null,null,null,null,null,null,null,null,null,null,null,null,null,{"$f":"C36+F36+I36+L36+O36+R36","v":0},{"$f":"D36+G36+J36+M36+P36+S36","v":0},{"$f":"SUMIF(E36,\"NO\",C36)+SUMIF(H36,\"NO\",F36)+SUMIF(K36,\"NO\",I36)+SUMIF(N36,\"NO\",L36)+SUMIF(Q36,\"NO\",O36)+SUMIF(T36,\"NO\",R36)","v":0}]
[null,"TOTAL PREMIUMS AND COMMISSION",{"$f":"SUM(C32:C36)","v":0},0,null,0,0,null,0,0,null,0,0,null,0,0,null,0,0,null,{"$f":"SUM(U32:U36)","v":0},{"$f":"SUM(V32:V36)","v":0},{"$f":"SUM(W32:W36)","v":0}]
[]
[]
["General Business"]
["Gross insurance premiums written and commissions received or receivable in respect thereof"]
["No.","Class","Appointment 1",null,null,"Appointment 2",null,null,"Appointment 3",null,null,"Appointment 4",null,null,"Appointment 5",null,null,"Appointment 6",null,null,"Total"]
[null,null,"Premiums","Commission","Risk Transfer","Premiums","Commission","Risk Transfer","Premiums","Commission","Risk Transfer","EUR","EUR","Risk Transfer","Premiums","Commission","Risk Transfer","Premiums","Commission","Risk Transfer","Premiums","Commission","Risk Transfer"]
[null,null,"EUR","EUR","YES or NO","EUR","EUR","YES or NO","EUR","EUR","YES or NO","EUR","EUR","YES or NO","EUR","EUR","YES or NO","EUR","EUR","YES or NO","EUR","EUR","NO"]
[1," Accident & Health",null,null,null,null,null,null,null,null,null,null,null,null,null,null,null,null,null,null,{"$f":"C45+F45+I45+L45+O45+R45","v":0},{"$f":"D45+G45+J45+M45+P45+S45","v":0},{"$f":"SUMIF(E45,\"NO\",C45)+SUMIF(H45,\"NO\",F45)+SUMIF(K45,\"NO\",I45)+SUMIF(N45,\"NO\",L45)+SUMIF(Q45,\"NO\",O45)+SUMIF(T45,\"NO\",R45)","v":0}]
[2," Motor",null,null,null,null,null,null,null,null,null,null,null,null,null,null,null,null,null,null,{"$f":"C46+F46+I46+L46+O46+R46","v":0},{"$f":"D46+G46+J46+M46+P46+S46","v":0},{"$f":"SUMIF(E46,\"NO\",C46)+SUMIF(H46,\"NO\",F46)+SUMIF(K46,\"NO\",I46)+SUMIF(N46,\"NO\",L46)+SUMIF(Q46,\"NO\",O46)+SUMIF(T46,\"NO\",R46)","v":0}]
[3," Marine & Transport",null,null,null,null,null,null,null,null,null,null,null,null,null,null,null,null,null,null,0,{"$f":"D47+G47+J47+M47+P47+S47","v":0},0]
[4," Aviation",null,null,null,null,null,null,null,null,null,null,null,null,null,null,null,null,null,null,0,0,0]
[5," Fire & Other Damage to Property",null,null,null,null,null,null,null,null,null,null,null,null,null,null,null,null,null,null,0,0,0]
[6," Liability",null,null,null,null,null,null,null,null,null,null,null,null,null,null,null,null,null,null,0,0,{"$f":"SUMIF(E50,\"NO\",C50)+SUMIF(H50,\"NO\",F50)+SUMIF(K50,\"NO\",I50)+SUMIF(N50,\"NO\",L50)+SUMIF(Q50,\"NO\",O50)+SUMIF(T50,\"NO\",R50)","v":0}]
[7," Credit and Suretyship",null,null,null,null,null,null,null,null,null,null,null,null,null,null,null,null,null,null,0,0,{"$f":"SUMIF(E51,\"NO\",C51)+SUMIF(H51,\"NO\",F51)+SUMIF(K51,\"NO\",I51)+SUMIF(N51,\"NO\",L51)+SUMIF(Q51,\"NO\",O51)+SUMIF(T51,\"NO\",R51)","v":0}]
[8," General",null,null,null,null,null,null,null,null,null,null,null,null,null,null,null,null,null,null,0,0,{"$f":"SUMIF(E52,\"NO\",C52)+SUMIF(H52,\"NO\",F52)+SUMIF(K52,\"NO\",I52)+SUMIF(N52,\"NO\",L52)+SUMIF(Q52,\"NO\",O52)+SUMIF(T52,\"NO\",R52)","v":0}]
[null,"TOTAL PREMIUMS AND COMMISSION",{"$f":"SUM(C45:C52)","v":0},0,null,{"$f":"SUM(F45:F52)","v":0},0,null,{"$f":"SUM(I45:I52)","v":0},0,null,{"$f":"SUM(L45:L52)","v":0},0,null,{"$f":"SUM(O45:O52)","v":0},0,0,0,null,{"$f":"SUM(T45:T52)","v":0},{"$f":"SUM(U45:U52)","v":0},{"$f":"SUM(V45:V52)","v":0},{"$f":"SUM(W45:W52)","v":0}]
[]
[]
["B. Breakdown of Data Provided in Form 2"]
[]
[]
["Insurance Premiums and Commissions in relation to commitments where Malta is not the country of commitment and risks situated outside Malta"]
[]
["Long Term Business"]
["Gross insurance premiums written and commissions received or receivable in respect thereof"]
["No.","Class","Appointment 1",null,null,"Appointment 2",null,null,"Appointment 3",null,null,"Appointment 4",null,null,"Appointment 5",null,null,"Appointment 6",null,null,"Total"]
[null,null,"Premiums","Commission","Risk Transfer","Premiums","Commission","Risk Transfer","Premiums","Commission","Risk Transfer","Premiums","Commission","Risk Transfer","Premiums","Commission","Risk Transfer","Premiums","Commission","Risk Transfer","Premiums","Commission","Risk Transfer"]
[null,null,"EUR","EUR","YES or NO","EUR","EUR","YES or NO","EUR","EUR","YES or NO","EUR","EUR","YES or NO","EUR","EUR","YES or NO","EUR","EUR","YES or NO","EUR","EUR","NO"]
["I"," Life and Annuity",null,null,null,null,null,null,null,null,null,null,null,null,null,null,null,null,null,null,{"$f":"C66+F66+I66+L66+O66+R66","v":0},{"$f":"D66+G66+J66+M66+P66+S66","v":0},{"$f":"SUMIF(E66,\"NO\",C66)+SUMIF(H66,\"NO\",F66)+SUMIF(K66,\"NO\",I66)+SUMIF(N66,\"NO\",L66)+SUMIF(Q66,\"NO\",O66)+SUMIF(T66,\"NO\",R66)","v":0}]
["II"," Marriage and Birth",null,null,null,null,null,null,null,null,null,null,null,null,null,null,null,null,null,null,{"$f":"IF('Cover Sheet'!$E$25=\"\",\"\",'Cover Sheet'!$E$25)","v":""},{"$f":"IF('Cover Sheet'!$E$25=\"\",\"\",'Cover Sheet'!$E$25)","v":""},{"$f":"SUMIF(E67,\"NO\",C67)+SUMIF(H67,\"NO\",F67)+SUMIF(K67,\"NO\",I67)+SUMIF(N67,\"NO\",L67)+SUMIF(Q67,\"NO\",O67)+SUMIF(T67,\"NO\",R67)","v":0}]
["III"," Linked Long Term ",null,null,null,null,null,null,null,null,null,null,null,null,null,null,null,null,null,null,{"$f":"IF('Cover Sheet'!$E$25=\"\",\"\",'Cover Sheet'!$E$25)","v":""},{"$f":"IF('Cover Sheet'!$E$25=\"\",\"\",'Cover Sheet'!$E$25)","v":""},{"$f":"SUMIF(E68,\"NO\",C68)+SUMIF(H68,\"NO\",F68)+SUMIF(K68,\"NO\",I68)+SUMIF(N68,\"NO\",L68)+SUMIF(Q68,\"NO\",O68)+SUMIF(T68,\"NO\",R68)","v":0}]
["IV"," Permanent Health",null,null,null,null,null,null,null,null,null,null,null,null,null,null,null,null,null,null,{"$f":"IF('Cover Sheet'!$E$25=\"\",\"\",'Cover Sheet'!$E$25)","v":""},{"$f":"IF('Cover Sheet'!$E$25=\"\",\"\",'Cover Sheet'!$E$25)","v":""},{"$f":"SUMIF(E69,\"NO\",C69)+SUMIF(H69,\"NO\",F69)+SUMIF(K69,\"NO\",I69)+SUMIF(N69,\"NO\",L69)+SUMIF(Q69,\"NO\",O69)+SUMIF(T69,\"NO\",R69)","v":0}]
[null," Other Classes ",null,null,null,null,null,null,null,null,null,null,null,null,null,null,null,null,null,null,{"$f":"C70+F70+I70+L70+O70+R70","v":0},{"$f":"D70+G70+J70+M70+P70+S70","v":0},{"$f":"SUMIF(E70,\"NO\",C70)+SUMIF(H70,\"NO\",F70)+SUMIF(K70,\"NO\",I70)+SUMIF(N70,\"NO\",L70)+SUMIF(Q70,\"NO\",O70)+SUMIF(T70,\"NO\",R70)","v":0}]
[null,"TOTAL PREMIUMS AND COMMISSION",{"$f":"SUM(C66:C70)","v":0},0,null,0,0,null,0,0,null,0,0,null,0,0,null,0,0,null,{"$f":"IF(SUM(U66:U70)='Form 2'!G16,SUM(U66:U70),\"ERROR\")","v":0},{"$f":"IF(SUM(V66:V70)='Form 2'!H16,SUM(V66:V70),\"ERROR\")","v":0},{"$f":"SUM(W66:W70)","v":0}]
[]
[]
["General Business"]
["Gross insurance premiums written and commissions received or receivable in respect thereof"]
["No.","Class","Appointment 1",null,null,"Appointment 2",null,null,"Appointment 3",null,null,"Appointment 4",null,null,"Appointment 5",null,null,"Appointment 6",null,null,"Total"]
[null,null,"Premiums","Commission","Risk Transfer","Premiums","Commission","Risk Transfer","Premiums","Commission","Risk Transfer","Premiums","Commission","Risk Transfer","Premiums","Commission","Risk Transfer","Premiums","Commission","Risk Transfer","Premiums","Commission","Risk Transfer"]
[null,null,"EUR","EUR","YES or NO","EUR","EUR","YES or NO","EUR","EUR","YES or NO","EUR","EUR","YES or NO","EUR","EUR","YES or NO","EUR","EUR","YES or NO","EUR","EUR","NO"]
[1," Accident & Health",null,null,null,null,null,null,null,null,null,null,null,null,null,null,null,null,null,null,{"$f":"C79+F79+I79+L79+O79+R79","v":0},{"$f":"D79+G79+J79+M79+P79+S79","v":0},{"$f":"SUMIF(E79,\"NO\",C79)+SUMIF(H79,\"NO\",F79)+SUMIF(K79,\"NO\",I79)+SUMIF(N79,\"NO\",L79)+SUMIF(Q79,\"NO\",O79)+SUMIF(T79,\"NO\",R79)","v":0}]
[2," Motor",null,null,null,null,null,null,null,null,null,null,null,null,null,null,null,null,null,null,{"$f":"C80+F80+I80+L80+O80+R80","v":0},{"$f":"D80+G80+J80+M80+P80+S80","v":0},{"$f":"SUMIF(E80,\"NO\",C80)+SUMIF(H80,\"NO\",F80)+SUMIF(K80,\"NO\",I80)+SUMIF(N80,\"NO\",L80)+SUMIF(Q80,\"NO\",O80)+SUMIF(T80,\"NO\",R80)","v":0}]
[3," Marine & Transport",null,null,null,null,null,null,null,null,null,null,null,null,null,null,null,null,null,null,0,0,{"$f":"SUMIF(E81,\"NO\",C81)+SUMIF(H81,\"NO\",F81)+SUMIF(K81,\"NO\",I81)+SUMIF(N81,\"NO\",L81)+SUMIF(Q81,\"NO\",O81)+SUMIF(T81,\"NO\",R81)","v":0}]
[4," Aviation",null,null,null,null,null,null,null,null,null,null,null,null,null,null,null,null,null,null,0,0,{"$f":"SUMIF(E82,\"NO\",C82)+SUMIF(H82,\"NO\",F82)+SUMIF(K82,\"NO\",I82)+SUMIF(N82,\"NO\",L82)+SUMIF(Q82,\"NO\",O82)+SUMIF(T82,\"NO\",R82)","v":0}]
[5," Fire & Other Damage to Property",null,null,null,null,null,null,null,null,null,null,null,null,null,null,null,null,null,null,0,0,{"$f":"SUMIF(E83,\"NO\",C83)+SUMIF(H83,\"NO\",F83)+SUMIF(K83,\"NO\",I83)+SUMIF(N83,\"NO\",L83)+SUMIF(Q83,\"NO\",O83)+SUMIF(T83,\"NO\",R83)","v":0}]
[6," Liability",null,null,null,null,null,null,null,null,null,null,null,null,null,null,null,null,null,null,0,0,{"$f":"SUMIF(E84,\"NO\",C84)+SUMIF(H84,\"NO\",F84)+SUMIF(K84,\"NO\",I84)+SUMIF(N84,\"NO\",L84)+SUMIF(Q84,\"NO\",O84)+SUMIF(T84,\"NO\",R84)","v":0}]
[7," Credit and Suretyship",null,null,null,null,null,null,null,null,null,null,null,null,null,null,null,null,null,null,0,0,{"$f":"SUMIF(E85,\"NO\",C85)+SUMIF(H85,\"NO\",F85)+SUMIF(K85,\"NO\",I85)+SUMIF(N85,\"NO\",L85)+SUMIF(Q85,\"NO\",O85)+SUMIF(T85,\"NO\",R85)","v":0}]
[8," General",null,null,null,null,null,null,null,null,null,null,null,null,null,null,null,null,null,null,0,0,{"$f":"SUMIF(E86,\"NO\",C86)+SUMIF(H86,\"NO\",F86)+SUMIF(K86,\"NO\",I86)+SUMIF(N86,\"NO\",L86)+SUMIF(Q86,\"NO\",O86)+SUMIF(T86,\"NO\",R86)","v":0}]
[null,"TOTAL PREMIUMS AND COMMISSION",{"$f":"SUM(C79:C86)","v":0},0,null,{"$f":"SUM(F79:F86)","v":0},0,null,{"$f":"SUM(I79:I86)","v":0},0,null,{"$f":"SUM(L79:L86)","v":0},0,null,{"$f":"SUM(O79:O86)","v":0},0,null,{"$f":"SUM(R79:R86)","v":0},0,null,{"$f":"IF(SUM(U79:U86)='Form 2'!G31,SUM(U79:U86),\"ERROR\")","v":"ERROR"},{"$f":"IF(SUM(V79:V86)='Form 2'!H31,SUM(V79:V86),\"ERROR\")","v":"ERROR"},{"$f":"SUM(W79:W86)","v":0}]
[]
[]
["C. Breakdown of Data Provided in Form 3"]
[]
[]
["Reinsurance Premiums and Commissions in relation to commitments where Malta is the country of commitment and risks situated in Malta "]
[]
["Long Term Business"]
["Gross reinsurance premiums written and commissions received or receivable in respect thereof"]
["No.","Class","Appointment 1",null,null,"Appointment 2",null,null,"Appointment 3",null,null,"Appointment 4",null,null,"Appointment 5",null,null,"Appointment 6",null,null,"Total"]
[null,null,"Premiums","Commission","Risk Transfer","Premiums","Commission","Risk Transfer","Premiums","Commission","Risk Transfer","Premiums","Commission","Risk Transfer","Premiums","Commission","Risk Transfer","Premiums","Commission","Risk Transfer","Premiums","Commission","Risk Transfer"]
[null,null,"EUR","EUR","YES or NO","EUR","EUR","YES or NO","EUR","EUR","YES or NO","EUR","EUR","YES or NO","EUR","EUR","YES or NO","EUR","EUR","YES or NO","EUR","EUR","NO"]
["I"," Life and Annuity",null,null,null,null,null,null,null,null,null,null,null,null,null,null,null,null,null,null,{"$f":"C100+F100+I100+L100+O100+R100","v":0},{"$f":"D100+G100+J100+M100+P100+S100","v":0},{"$f":"SUMIF(E100,\"NO\",C100)+SUMIF(H100,\"NO\",F100)+SUMIF(K100,\"NO\",I100)+SUMIF(N100,\"NO\",L100)+SUMIF(Q100,\"NO\",O100)+SUMIF(T100,\"NO\",R100)","v":0}]
["II"," Marriage and Birth",null,null,null,null,null,null,null,null,null,null,null,null,null,null,null,null,null,null,{"$f":"C101+F101+I101+L101+O101+R101","v":0},{"$f":"D101+G101+J101+M101+P101+S101","v":0},{"$f":"SUMIF(E101,\"NO\",C101)+SUMIF(H101,\"NO\",F101)+SUMIF(K101,\"NO\",I101)+SUMIF(N101,\"NO\",L101)+SUMIF(Q101,\"NO\",O101)+SUMIF(T101,\"NO\",R101)","v":0}]
["III"," Linked Long Term ",null,null,null,null,null,null,null,null,null,null,null,null,null,null,null,null,null,null,0,0,{"$f":"SUMIF(E102,\"NO\",C102)+SUMIF(H102,\"NO\",F102)+SUMIF(K102,\"NO\",I102)+SUMIF(N102,\"NO\",L102)+SUMIF(Q102,\"NO\",O102)+SUMIF(T102,\"NO\",R102)","v":0}]
["IV"," Permanent Health",null,null,null,null,null,null,null,null,null,null,null,null,null,null,null,null,null,null,0,0,{"$f":"SUMIF(E103,\"NO\",C103)+SUMIF(H103,\"NO\",F103)+SUMIF(K103,\"NO\",I103)+SUMIF(N103,\"NO\",L103)+SUMIF(Q103,\"NO\",O103)+SUMIF(T103,\"NO\",R103)","v":0}]
[null," Other Classes ",null,null,null,null,null,null,null,null,null,null,null,null,null,null,null,null,null,null,0,0,0]
[null,"TOTAL PREMIUMS AND COMMISSION",{"$f":"SUM(C100:C104)","v":0},0,null,0,0,null,0,0,null,0,0,null,0,0,null,0,0,null,{"$f":"IF(SUM(U100:U104)='Form 3'!G16,SUM(U100:U104),\"ERROR\")","v":0},{"$f":"IF(SUM(V100:V104)='Form 3'!H16,SUM(V100:V104),\"ERROR\")","v":0},{"$f":"SUM(W100:W104)","v":0}]
[]
[]
[]
["General Business"]
["Gross reinsurance premiums written and commissions received or receivable in respect thereof"]
["No.","Class","Appointment 1",null,null,"Appointment 2",null,null,"Appointment 3",null,null,"Appointment 4",null,null,"Appointment 5",null,null,"Appointment 6",null,null,"Total"]
[null,null,"Premiums","Commission","Risk Transfer","Premiums","Commission","Risk Transfer","Premiums","Commission","Risk Transfer","Premiums","Commission","Risk Transfer","Premiums","Commission","Risk Transfer","Premiums","Commission","Risk Transfer","Premiums","Commission","Risk Transfer"]
[null,null,"EUR","EUR","YES or NO","EUR","EUR","YES or NO","EUR","EUR","YES or NO","EUR","EUR","YES or NO","EUR","EUR","YES or NO","EUR","EUR","YES or NO","EUR","EUR","NO"]
[1," Accident & Health",null,null,null,null,null,null,null,null,null,null,null,null,null,null,null,null,null,null,{"$f":"C114+F114+I114+L114+O114+R114","v":0},{"$f":"D114+G114+J114+M114+P114+S114","v":0},{"$f":"SUMIF(E114,\"NO\",C114)+SUMIF(H114,\"NO\",F114)+SUMIF(K114,\"NO\",I114)+SUMIF(N114,\"NO\",L114)+SUMIF(Q114,\"NO\",O114)+SUMIF(T114,\"NO\",R114)","v":0}]
[2," Motor",null,null,null,null,null,null,null,null,null,null,null,null,null,null,null,null,null,null,{"$f":"C115+F115+I115+L115+O115+R115","v":0},{"$f":"D115+G115+J115+M115+P115+S115","v":0},{"$f":"SUMIF(E115,\"NO\",C115)+SUMIF(H115,\"NO\",F115)+SUMIF(K115,\"NO\",I115)+SUMIF(N115,\"NO\",L115)+SUMIF(Q115,\"NO\",O115)+SUMIF(T115,\"NO\",R115)","v":0}]
[3," Marine & Transport",null,null,null,null,null,null,null,null,null,null,null,null,null,null,null,null,null,null,0,0,{"$f":"SUMIF(E116,\"NO\",C116)+SUMIF(H116,\"NO\",F116)+SUMIF(K116,\"NO\",I116)+SUMIF(N116,\"NO\",L116)+SUMIF(Q116,\"NO\",O116)+SUMIF(T116,\"NO\",R116)","v":0}]
[4," Aviation",null,null,null,null,null,null,null,null,null,null,null,null,null,null,null,null,null,null,0,0,{"$f":"SUMIF(E117,\"NO\",C117)+SUMIF(H117,\"NO\",F117)+SUMIF(K117,\"NO\",I117)+SUMIF(N117,\"NO\",L117)+SUMIF(Q117,\"NO\",O117)+SUMIF(T117,\"NO\",R117)","v":0}]
[5," Fire & Other Damage to Property",null,null,null,null,null,null,null,null,null,null,null,null,null,null,null,null,null,null,0,0,{"$f":"SUMIF(E118,\"NO\",C118)+SUMIF(H118,\"NO\",F118)+SUMIF(K118,\"NO\",I118)+SUMIF(N118,\"NO\",L118)+SUMIF(Q118,\"NO\",O118)+SUMIF(T118,\"NO\",R118)","v":0}]
[6," Liability",null,null,null,null,null,null,null,null,null,null,null,null,null,null,null,null,null,null,0,0,{"$f":"SUMIF(E119,\"NO\",C119)+SUMIF(H119,\"NO\",F119)+SUMIF(K119,\"NO\",I119)+SUMIF(N119,\"NO\",L119)+SUMIF(Q119,\"NO\",O119)+SUMIF(T119,\"NO\",R119)","v":0}]
[7," Credit and Suretyship",null,null,null,null,null,null,null,null,null,null,null,null,null,null,null,null,null,null,0,0,{"$f":"SUMIF(E120,\"NO\",C120)+SUMIF(H120,\"NO\",F120)+SUMIF(K120,\"NO\",I120)+SUMIF(N120,\"NO\",L120)+SUMIF(Q120,\"NO\",O120)+SUMIF(T120,\"NO\",R120)","v":0}]
[8," General",null,null,null,null,null,null,null,null,null,null,null,null,null,null,null,null,null,null,0,0,{"$f":"SUMIF(E121,\"NO\",C121)+SUMIF(H121,\"NO\",F121)+SUMIF(K121,\"NO\",I121)+SUMIF(N121,\"NO\",L121)+SUMIF(Q121,\"NO\",O121)+SUMIF(T121,\"NO\",R121)","v":0}]
[null,"TOTAL PREMIUMS AND COMMISSION",{"$f":"SUM(C114:C121)","v":0},0,null,{"$f":"SUM(F114:F121)","v":0},{"$f":"SUM(G114:G121)","v":0},null,{"$f":"SUM(I114:I121)","v":0},0,null,{"$f":"SUM(L114:L121)","v":0},0,null,{"$f":"SUM(O114:O121)","v":0},0,null,{"$f":"SUM(R114:R121)","v":0},0,null,{"$f":"IF(SUM(U114:U121)='Form 3'!G31,SUM(U114:U121),\"ERROR\")","v":"ERROR"},{"$f":"IF(SUM(V114:V121)='Form 3'!H31,SUM(V114:V121),\"ERROR\")","v":"ERROR"},{"$f":"SUM(W114:W121)","v":0}]
[]
[]
["D. Breakdown of Data Provided in Form 4"]
[]
[]
["Reinsurance Premiums and Commissions in relation to commitments where Malta is not the country of commitment and risks situated outside Malta"]
[]
["Long Term Business"]
["Gross reinsurance premiums written and commissions received or receivable in respect thereof"]
["No.","Class","Appointment 1",null,null,"Appointment 2",null,null,"Appointment 3",null,null,"Appointment 4",null,null,"Appointment 5",null,null,"Appointment 6",null,null,"Total"]
[null,null,"Premiums","Commission","Risk Transfer","Premiums","Commission","Risk Transfer","Premiums","Commission","Risk Transfer","Premiums","Commission","Risk Transfer","Premiums","Commission","Risk Transfer","Premiums","Commission","Risk Transfer","Premiums","Commission","Risk Transfer"]
[null,null,"EUR","EUR","YES or NO","EUR","EUR","YES or NO","EUR","EUR","YES or NO","EUR","EUR","YES or NO","EUR","EUR","YES or NO","EUR","EUR","YES or NO","EUR","EUR","NO"]
["I"," Life and Annuity",null,null,null,null,null,null,null,null,null,null,null,null,null,null,null,null,null,null,{"$f":"C135+F135+I135+L135+O135+R135","v":0},{"$f":"D135+G135+J135+M135+P135+S135","v":0},{"$f":"SUMIF(E135,\"NO\",C135)+SUMIF(H135,\"NO\",F135)+SUMIF(K135,\"NO\",I135)+SUMIF(N135,\"NO\",L135)+SUMIF(Q135,\"NO\",O135)+SUMIF(T135,\"NO\",R135)","v":0}]
["II"," Marriage and Birth",null,null,null,null,null,null,null,null,null,null,null,null,null,null,null,null,null,null,{"$f":"C136+F136+I136+L136+O136+R136","v":0},{"$f":"D136+G136+J136+M136+P136+S136","v":0},0]
["III"," Linked Long Term ",null,null,null,null,null,null,null,null,null,null,null,null,null,null,null,null,null,null,0,0,{"$f":"SUMIF(E137,\"NO\",C137)+SUMIF(H137,\"NO\",F137)+SUMIF(K137,\"NO\",I137)+SUMIF(N137,\"NO\",L137)+SUMIF(Q137,\"NO\",O137)+SUMIF(T137,\"NO\",R137)","v":0}]
["IV"," Permanent Health",null,null,null,null,null,null,null,null,null,null,null,null,null,null,null,null,null,null,0,0,{"$f":"SUMIF(E138,\"NO\",C138)+SUMIF(H138,\"NO\",F138)+SUMIF(K138,\"NO\",I138)+SUMIF(N138,\"NO\",L138)+SUMIF(Q138,\"NO\",O138)+SUMIF(T138,\"NO\",R138)","v":0}]
[null," Other Classes ",null,null,null,null,null,null,null,null,null,null,null,null,null,null,null,null,null,null,0,{"$f":"D139+G139+J139+M139+P139+S139","v":0},{"$f":"SUMIF(E139,\"NO\",C139)+SUMIF(H139,\"NO\",F139)+SUMIF(K139,\"NO\",I139)+SUMIF(N139,\"NO\",L139)+SUMIF(Q139,\"NO\",O139)+SUMIF(T139,\"NO\",R139)","v":0}]
[null,"TOTAL PREMIUMS AND COMMISSION",{"$f":"SUM(C132:C139)","v":0},0,null,{"$f":"SUM(F132:F139)","v":0},0,null,{"$f":"SUM(I132:I139)","v":0},0,null,{"$f":"SUM(L135:L139)","v":0},{"$f":"SUM(M135:M139)","v":0},0,0,0,0,0,null,0,{"$f":"IF(SUM(U135:U139)='Form 4'!G16,SUM(U135:U139),\"ERROR\")","v":0},{"$f":"IF(SUM(V135:V139)='Form 4'!H16,SUM(V135:V139),\"ERROR\")","v":0},{"$f":"SUM(W135:W139)","v":0}]
[]
[]
["General Business"]
["Gross reinsurance premiums written and commissions received or receivable in respect thereof"]
["No.","Class","Appointment 1",null,null,"Appointment 2",null,null,"Appointment 3",null,null,"Appointment 4",null,null,"Appointment 5",null,null,"Appointment 6",null,null,"Total"]
[null,null,"Premiums","Commission","Risk Transfer","Premiums","Commission","Risk Transfer","Premiums","Commission","Risk Transfer","Premiums","Commission","Risk Transfer","Premiums","Commission","Risk Transfer","Premiums","Commission","Risk Transfer","Premiums","Commission","Risk Transfer"]
[null,null,"EUR","EUR","YES or NO","EUR","EUR","YES or NO","EUR","EUR","YES or NO","EUR","EUR","YES or NO","EUR","EUR","YES or NO","EUR","EUR","YES or NO","EUR","EUR","NO"]
[1," Accident & Health",null,null,null,null,null,null,null,null,null,null,null,null,null,null,null,null,null,null,{"$f":"C148+F148+I148+L148+O148+R148","v":0},{"$f":"D148+G148+J148+M148+P148+S148","v":0},{"$f":"SUMIF(E148,\"NO\",C148)+SUMIF(H148,\"NO\",F148)+SUMIF(K148,\"NO\",I148)+SUMIF(N148,\"NO\",L148)+SUMIF(Q148,\"NO\",O148)+SUMIF(T148,\"NO\",R148)","v":0}]
[2," Motor",null,null,null,null,null,null,null,null,null,null,null,null,null,null,null,null,null,null,{"$f":"C149+F149+I149+L149+O149+R149","v":0},{"$f":"D149+G149+J149+M149+P149+S149","v":0},0]
[3," Marine & Transport",null,null,null,null,null,null,null,null,null,null,null,null,null,null,null,null,null,null,0,0,0]
[4," Aviation",null,null,null,null,null,null,null,null,null,null,null,null,null,null,null,null,null,null,0,0,0]
[5," Fire & Other Damage to Property",null,null,null,null,null,null,null,null,null,null,null,null,null,null,null,null,null,null,0,0,0]
[6," Liability",null,null,null,null,null,null,null,null,null,null,null,null,null,null,null,null,null,null,0,0,0]
[7," Credit and Suretyship",null,null,null,null,null,null,null,null,null,null,null,null,null,null,null,null,null,null,0,0,0]
[8," General",null,null,null,null,null,null,null,null,null,null,null,null,null,null,null,null,null,null,0,0,0]
[null,"TOTAL PREMIUMS AND COMMISSION",{"$f":"SUM(C148:C155)","v":0},0,null,0,0,null,0,0,null,0,0,null,0,0,null,0,0,null,{"$f":"IF(SUM(U148:U155)='Form 4'!G31,SUM(U148:U155),\"ERROR\")","v":0},{"$f":"IF(SUM(V148:V155)='Form 4'!H31,SUM(V148:V155),\"ERROR\")","v":0},{"$f":"SUM(W148:W155)","v":0}]
[]
[]
[null,"Premium Long Term Business Agree to Form 5",null,null,{"$f":"IF('Form 5'!H19=C166,\"YES\",IF('Form 5'!H19<'Form 10A'!C1246,\"NO\",IF('Form 5'!H19>'Form 10A'!C1246,\"NO\")))","v":"YES"},null,null,{"$f":"IF('Form 5'!K19=F166,\"YES\",IF('Form 5'!K19<'Form 10A'!F1246,\"NO\",IF('Form 5'!K19>'Form 10A'!F1246,\"NO\")))","v":"NO"},null,null,{"$f":"IF('Form 5'!N19=I166,\"YES\",IF('Form 5'!N19<'Form 10A'!I1246,\"NO\",IF('Form 5'!N19>'Form 10A'!I1246,\"NO\")))","v":"YES"},null,null,{"$f":"IF('Form 5'!Q19=L166,\"YES\",IF('Form 5'!Q19<'Form 10A'!L1246,\"NO\",IF('Form 5'!Q19>'Form 10A'!L1246,\"NO\")))","v":"YES"},null,null,{"$f":"IF('Form 5'!T19=O166,\"YES\",IF('Form 5'!T19<'Form 10A'!O1246,\"NO\",IF('Form 5'!T19>'Form 10A'!O1246,\"NO\")))","v":"YES"},null,null,{"$f":"IF('Form 5'!W19=R166,\"YES\",IF('Form 5'!W19<'Form 10A'!R1246,\"NO\",IF('Form 5'!W19>'Form 10A'!R1246,\"NO\")))","v":"YES"}]
[null,"Premium General Business Agree to Form 5",null,null,{"$f":"IF('Form 5'!H31=C167,\"YES\",IF('Form 5'!H31<'Form 10A'!C1248,\"NO\",IF('Form 5'!H31>'Form 10A'!C1248,\"NO\")))","v":"NO"},null,null,{"$f":"IF('Form 5'!K31=F167,\"YES\",IF('Form 5'!K31<'Form 10A'!F1248,\"NO\",IF('Form 5'!K31>'Form 10A'!F1248,\"NO\")))","v":"NO"},null,null,{"$f":"IF('Form 5'!N31=I167,\"YES\",IF('Form 5'!N31<'Form 10A'!I1248,\"NO\",IF('Form 5'!N31>'Form 10A'!I1248,\"NO\")))","v":"YES"},null,null,{"$f":"IF('Form 5'!Q31=L167,\"YES\",IF('Form 5'!Q31<'Form 10A'!L1248,\"NO\",IF('Form 5'!Q31>'Form 10A'!L1248,\"NO\")))","v":"YES"},null,null,{"$f":"IF('Form 5'!T31=O167,\"YES\",IF('Form 5'!T31<'Form 10A'!O1248,\"NO\",IF('Form 5'!T31>'Form 10A'!O1248,\"NO\")))","v":"YES"},null,null,{"$f":"IF('Form 5'!W31=R167,\"YES\",IF('Form 5'!W31<'Form 10A'!R1248,\"NO\",IF('Form 5'!W31>'Form 10A'!R1248,\"NO\")))","v":"YES"}]
[]
[]
[null,"TOTALS","Appointment 1",null,null,"Appointment 2",null,null,"Appointment 3",null,null,"Appointment 4",null,null,"Appointment 5",null,null,"Appointment 6",null,null,"Total"]
[null,null,"Premiums","Commission","Risk Transfer","Premiums","Commission","Risk Transfer","Premiums","Commission","Risk Transfer","Premiums","Commission","Risk Transfer","Premiums","Commission","Risk Transfer","Premiums","Commission","Risk Transfer","Premiums","Commission","Risk Transfer"]
[null,null,"EUR","EUR","NO","EUR","EUR","NO","EUR","EUR","NO","EUR","EUR","NO","EUR","EUR","NO","EUR","EUR","NO","EUR","EUR","NO"]
[null,"Long Term Business Totals",{"$f":"C37+C71+C105+C140","v":0},{"$f":"D37+D71+D105+D140","v":0},{"$f":"SUMIF(E32:E36,\"NO\",C32:C36)+SUMIF(E66:E70,\"NO\",C66:C70)+SUMIF(E100:E104,\"NO\",C100:C104)+SUMIF(E135:E139,\"N0\",C135:C139)","v":0},{"$f":"F37+F71+F105+F140","v":0},{"$f":"G37+G71+G105+G140","v":0},{"$f":"SUMIF(H32:H36,\"NO\",F32:F36)+SUMIF(H66:H70,\"NO\",F66:F70)+SUMIF(H100:H104,\"NO\",F100:F104)+SUMIF(H135:H139,\"N0\",F135:F139)","v":0},{"$f":"I37+I71+I105+I140","v":0},{"$f":"J37+J71+J105+J140","v":0},{"$f":"SUMIF(K32:K36,\"NO\",I32:I36)+SUMIF(K66:K70,\"NO\",I66:I70)+SUMIF(K100:K104,\"NO\",I100:I104)+SUMIF(K135:K139,\"N0\",I135:I139)","v":0},{"$f":"L37+L71+L105+L140","v":0},{"$f":"M37+M71+M105+M140","v":0},{"$f":"SUMIF(N32:N36,\"NO\",L32:L36)+SUMIF(N66:N70,\"NO\",L66:L70)+SUMIF(N100:N104,\"NO\",L100:L104)+SUMIF(N135:N139,\"N0\",L135:L139)","v":0},{"$f":"O37+O71+O105+O140","v":0},{"$f":"P37+P71+P105+P140","v":0},{"$f":"SUMIF(Q32:Q36,\"NO\",O32:O36)+SUMIF(Q66:Q70,\"NO\",O66:O70)+SUMIF(Q100:Q104,\"NO\",O100:O104)+SUMIF(Q135:Q139,\"N0\",O135:O139)","v":0},{"$f":"R37+R71+R105+R140","v":0},{"$f":"S37+S71+S105+S140","v":0},{"$f":"SUMIF(T32:T36,\"NO\",R32:R36)+SUMIF(T66:T70,\"NO\",R66:R70)+SUMIF(T100:T104,\"NO\",R100:R104)+SUMIF(T135:T139,\"N0\",R135:R139)","v":0},{"$f":"U37+U71+U105+U140","v":0},{"$f":"V37+V71+V105+V140","v":0},{"$f":"W37+W71+W105+W140","v":0}]
[null,"General Business Totals",{"$f":"C53+C87+C122+C156","v":0},{"$f":"D53+D87+D122+D156","v":0},{"$f":"SUMIF(E45:E52,\"NO\", C45:C52)+SUMIF(E79:E86,\"NO\", C79:C86)+SUMIF(E114:E121,\"NO\", C114:C121)+SUMIF(E148:E155,\"NO\", C148:C155)","v":0},{"$f":"F53+F87+F122+F156","v":0},{"$f":"G53+G87+G122+G156","v":0},{"$f":"SUMIF(H45:H52,\"NO\", F45:F52)+SUMIF(H79:H86,\"NO\", F79:F86)+SUMIF(H114:H121,\"NO\", F114:F121)+SUMIF(H148:H155,\"NO\", F148:F155)","v":0},{"$f":"I53+I87+I122+I156","v":0},{"$f":"J53+J87+J122+J156","v":0},{"$f":"SUMIF(K45:K52,\"NO\", I45:I52)+SUMIF(K79:K86,\"NO\", I79:I86)+SUMIF(K114:K121,\"NO\", I114:I121)+SUMIF(K148:K155,\"NO\", I148:I155)","v":0},{"$f":"L53+L87+L122+L156","v":0},{"$f":"M53+M87+M122+M156","v":0},{"$f":"SUMIF(N45:N52,\"NO\", L45:L52)+SUMIF(N79:N86,\"NO\", L79:L86)+SUMIF(N114:N121,\"NO\", L114:L121)+SUMIF(N148:N155,\"NO\", L148:L155)","v":0},{"$f":"O53+O87+O122+O156","v":0},{"$f":"P53+P87+P122+P156","v":0},{"$f":"SUMIF(Q45:Q52,\"NO\", O45:O52)+SUMIF(Q79:Q86,\"NO\", O79:O86)+SUMIF(Q114:Q121,\"NO\", O114:O121)+SUMIF(Q148:Q155,\"NO\", O148:O155)","v":0},{"$f":"R53+R87+R122+R156","v":0},{"$f":"S53+S87+S122+S156","v":0},{"$f":"SUMIF(T45:T52,\"NO\", R45:R52)+SUMIF(T79:T86,\"NO\", R79:R86)+SUMIF(T114:T121,\"NO\", R114:R121)+SUMIF(T148:T155,\"NO\", R148:R155)","v":0},{"$f":"U53+U87+U122+U156","v":{"$error":"#VALUE!"}},{"$f":"V53+V87+V122+V156","v":{"$error":"#VALUE!"}},{"$f":"W53+W87+W122+W156","v":0}]
[null,"Total Long Term Business + General Business",{"$f":"C166+C167","v":0},{"$f":"D166+D167","v":0},{"$f":"E166+E167","v":0},0,null,0,0,null,{"$f":"K166+K167","v":0},0,null,0,0,null,0,0,null,0,{"$f":"U166+U167","v":{"$error":"#VALUE!"}},{"$f":"V166+V167","v":{"$error":"#VALUE!"}},{"$f":"W166+W167","v":0}]
[]
[]
[]
[null,"Computed Own Funds ",null,null,{"$f":"W168*4%","v":0}]
[null,"Required Own Funds for Agent /Manager",null,null,{"$f":"IF(E172>58250,E172,58250)","v":58250}]
[null,"Required Own Funds for Manager ",null,null,{"$f":"IF(E172>16803,E172,16803)","v":16803}]
[]
[]
[null,"Check that the Risk Transfer for all individual Appointments =  Total Risk Transfer",null,null,{"$f":"IF(SUM(E168+H168+K168+N168+Q168+T168)=W168,\"AGREE\",\"DO NOT AGREE\")","v":"AGREE"}]

{"sheet":"Form 10C","index":21,"n_rows":46,"n_cols":21,"rows_kept":46,"cut":false,"hidden":false,"merged":[[5,0,5,9],[7,0,9,0],[7,1,9,1],[7,7,7,9],[7,18,7,20],[8,14,9,14],[8,16,9,16]]}
[]
["Name of Insurance Intermediary",null,{"$f":"'Cover Sheet'!E17","v":0},null,null,null,"Year ended : ",{"$f":"IF('Cover Sheet'!$E$23=\"\",\"\",'Cover Sheet'!$E$23)","v":""}]
[]
["Form 10C"]
["Spread of Business by Jurisdiction of Enrolled Insurance Brokers "]
[]
["Details in respect of amount of premiums and number of policies placed in each jurisdiction",null,null,null,null,null,null,null,null,null,null,null,null,13,14,15,16,17,18,19,20]
["Jurisdiction","Freedom of Services (FOS) or Freedom of Establishment (FOE)","I","II","III","IV",null,"Total Long Term Business",null,null,1,2,3,4,5,6,7,8,"Total General Business"]
[null,null," Life and Annuity"," Marriage and Birth"," Linked Long Term "," Permanent Health"," Other Classes","Premiums","Percentage","No of "," Accident & Health","Motor"," Marine & Transport","Aviation"," Fire & Other Damage to Property","Liability"," Credit and Suretyship","General","Premiums","Percentage","No of "]
[null,null,null,null,null,null,null,"EUR","%","Policies",null,null,null,null,null,null,null,null,"EUR","%","Policies"]
["Malta",null,null,null,null,null,null,{"$f":"SUM(C11:G11)","v":0},{"$f":"H11/('Form 5'!$H$19+'Form 5'!$H$31)","v":0},null,null,null,null,null,null,null,null,null,{"$f":"SUM(K11:R11)","v":0},{"$f":"S11/('Form 5'!$H$19+'Form 5'!$H$31)","v":0}]
["Austria",null,null,null,null,null,null,0,{"$f":"H12/('Form 5'!$H$19+'Form 5'!$H$31)","v":0},null,null,null,null,null,null,null,null,null,{"$f":"SUM(K12:R12)","v":0},{"$f":"S12/('Form 5'!$H$19+'Form 5'!$H$31)","v":0}]
["Belgium",null,null,null,null,null,null,0,{"$f":"H13/('Form 5'!$H$19+'Form 5'!$H$31)","v":0},null,null,null,null,null,null,null,null,null,0,{"$f":"S13/('Form 5'!$H$19+'Form 5'!$H$31)","v":0}]
["Bulgaria",null,null,null,null,null,null,0,{"$f":"H14/('Form 5'!$H$19+'Form 5'!$H$31)","v":0},null,null,null,null,null,null,null,null,null,0,{"$f":"S14/('Form 5'!$H$19+'Form 5'!$H$31)","v":0}]
["Croatia",null,null,null,null,null,null,0,{"$f":"H15/('Form 5'!$H$19+'Form 5'!$H$31)","v":0},null,null,null,null,null,null,null,null,null,0,{"$f":"S15/('Form 5'!$H$19+'Form 5'!$H$31)","v":0}]
["Cyprus",null,null,null,null,null,null,0,{"$f":"H16/('Form 5'!$H$19+'Form 5'!$H$31)","v":0},null,null,null,null,null,null,null,null,null,0,{"$f":"S16/('Form 5'!$H$19+'Form 5'!$H$31)","v":0}]
["Czech Republic",null,null,null,null,null,null,0,{"$f":"H17/('Form 5'!$H$19+'Form 5'!$H$31)","v":0},null,null,null,null,null,null,null,null,null,0,{"$f":"S17/('Form 5'!$H$19+'Form 5'!$H$31)","v":0}]
["Denmark",null,null,null,null,null,null,0,{"$f":"H18/('Form 5'!$H$19+'Form 5'!$H$31)","v":0},null,null,null,null,null,null,null,null,null,0,{"$f":"S18/('Form 5'!$H$19+'Form 5'!$H$31)","v":0}]
["Estonia",null,null,null,null,null,null,0,{"$f":"H19/('Form 5'!$H$19+'Form 5'!$H$31)","v":0},null,null,null,null,null,null,null,null,null,0,{"$f":"S19/('Form 5'!$H$19+'Form 5'!$H$31)","v":0}]
["Finland",null,null,null,null,null,null,0,{"$f":"H20/('Form 5'!$H$19+'Form 5'!$H$31)","v":0},null,null,null,null,null,null,null,null,null,0,{"$f":"S20/('Form 5'!$H$19+'Form 5'!$H$31)","v":0}]
["France",null,null,null,null,null,null,0,{"$f":"H21/('Form 5'!$H$19+'Form 5'!$H$31)","v":0},null,null,null,null,null,null,null,null,null,0,{"$f":"S21/('Form 5'!$H$19+'Form 5'!$H$31)","v":0}]
["Germany",null,null,null,null,null,null,0,{"$f":"H22/('Form 5'!$H$19+'Form 5'!$H$31)","v":0},null,null,null,null,null,null,null,null,null,0,{"$f":"S22/('Form 5'!$H$19+'Form 5'!$H$31)","v":0}]
["Greece",null,null,null,null,null,null,0,{"$f":"H23/('Form 5'!$H$19+'Form 5'!$H$31)","v":0},null,null,null,null,null,null,null,null,null,0,{"$f":"S23/('Form 5'!$H$19+'Form 5'!$H$31)","v":0}]
["Hungary",null,null,null,null,null,null,0,{"$f":"H24/('Form 5'!$H$19+'Form 5'!$H$31)","v":0},null,null,null,null,null,null,null,null,null,0,{"$f":"S24/('Form 5'!$H$19+'Form 5'!$H$31)","v":0}]
["Ireland",null,null,null,null,null,null,0,{"$f":"H25/('Form 5'!$H$19+'Form 5'!$H$31)","v":0},null,null,null,null,null,null,null,null,null,0,{"$f":"S25/('Form 5'!$H$19+'Form 5'!$H$31)","v":0}]
["Italy",null,null,null,null,null,null,0,{"$f":"H26/('Form 5'!$H$19+'Form 5'!$H$31)","v":0},null,null,null,null,null,null,null,null,null,0,{"$f":"S26/('Form 5'!$H$19+'Form 5'!$H$31)","v":0}]
["Latvia",null,null,null,null,null,null,0,{"$f":"H27/('Form 5'!$H$19+'Form 5'!$H$31)","v":0},null,null,null,null,null,null,null,null,null,0,{"$f":"S27/('Form 5'!$H$19+'Form 5'!$H$31)","v":0}]
["Lithuania",null,null,null,null,null,null,0,{"$f":"H28/('Form 5'!$H$19+'Form 5'!$H$31)","v":0},null,null,null,null,null,null,null,null,null,0,{"$f":"S28/('Form 5'!$H$19+'Form 5'!$H$31)","v":0}]
["Luxembourg",null,null,null,null,null,null,0,{"$f":"H29/('Form 5'!$H$19+'Form 5'!$H$31)","v":0},null,null,null,null,null,null,null,null,null,0,{"$f":"S29/('Form 5'!$H$19+'Form 5'!$H$31)","v":0}]
["Netherlands",null,null,null,null,null,null,0,{"$f":"H30/('Form 5'!$H$19+'Form 5'!$H$31)","v":0},null,null,null,null,null,null,null,null,null,0,{"$f":"S30/('Form 5'!$H$19+'Form 5'!$H$31)","v":0}]
["Poland",null,null,null,null,null,null,0,{"$f":"H31/('Form 5'!$H$19+'Form 5'!$H$31)","v":0},null,null,null,null,null,null,null,null,null,0,{"$f":"S31/('Form 5'!$H$19+'Form 5'!$H$31)","v":0}]
["Portugal",null,null,null,null,null,null,0,{"$f":"H32/('Form 5'!$H$19+'Form 5'!$H$31)","v":0},null,null,null,null,null,null,null,null,null,0,{"$f":"S32/('Form 5'!$H$19+'Form 5'!$H$31)","v":0}]
["Romania",null,null,null,null,null,null,0,{"$f":"H33/('Form 5'!$H$19+'Form 5'!$H$31)","v":0},null,null,null,null,null,null,null,null,null,0,{"$f":"S33/('Form 5'!$H$19+'Form 5'!$H$31)","v":0}]
["Slovakia",null,null,null,null,null,null,0,{"$f":"H34/('Form 5'!$H$19+'Form 5'!$H$31)","v":0},null,null,null,null,null,null,null,null,null,0,{"$f":"S34/('Form 5'!$H$19+'Form 5'!$H$31)","v":0}]
["Slovenia",null,null,null,null,null,null,0,{"$f":"H35/('Form 5'!$H$19+'Form 5'!$H$31)","v":0},null,null,null,null,null,null,null,null,null,0,{"$f":"S35/('Form 5'!$H$19+'Form 5'!$H$31)","v":0}]
["Spain",null,null,null,null,null,null,0,{"$f":"H36/('Form 5'!$H$19+'Form 5'!$H$31)","v":0},null,null,null,null,null,null,null,null,null,0,{"$f":"S36/('Form 5'!$H$19+'Form 5'!$H$31)","v":0}]
["Sweden",null,null,null,null,null,null,0,{"$f":"H37/('Form 5'!$H$19+'Form 5'!$H$31)","v":0},null,null,null,null,null,null,null,null,null,0,{"$f":"S37/('Form 5'!$H$19+'Form 5'!$H$31)","v":0}]
["United Kingdom",null,null,null,null,null,null,0,{"$f":"H38/('Form 5'!$H$19+'Form 5'!$H$31)","v":0},null,null,null,null,null,null,null,null,null,0,{"$f":"S38/('Form 5'!$H$19+'Form 5'!$H$31)","v":0}]
["Iceland",null,null,null,null,null,null,0,{"$f":"H39/('Form 5'!$H$19+'Form 5'!$H$31)","v":0},null,null,null,null,null,null,null,null,null,0,{"$f":"S39/('Form 5'!$H$19+'Form 5'!$H$31)","v":0}]
["Norway",null,null,null,null,null,null,0,{"$f":"H40/('Form 5'!$H$19+'Form 5'!$H$31)","v":0},null,null,null,null,null,null,null,null,null,0,{"$f":"S40/('Form 5'!$H$19+'Form 5'!$H$31)","v":0}]
["Non-EU/EEA ",null,null,null,null,null,null,0,{"$f":"H41/('Form 5'!$H$19+'Form 5'!$H$31)","v":0},null,null,null,null,null,null,null,null,null,0,{"$f":"S41/('Form 5'!$H$19+'Form 5'!$H$31)","v":0}]
["Total",null,{"$f":"SUM(C11:C41)","v":0},{"$f":"SUM(D11:D41)","v":0},0,0,0,0,null,{"$f":"SUM(J11:J41)","v":0},0,0,0,0,0,0,0,0,0,null,{"$f":"SUM(U11:U41)","v":0}]
[]
["Please specify the Non-EU/EEA countries in the box below:"]
[]
["Jurisdiction","Class","Premium"]

{"sheet":"F10C","index":22,"n_rows":621,"n_cols":6,"rows_kept":621,"cut":false,"hidden":true,"merged":[]}
["SheetCode","FieldCode","FICode","Date","ColNum","Value"]
["F10C",101,{"$f":"'Cover Sheet'!$E$19","v":0},{"$f":"'Cover Sheet'!$E$23","v":"00:00:00"},1,{"$f":"'Form 10C'!B11","v":0}]
["F10C",102,{"$f":"'Cover Sheet'!$E$19","v":0},{"$f":"'Cover Sheet'!$E$23","v":"00:00:00"},1,{"$f":"'Form 10C'!B12","v":0}]
["F10C",103,{"$f":"'Cover Sheet'!$E$19","v":0},{"$f":"'Cover Sheet'!$E$23","v":"00:00:00"},1,{"$f":"'Form 10C'!B13","v":0}]
["F10C",104,{"$f":"'Cover Sheet'!$E$19","v":0},{"$f":"'Cover Sheet'!$E$23","v":"00:00:00"},1,{"$f":"'Form 10C'!B14","v":0}]
["F10C",105,{"$f":"'Cover Sheet'!$E$19","v":0},{"$f":"'Cover Sheet'!$E$23","v":"00:00:00"},1,{"$f":"'Form 10C'!B15","v":0}]
["F10C",106,{"$f":"'Cover Sheet'!$E$19","v":0},{"$f":"'Cover Sheet'!$E$23","v":"00:00:00"},1,{"$f":"'Form 10C'!B16","v":0}]
["F10C",107,{"$f":"'Cover Sheet'!$E$19","v":0},{"$f":"'Cover Sheet'!$E$23","v":"00:00:00"},1,{"$f":"'Form 10C'!B17","v":0}]
["F10C",108,{"$f":"'Cover Sheet'!$E$19","v":0},{"$f":"'Cover Sheet'!$E$23","v":"00:00:00"},1,{"$f":"'Form 10C'!B18","v":0}]
["F10C",109,{"$f":"'Cover Sheet'!$E$19","v":0},{"$f":"'Cover Sheet'!$E$23","v":"00:00:00"},1,{"$f":"'Form 10C'!B19","v":0}]
["F10C",110,{"$f":"'Cover Sheet'!$E$19","v":0},{"$f":"'Cover Sheet'!$E$23","v":"00:00:00"},1,{"$f":"'Form 10C'!B20","v":0}]
["F10C",111,{"$f":"'Cover Sheet'!$E$19","v":0},{"$f":"'Cover Sheet'!$E$23","v":"00:00:00"},1,{"$f":"'Form 10C'!B21","v":0}]
["F10C",112,{"$f":"'Cover Sheet'!$E$19","v":0},{"$f":"'Cover Sheet'!$E$23","v":"00:00:00"},1,{"$f":"'Form 10C'!B22","v":0}]
["F10C",113,{"$f":"'Cover Sheet'!$E$19","v":0},{"$f":"'Cover Sheet'!$E$23","v":"00:00:00"},1,{"$f":"'Form 10C'!B23","v":0}]
["F10C",114,{"$f":"'Cover Sheet'!$E$19","v":0},{"$f":"'Cover Sheet'!$E$23","v":"00:00:00"},1,{"$f":"'Form 10C'!B24","v":0}]
["F10C",115,{"$f":"'Cover Sheet'!$E$19","v":0},{"$f":"'Cover Sheet'!$E$23","v":"00:00:00"},1,{"$f":"'Form 10C'!B25","v":0}]
["F10C",116,{"$f":"'Cover Sheet'!$E$19","v":0},{"$f":"'Cover Sheet'!$E$23","v":"00:00:00"},1,{"$f":"'Form 10C'!B26","v":0}]
["F10C",117,{"$f":"'Cover Sheet'!$E$19","v":0},{"$f":"'Cover Sheet'!$E$23","v":"00:00:00"},1,{"$f":"'Form 10C'!B27","v":0}]
["F10C",118,{"$f":"'Cover Sheet'!$E$19","v":0},{"$f":"'Cover Sheet'!$E$23","v":"00:00:00"},1,{"$f":"'Form 10C'!B28","v":0}]
["F10C",119,{"$f":"'Cover Sheet'!$E$19","v":0},{"$f":"'Cover Sheet'!$E$23","v":"00:00:00"},1,{"$f":"'Form 10C'!B29","v":0}]
["F10C",120,{"$f":"'Cover Sheet'!$E$19","v":0},{"$f":"'Cover Sheet'!$E$23","v":"00:00:00"},1,{"$f":"'Form 10C'!B30","v":0}]
["F10C",121,{"$f":"'Cover Sheet'!$E$19","v":0},{"$f":"'Cover Sheet'!$E$23","v":"00:00:00"},1,{"$f":"'Form 10C'!B31","v":0}]
["F10C",122,{"$f":"'Cover Sheet'!$E$19","v":0},{"$f":"'Cover Sheet'!$E$23","v":"00:00:00"},1,{"$f":"'Form 10C'!B32","v":0}]
["F10C",123,{"$f":"'Cover Sheet'!$E$19","v":0},{"$f":"'Cover Sheet'!$E$23","v":"00:00:00"},1,{"$f":"'Form 10C'!B33","v":0}]
["F10C",124,{"$f":"'Cover Sheet'!$E$19","v":0},{"$f":"'Cover Sheet'!$E$23","v":"00:00:00"},1,{"$f":"'Form 10C'!B34","v":0}]
["F10C",125,{"$f":"'Cover Sheet'!$E$19","v":0},{"$f":"'Cover Sheet'!$E$23","v":"00:00:00"},1,{"$f":"'Form 10C'!B35","v":0}]
["F10C",126,{"$f":"'Cover Sheet'!$E$19","v":0},{"$f":"'Cover Sheet'!$E$23","v":"00:00:00"},1,{"$f":"'Form 10C'!B36","v":0}]
["F10C",127,{"$f":"'Cover Sheet'!$E$19","v":0},{"$f":"'Cover Sheet'!$E$23","v":"00:00:00"},1,{"$f":"'Form 10C'!B37","v":0}]
["F10C",128,{"$f":"'Cover Sheet'!$E$19","v":0},{"$f":"'Cover Sheet'!$E$23","v":"00:00:00"},1,{"$f":"'Form 10C'!B38","v":0}]
["F10C",129,{"$f":"'Cover Sheet'!$E$19","v":0},{"$f":"'Cover Sheet'!$E$23","v":"00:00:00"},1,{"$f":"'Form 10C'!B39","v":0}]
["F10C",130,{"$f":"'Cover Sheet'!$E$19","v":0},{"$f":"'Cover Sheet'!$E$23","v":"00:00:00"},1,{"$f":"'Form 10C'!B40","v":0}]
["F10C",131,{"$f":"'Cover Sheet'!$E$19","v":0},{"$f":"'Cover Sheet'!$E$23","v":"00:00:00"},1,{"$f":"'Form 10C'!B41","v":0}]
["F10C",101,{"$f":"'Cover Sheet'!$E$19","v":0},{"$f":"'Cover Sheet'!$E$23","v":"00:00:00"},2,{"$f":"'Form 10C'!C11/'Cover Sheet'!$E$27","v":{"$error":"#DIV/0!"}}]
["F10C",102,{"$f":"'Cover Sheet'!$E$19","v":0},{"$f":"'Cover Sheet'!$E$23","v":"00:00:00"},2,{"$f":"'Form 10C'!C12/'Cover Sheet'!$E$27","v":{"$error":"#DIV/0!"}}]
["F10C",103,{"$f":"'Cover Sheet'!$E$19","v":0},{"$f":"'Cover Sheet'!$E$23","v":"00:00:00"},2,{"$f":"'Form 10C'!C13/'Cover Sheet'!$E$27","v":{"$error":"#DIV/0!"}}]
["F10C",104,{"$f":"'Cover Sheet'!$E$19","v":0},{"$f":"'Cover Sheet'!$E$23","v":"00:00:00"},2,{"$f":"'Form 10C'!C14/'Cover Sheet'!$E$27","v":{"$error":"#DIV/0!"}}]
["F10C",105,{"$f":"'Cover Sheet'!$E$19","v":0},{"$f":"'Cover Sheet'!$E$23","v":"00:00:00"},2,{"$f":"'Form 10C'!C15/'Cover Sheet'!$E$27","v":{"$error":"#DIV/0!"}}]
["F10C",106,{"$f":"'Cover Sheet'!$E$19","v":0},{"$f":"'Cover Sheet'!$E$23","v":"00:00:00"},2,{"$f":"'Form 10C'!C16/'Cover Sheet'!$E$27","v":{"$error":"#DIV/0!"}}]
["F10C",107,{"$f":"'Cover Sheet'!$E$19","v":0},{"$f":"'Cover Sheet'!$E$23","v":"00:00:00"},2,{"$f":"'Form 10C'!C17/'Cover Sheet'!$E$27","v":{"$error":"#DIV/0!"}}]
["F10C",108,{"$f":"'Cover Sheet'!$E$19","v":0},{"$f":"'Cover Sheet'!$E$23","v":"00:00:00"},2,{"$f":"'Form 10C'!C18/'Cover Sheet'!$E$27","v":{"$error":"#DIV/0!"}}]
["F10C",109,{"$f":"'Cover Sheet'!$E$19","v":0},{"$f":"'Cover Sheet'!$E$23","v":"00:00:00"},2,{"$f":"'Form 10C'!C19/'Cover Sheet'!$E$27","v":{"$error":"#DIV/0!"}}]
["F10C",110,{"$f":"'Cover Sheet'!$E$19","v":0},{"$f":"'Cover Sheet'!$E$23","v":"00:00:00"},2,{"$f":"'Form 10C'!C20/'Cover Sheet'!$E$27","v":{"$error":"#DIV/0!"}}]
["F10C",111,{"$f":"'Cover Sheet'!$E$19","v":0},{"$f":"'Cover Sheet'!$E$23","v":"00:00:00"},2,{"$f":"'Form 10C'!C21/'Cover Sheet'!$E$27","v":{"$error":"#DIV/0!"}}]
["F10C",112,{"$f":"'Cover Sheet'!$E$19","v":0},{"$f":"'Cover Sheet'!$E$23","v":"00:00:00"},2,{"$f":"'Form 10C'!C22/'Cover Sheet'!$E$27","v":{"$error":"#DIV/0!"}}]
["F10C",113,{"$f":"'Cover Sheet'!$E$19","v":0},{"$f":"'Cover Sheet'!$E$23","v":"00:00:00"},2,{"$f":"'Form 10C'!C23/'Cover Sheet'!$E$27","v":{"$error":"#DIV/0!"}}]
["F10C",114,{"$f":"'Cover Sheet'!$E$19","v":0},{"$f":"'Cover Sheet'!$E$23","v":"00:00:00"},2,{"$f":"'Form 10C'!C24/'Cover Sheet'!$E$27","v":{"$error":"#DIV/0!"}}]
["F10C",115,{"$f":"'Cover Sheet'!$E$19","v":0},{"$f":"'Cover Sheet'!$E$23","v":"00:00:00"},2,{"$f":"'Form 10C'!C25/'Cover Sheet'!$E$27","v":{"$error":"#DIV/0!"}}]
["F10C",116,{"$f":"'Cover Sheet'!$E$19","v":0},{"$f":"'Cover Sheet'!$E$23","v":"00:00:00"},2,{"$f":"'Form 10C'!C26/'Cover Sheet'!$E$27","v":{"$error":"#DIV/0!"}}]
["F10C",117,{"$f":"'Cover Sheet'!$E$19","v":0},{"$f":"'Cover Sheet'!$E$23","v":"00:00:00"},2,{"$f":"'Form 10C'!C27/'Cover Sheet'!$E$27","v":{"$error":"#DIV/0!"}}]
["F10C",118,{"$f":"'Cover Sheet'!$E$19","v":0},{"$f":"'Cover Sheet'!$E$23","v":"00:00:00"},2,{"$f":"'Form 10C'!C28/'Cover Sheet'!$E$27","v":{"$error":"#DIV/0!"}}]
["F10C",119,{"$f":"'Cover Sheet'!$E$19","v":0},{"$f":"'Cover Sheet'!$E$23","v":"00:00:00"},2,{"$f":"'Form 10C'!C29/'Cover Sheet'!$E$27","v":{"$error":"#DIV/0!"}}]
["F10C",120,{"$f":"'Cover Sheet'!$E$19","v":0},{"$f":"'Cover Sheet'!$E$23","v":"00:00:00"},2,{"$f":"'Form 10C'!C30/'Cover Sheet'!$E$27","v":{"$error":"#DIV/0!"}}]
["F10C",121,{"$f":"'Cover Sheet'!$E$19","v":0},{"$f":"'Cover Sheet'!$E$23","v":"00:00:00"},2,{"$f":"'Form 10C'!C31/'Cover Sheet'!$E$27","v":{"$error":"#DIV/0!"}}]
["F10C",122,{"$f":"'Cover Sheet'!$E$19","v":0},{"$f":"'Cover Sheet'!$E$23","v":"00:00:00"},2,{"$f":"'Form 10C'!C32/'Cover Sheet'!$E$27","v":{"$error":"#DIV/0!"}}]
["F10C",123,{"$f":"'Cover Sheet'!$E$19","v":0},{"$f":"'Cover Sheet'!$E$23","v":"00:00:00"},2,{"$f":"'Form 10C'!C33/'Cover Sheet'!$E$27","v":{"$error":"#DIV/0!"}}]
["F10C",124,{"$f":"'Cover Sheet'!$E$19","v":0},{"$f":"'Cover Sheet'!$E$23","v":"00:00:00"},2,{"$f":"'Form 10C'!C34/'Cover Sheet'!$E$27","v":{"$error":"#DIV/0!"}}]
["F10C",125,{"$f":"'Cover Sheet'!$E$19","v":0},{"$f":"'Cover Sheet'!$E$23","v":"00:00:00"},2,{"$f":"'Form 10C'!C35/'Cover Sheet'!$E$27","v":{"$error":"#DIV/0!"}}]
["F10C",126,{"$f":"'Cover Sheet'!$E$19","v":0},{"$f":"'Cover Sheet'!$E$23","v":"00:00:00"},2,{"$f":"'Form 10C'!C36/'Cover Sheet'!$E$27","v":{"$error":"#DIV/0!"}}]
["F10C",127,{"$f":"'Cover Sheet'!$E$19","v":0},{"$f":"'Cover Sheet'!$E$23","v":"00:00:00"},2,{"$f":"'Form 10C'!C37/'Cover Sheet'!$E$27","v":{"$error":"#DIV/0!"}}]
["F10C",128,{"$f":"'Cover Sheet'!$E$19","v":0},{"$f":"'Cover Sheet'!$E$23","v":"00:00:00"},2,{"$f":"'Form 10C'!C38/'Cover Sheet'!$E$27","v":{"$error":"#DIV/0!"}}]
["F10C",129,{"$f":"'Cover Sheet'!$E$19","v":0},{"$f":"'Cover Sheet'!$E$23","v":"00:00:00"},2,{"$f":"'Form 10C'!C39/'Cover Sheet'!$E$27","v":{"$error":"#DIV/0!"}}]
["F10C",130,{"$f":"'Cover Sheet'!$E$19","v":0},{"$f":"'Cover Sheet'!$E$23","v":"00:00:00"},2,{"$f":"'Form 10C'!C40/'Cover Sheet'!$E$27","v":{"$error":"#DIV/0!"}}]
["F10C",131,{"$f":"'Cover Sheet'!$E$19","v":0},{"$f":"'Cover Sheet'!$E$23","v":"00:00:00"},2,{"$f":"'Form 10C'!C41/'Cover Sheet'!$E$27","v":{"$error":"#DIV/0!"}}]
["F10C",101,{"$f":"'Cover Sheet'!$E$19","v":0},{"$f":"'Cover Sheet'!$E$23","v":"00:00:00"},3,{"$f":"'Form 10C'!D11/'Cover Sheet'!$E$27","v":{"$error":"#DIV/0!"}}]
["F10C",102,{"$f":"'Cover Sheet'!$E$19","v":0},{"$f":"'Cover Sheet'!$E$23","v":"00:00:00"},3,{"$f":"'Form 10C'!D12/'Cover Sheet'!$E$27","v":{"$error":"#DIV/0!"}}]
["F10C",103,{"$f":"'Cover Sheet'!$E$19","v":0},{"$f":"'Cover Sheet'!$E$23","v":"00:00:00"},3,{"$f":"'Form 10C'!D13/'Cover Sheet'!$E$27","v":{"$error":"#DIV/0!"}}]
["F10C",104,{"$f":"'Cover Sheet'!$E$19","v":0},{"$f":"'Cover Sheet'!$E$23","v":"00:00:00"},3,{"$f":"'Form 10C'!D14/'Cover Sheet'!$E$27","v":{"$error":"#DIV/0!"}}]
["F10C",105,{"$f":"'Cover Sheet'!$E$19","v":0},{"$f":"'Cover Sheet'!$E$23","v":"00:00:00"},3,{"$f":"'Form 10C'!D15/'Cover Sheet'!$E$27","v":{"$error":"#DIV/0!"}}]
["F10C",106,{"$f":"'Cover Sheet'!$E$19","v":0},{"$f":"'Cover Sheet'!$E$23","v":"00:00:00"},3,{"$f":"'Form 10C'!D16/'Cover Sheet'!$E$27","v":{"$error":"#DIV/0!"}}]
["F10C",107,{"$f":"'Cover Sheet'!$E$19","v":0},{"$f":"'Cover Sheet'!$E$23","v":"00:00:00"},3,{"$f":"'Form 10C'!D17/'Cover Sheet'!$E$27","v":{"$error":"#DIV/0!"}}]
["F10C",108,{"$f":"'Cover Sheet'!$E$19","v":0},{"$f":"'Cover Sheet'!$E$23","v":"00:00:00"},3,{"$f":"'Form 10C'!D18/'Cover Sheet'!$E$27","v":{"$error":"#DIV/0!"}}]
["F10C",109,{"$f":"'Cover Sheet'!$E$19","v":0},{"$f":"'Cover Sheet'!$E$23","v":"00:00:00"},3,{"$f":"'Form 10C'!D19/'Cover Sheet'!$E$27","v":{"$error":"#DIV/0!"}}]
["F10C",110,{"$f":"'Cover Sheet'!$E$19","v":0},{"$f":"'Cover Sheet'!$E$23","v":"00:00:00"},3,{"$f":"'Form 10C'!D20/'Cover Sheet'!$E$27","v":{"$error":"#DIV/0!"}}]
["F10C",111,{"$f":"'Cover Sheet'!$E$19","v":0},{"$f":"'Cover Sheet'!$E$23","v":"00:00:00"},3,{"$f":"'Form 10C'!D21/'Cover Sheet'!$E$27","v":{"$error":"#DIV/0!"}}]
["F10C",112,{"$f":"'Cover Sheet'!$E$19","v":0},{"$f":"'Cover Sheet'!$E$23","v":"00:00:00"},3,{"$f":"'Form 10C'!D22/'Cover Sheet'!$E$27","v":{"$error":"#DIV/0!"}}]
["F10C",113,{"$f":"'Cover Sheet'!$E$19","v":0},{"$f":"'Cover Sheet'!$E$23","v":"00:00:00"},3,{"$f":"'Form 10C'!D23/'Cover Sheet'!$E$27","v":{"$error":"#DIV/0!"}}]
["F10C",114,{"$f":"'Cover Sheet'!$E$19","v":0},{"$f":"'Cover Sheet'!$E$23","v":"00:00:00"},3,{"$f":"'Form 10C'!D24/'Cover Sheet'!$E$27","v":{"$error":"#DIV/0!"}}]
["F10C",115,{"$f":"'Cover Sheet'!$E$19","v":0},{"$f":"'Cover Sheet'!$E$23","v":"00:00:00"},3,{"$f":"'Form 10C'!D25/'Cover Sheet'!$E$27","v":{"$error":"#DIV/0!"}}]
["F10C",116,{"$f":"'Cover Sheet'!$E$19","v":0},{"$f":"'Cover Sheet'!$E$23","v":"00:00:00"},3,{"$f":"'Form 10C'!D26/'Cover Sheet'!$E$27","v":{"$error":"#DIV/0!"}}]
["F10C",117,{"$f":"'Cover Sheet'!$E$19","v":0},{"$f":"'Cover Sheet'!$E$23","v":"00:00:00"},3,{"$f":"'Form 10C'!D27/'Cover Sheet'!$E$27","v":{"$error":"#DIV/0!"}}]
["F10C",118,{"$f":"'Cover Sheet'!$E$19","v":0},{"$f":"'Cover Sheet'!$E$23","v":"00:00:00"},3,{"$f":"'Form 10C'!D28/'Cover Sheet'!$E$27","v":{"$error":"#DIV/0!"}}]
["F10C",119,{"$f":"'Cover Sheet'!$E$19","v":0},{"$f":"'Cover Sheet'!$E$23","v":"00:00:00"},3,{"$f":"'Form 10C'!D29/'Cover Sheet'!$E$27","v":{"$error":"#DIV/0!"}}]
["F10C",120,{"$f":"'Cover Sheet'!$E$19","v":0},{"$f":"'Cover Sheet'!$E$23","v":"00:00:00"},3,{"$f":"'Form 10C'!D30/'Cover Sheet'!$E$27","v":{"$error":"#DIV/0!"}}]
["F10C",121,{"$f":"'Cover Sheet'!$E$19","v":0},{"$f":"'Cover Sheet'!$E$23","v":"00:00:00"},3,{"$f":"'Form 10C'!D31/'Cover Sheet'!$E$27","v":{"$error":"#DIV/0!"}}]
["F10C",122,{"$f":"'Cover Sheet'!$E$19","v":0},{"$f":"'Cover Sheet'!$E$23","v":"00:00:00"},3,{"$f":"'Form 10C'!D32/'Cover Sheet'!$E$27","v":{"$error":"#DIV/0!"}}]
["F10C",123,{"$f":"'Cover Sheet'!$E$19","v":0},{"$f":"'Cover Sheet'!$E$23","v":"00:00:00"},3,{"$f":"'Form 10C'!D33/'Cover Sheet'!$E$27","v":{"$error":"#DIV/0!"}}]
["F10C",124,{"$f":"'Cover Sheet'!$E$19","v":0},{"$f":"'Cover Sheet'!$E$23","v":"00:00:00"},3,{"$f":"'Form 10C'!D34/'Cover Sheet'!$E$27","v":{"$error":"#DIV/0!"}}]
["F10C",125,{"$f":"'Cover Sheet'!$E$19","v":0},{"$f":"'Cover Sheet'!$E$23","v":"00:00:00"},3,{"$f":"'Form 10C'!D35/'Cover Sheet'!$E$27","v":{"$error":"#DIV/0!"}}]
["F10C",126,{"$f":"'Cover Sheet'!$E$19","v":0},{"$f":"'Cover Sheet'!$E$23","v":"00:00:00"},3,{"$f":"'Form 10C'!D36/'Cover Sheet'!$E$27","v":{"$error":"#DIV/0!"}}]
["F10C",127,{"$f":"'Cover Sheet'!$E$19","v":0},{"$f":"'Cover Sheet'!$E$23","v":"00:00:00"},3,{"$f":"'Form 10C'!D37/'Cover Sheet'!$E$27","v":{"$error":"#DIV/0!"}}]
["F10C",128,{"$f":"'Cover Sheet'!$E$19","v":0},{"$f":"'Cover Sheet'!$E$23","v":"00:00:00"},3,{"$f":"'Form 10C'!D38/'Cover Sheet'!$E$27","v":{"$error":"#DIV/0!"}}]
["F10C",129,{"$f":"'Cover Sheet'!$E$19","v":0},{"$f":"'Cover Sheet'!$E$23","v":"00:00:00"},3,{"$f":"'Form 10C'!D39/'Cover Sheet'!$E$27","v":{"$error":"#DIV/0!"}}]
["F10C",130,{"$f":"'Cover Sheet'!$E$19","v":0},{"$f":"'Cover Sheet'!$E$23","v":"00:00:00"},3,{"$f":"'Form 10C'!D40/'Cover Sheet'!$E$27","v":{"$error":"#DIV/0!"}}]
["F10C",131,{"$f":"'Cover Sheet'!$E$19","v":0},{"$f":"'Cover Sheet'!$E$23","v":"00:00:00"},3,{"$f":"'Form 10C'!D41/'Cover Sheet'!$E$27","v":{"$error":"#DIV/0!"}}]
["F10C",101,{"$f":"'Cover Sheet'!$E$19","v":0},{"$f":"'Cover Sheet'!$E$23","v":"00:00:00"},4,{"$f":"'Form 10C'!E11/'Cover Sheet'!$E$27","v":{"$error":"#DIV/0!"}}]
["F10C",102,{"$f":"'Cover Sheet'!$E$19","v":0},{"$f":"'Cover Sheet'!$E$23","v":"00:00:00"},4,{"$f":"'Form 10C'!E12/'Cover Sheet'!$E$27","v":{"$error":"#DIV/0!"}}]
["F10C",103,{"$f":"'Cover Sheet'!$E$19","v":0},{"$f":"'Cover Sheet'!$E$23","v":"00:00:00"},4,{"$f":"'Form 10C'!E13/'Cover Sheet'!$E$27","v":{"$error":"#DIV/0!"}}]
["F10C",104,{"$f":"'Cover Sheet'!$E$19","v":0},{"$f":"'Cover Sheet'!$E$23","v":"00:00:00"},4,{"$f":"'Form 10C'!E14/'Cover Sheet'!$E$27","v":{"$error":"#DIV/0!"}}]
["F10C",105,{"$f":"'Cover Sheet'!$E$19","v":0},{"$f":"'Cover Sheet'!$E$23","v":"00:00:00"},4,{"$f":"'Form 10C'!E15/'Cover Sheet'!$E$27","v":{"$error":"#DIV/0!"}}]
["F10C",106,{"$f":"'Cover Sheet'!$E$19","v":0},{"$f":"'Cover Sheet'!$E$23","v":"00:00:00"},4,{"$f":"'Form 10C'!E16/'Cover Sheet'!$E$27","v":{"$error":"#DIV/0!"}}]
["F10C",107,{"$f":"'Cover Sheet'!$E$19","v":0},{"$f":"'Cover Sheet'!$E$23","v":"00:00:00"},4,{"$f":"'Form 10C'!E17/'Cover Sheet'!$E$27","v":{"$error":"#DIV/0!"}}]
["F10C",108,{"$f":"'Cover Sheet'!$E$19","v":0},{"$f":"'Cover Sheet'!$E$23","v":"00:00:00"},4,{"$f":"'Form 10C'!E18/'Cover Sheet'!$E$27","v":{"$error":"#DIV/0!"}}]
["F10C",109,{"$f":"'Cover Sheet'!$E$19","v":0},{"$f":"'Cover Sheet'!$E$23","v":"00:00:00"},4,{"$f":"'Form 10C'!E19/'Cover Sheet'!$E$27","v":{"$error":"#DIV/0!"}}]
["F10C",110,{"$f":"'Cover Sheet'!$E$19","v":0},{"$f":"'Cover Sheet'!$E$23","v":"00:00:00"},4,{"$f":"'Form 10C'!E20/'Cover Sheet'!$E$27","v":{"$error":"#DIV/0!"}}]
["F10C",111,{"$f":"'Cover Sheet'!$E$19","v":0},{"$f":"'Cover Sheet'!$E$23","v":"00:00:00"},4,{"$f":"'Form 10C'!E21/'Cover Sheet'!$E$27","v":{"$error":"#DIV/0!"}}]
["F10C",112,{"$f":"'Cover Sheet'!$E$19","v":0},{"$f":"'Cover Sheet'!$E$23","v":"00:00:00"},4,{"$f":"'Form 10C'!E22/'Cover Sheet'!$E$27","v":{"$error":"#DIV/0!"}}]
["F10C",113,{"$f":"'Cover Sheet'!$E$19","v":0},{"$f":"'Cover Sheet'!$E$23","v":"00:00:00"},4,{"$f":"'Form 10C'!E23/'Cover Sheet'!$E$27","v":{"$error":"#DIV/0!"}}]
["F10C",114,{"$f":"'Cover Sheet'!$E$19","v":0},{"$f":"'Cover Sheet'!$E$23","v":"00:00:00"},4,{"$f":"'Form 10C'!E24/'Cover Sheet'!$E$27","v":{"$error":"#DIV/0!"}}]
["F10C",115,{"$f":"'Cover Sheet'!$E$19","v":0},{"$f":"'Cover Sheet'!$E$23","v":"00:00:00"},4,{"$f":"'Form 10C'!E25/'Cover Sheet'!$E$27","v":{"$error":"#DIV/0!"}}]
["F10C",116,{"$f":"'Cover Sheet'!$E$19","v":0},{"$f":"'Cover Sheet'!$E$23","v":"00:00:00"},4,{"$f":"'Form 10C'!E26/'Cover Sheet'!$E$27","v":{"$error":"#DIV/0!"}}]
["F10C",117,{"$f":"'Cover Sheet'!$E$19","v":0},{"$f":"'Cover Sheet'!$E$23","v":"00:00:00"},4,{"$f":"'Form 10C'!E27/'Cover Sheet'!$E$27","v":{"$error":"#DIV/0!"}}]
["F10C",118,{"$f":"'Cover Sheet'!$E$19","v":0},{"$f":"'Cover Sheet'!$E$23","v":"00:00:00"},4,{"$f":"'Form 10C'!E28/'Cover Sheet'!$E$27","v":{"$error":"#DIV/0!"}}]
["F10C",119,{"$f":"'Cover Sheet'!$E$19","v":0},{"$f":"'Cover Sheet'!$E$23","v":"00:00:00"},4,{"$f":"'Form 10C'!E29/'Cover Sheet'!$E$27","v":{"$error":"#DIV/0!"}}]
["F10C",120,{"$f":"'Cover Sheet'!$E$19","v":0},{"$f":"'Cover Sheet'!$E$23","v":"00:00:00"},4,{"$f":"'Form 10C'!E30/'Cover Sheet'!$E$27","v":{"$error":"#DIV/0!"}}]
["F10C",121,{"$f":"'Cover Sheet'!$E$19","v":0},{"$f":"'Cover Sheet'!$E$23","v":"00:00:00"},4,{"$f":"'Form 10C'!E31/'Cover Sheet'!$E$27","v":{"$error":"#DIV/0!"}}]
["F10C",122,{"$f":"'Cover Sheet'!$E$19","v":0},{"$f":"'Cover Sheet'!$E$23","v":"00:00:00"},4,{"$f":"'Form 10C'!E32/'Cover Sheet'!$E$27","v":{"$error":"#DIV/0!"}}]
["F10C",123,{"$f":"'Cover Sheet'!$E$19","v":0},{"$f":"'Cover Sheet'!$E$23","v":"00:00:00"},4,{"$f":"'Form 10C'!E33/'Cover Sheet'!$E$27","v":{"$error":"#DIV/0!"}}]
["F10C",124,{"$f":"'Cover Sheet'!$E$19","v":0},{"$f":"'Cover Sheet'!$E$23","v":"00:00:00"},4,{"$f":"'Form 10C'!E34/'Cover Sheet'!$E$27","v":{"$error":"#DIV/0!"}}]
["F10C",125,{"$f":"'Cover Sheet'!$E$19","v":0},{"$f":"'Cover Sheet'!$E$23","v":"00:00:00"},4,{"$f":"'Form 10C'!E35/'Cover Sheet'!$E$27","v":{"$error":"#DIV/0!"}}]
["F10C",126,{"$f":"'Cover Sheet'!$E$19","v":0},{"$f":"'Cover Sheet'!$E$23","v":"00:00:00"},4,{"$f":"'Form 10C'!E36/'Cover Sheet'!$E$27","v":{"$error":"#DIV/0!"}}]
["F10C",127,{"$f":"'Cover Sheet'!$E$19","v":0},{"$f":"'Cover Sheet'!$E$23","v":"00:00:00"},4,{"$f":"'Form 10C'!E37/'Cover Sheet'!$E$27","v":{"$error":"#DIV/0!"}}]
["F10C",128,{"$f":"'Cover Sheet'!$E$19","v":0},{"$f":"'Cover Sheet'!$E$23","v":"00:00:00"},4,{"$f":"'Form 10C'!E38/'Cover Sheet'!$E$27","v":{"$error":"#DIV/0!"}}]
["F10C",129,{"$f":"'Cover Sheet'!$E$19","v":0},{"$f":"'Cover Sheet'!$E$23","v":"00:00:00"},4,{"$f":"'Form 10C'!E39/'Cover Sheet'!$E$27","v":{"$error":"#DIV/0!"}}]
["F10C",130,{"$f":"'Cover Sheet'!$E$19","v":0},{"$f":"'Cover Sheet'!$E$23","v":"00:00:00"},4,{"$f":"'Form 10C'!E40/'Cover Sheet'!$E$27","v":{"$error":"#DIV/0!"}}]
["F10C",131,{"$f":"'Cover Sheet'!$E$19","v":0},{"$f":"'Cover Sheet'!$E$23","v":"00:00:00"},4,{"$f":"'Form 10C'!E41/'Cover Sheet'!$E$27","v":{"$error":"#DIV/0!"}}]
["F10C",101,{"$f":"'Cover Sheet'!$E$19","v":0},{"$f":"'Cover Sheet'!$E$23","v":"00:00:00"},5,{"$f":"'Form 10C'!F11/'Cover Sheet'!$E$27","v":{"$error":"#DIV/0!"}}]
["F10C",102,{"$f":"'Cover Sheet'!$E$19","v":0},{"$f":"'Cover Sheet'!$E$23","v":"00:00:00"},5,{"$f":"'Form 10C'!F12/'Cover Sheet'!$E$27","v":{"$error":"#DIV/0!"}}]
["F10C",103,{"$f":"'Cover Sheet'!$E$19","v":0},{"$f":"'Cover Sheet'!$E$23","v":"00:00:00"},5,{"$f":"'Form 10C'!F13/'Cover Sheet'!$E$27","v":{"$error":"#DIV/0!"}}]
["F10C",104,{"$f":"'Cover Sheet'!$E$19","v":0},{"$f":"'Cover Sheet'!$E$23","v":"00:00:00"},5,{"$f":"'Form 10C'!F14/'Cover Sheet'!$E$27","v":{"$error":"#DIV/0!"}}]
["F10C",105,{"$f":"'Cover Sheet'!$E$19","v":0},{"$f":"'Cover Sheet'!$E$23","v":"00:00:00"},5,{"$f":"'Form 10C'!F15/'Cover Sheet'!$E$27","v":{"$error":"#DIV/0!"}}]
["F10C",106,{"$f":"'Cover Sheet'!$E$19","v":0},{"$f":"'Cover Sheet'!$E$23","v":"00:00:00"},5,{"$f":"'Form 10C'!F16/'Cover Sheet'!$E$27","v":{"$error":"#DIV/0!"}}]
["F10C",107,{"$f":"'Cover Sheet'!$E$19","v":0},{"$f":"'Cover Sheet'!$E$23","v":"00:00:00"},5,{"$f":"'Form 10C'!F17/'Cover Sheet'!$E$27","v":{"$error":"#DIV/0!"}}]
["F10C",108,{"$f":"'Cover Sheet'!$E$19","v":0},{"$f":"'Cover Sheet'!$E$23","v":"00:00:00"},5,{"$f":"'Form 10C'!F18/'Cover Sheet'!$E$27","v":{"$error":"#DIV/0!"}}]
["F10C",109,{"$f":"'Cover Sheet'!$E$19","v":0},{"$f":"'Cover Sheet'!$E$23","v":"00:00:00"},5,{"$f":"'Form 10C'!F19/'Cover Sheet'!$E$27","v":{"$error":"#DIV/0!"}}]
["F10C",110,{"$f":"'Cover Sheet'!$E$19","v":0},{"$f":"'Cover Sheet'!$E$23","v":"00:00:00"},5,{"$f":"'Form 10C'!F20/'Cover Sheet'!$E$27","v":{"$error":"#DIV/0!"}}]
["F10C",111,{"$f":"'Cover Sheet'!$E$19","v":0},{"$f":"'Cover Sheet'!$E$23","v":"00:00:00"},5,{"$f":"'Form 10C'!F21/'Cover Sheet'!$E$27","v":{"$error":"#DIV/0!"}}]
["F10C",112,{"$f":"'Cover Sheet'!$E$19","v":0},{"$f":"'Cover Sheet'!$E$23","v":"00:00:00"},5,{"$f":"'Form 10C'!F22/'Cover Sheet'!$E$27","v":{"$error":"#DIV/0!"}}]
["F10C",113,{"$f":"'Cover Sheet'!$E$19","v":0},{"$f":"'Cover Sheet'!$E$23","v":"00:00:00"},5,{"$f":"'Form 10C'!F23/'Cover Sheet'!$E$27","v":{"$error":"#DIV/0!"}}]
["F10C",114,{"$f":"'Cover Sheet'!$E$19","v":0},{"$f":"'Cover Sheet'!$E$23","v":"00:00:00"},5,{"$f":"'Form 10C'!F24/'Cover Sheet'!$E$27","v":{"$error":"#DIV/0!"}}]
["F10C",115,{"$f":"'Cover Sheet'!$E$19","v":0},{"$f":"'Cover Sheet'!$E$23","v":"00:00:00"},5,{"$f":"'Form 10C'!F25/'Cover Sheet'!$E$27","v":{"$error":"#DIV/0!"}}]
["F10C",116,{"$f":"'Cover Sheet'!$E$19","v":0},{"$f":"'Cover Sheet'!$E$23","v":"00:00:00"},5,{"$f":"'Form 10C'!F26/'Cover Sheet'!$E$27","v":{"$error":"#DIV/0!"}}]
["F10C",117,{"$f":"'Cover Sheet'!$E$19","v":0},{"$f":"'Cover Sheet'!$E$23","v":"00:00:00"},5,{"$f":"'Form 10C'!F27/'Cover Sheet'!$E$27","v":{"$error":"#DIV/0!"}}]
["F10C",118,{"$f":"'Cover Sheet'!$E$19","v":0},{"$f":"'Cover Sheet'!$E$23","v":"00:00:00"},5,{"$f":"'Form 10C'!F28/'Cover Sheet'!$E$27","v":{"$error":"#DIV/0!"}}]
["F10C",119,{"$f":"'Cover Sheet'!$E$19","v":0},{"$f":"'Cover Sheet'!$E$23","v":"00:00:00"},5,{"$f":"'Form 10C'!F29/'Cover Sheet'!$E$27","v":{"$error":"#DIV/0!"}}]
["F10C",120,{"$f":"'Cover Sheet'!$E$19","v":0},{"$f":"'Cover Sheet'!$E$23","v":"00:00:00"},5,{"$f":"'Form 10C'!F30/'Cover Sheet'!$E$27","v":{"$error":"#DIV/0!"}}]
["F10C",121,{"$f":"'Cover Sheet'!$E$19","v":0},{"$f":"'Cover Sheet'!$E$23","v":"00:00:00"},5,{"$f":"'Form 10C'!F31/'Cover Sheet'!$E$27","v":{"$error":"#DIV/0!"}}]
["F10C",122,{"$f":"'Cover Sheet'!$E$19","v":0},{"$f":"'Cover Sheet'!$E$23","v":"00:00:00"},5,{"$f":"'Form 10C'!F32/'Cover Sheet'!$E$27","v":{"$error":"#DIV/0!"}}]
["F10C",123,{"$f":"'Cover Sheet'!$E$19","v":0},{"$f":"'Cover Sheet'!$E$23","v":"00:00:00"},5,{"$f":"'Form 10C'!F33/'Cover Sheet'!$E$27","v":{"$error":"#DIV/0!"}}]
["F10C",124,{"$f":"'Cover Sheet'!$E$19","v":0},{"$f":"'Cover Sheet'!$E$23","v":"00:00:00"},5,{"$f":"'Form 10C'!F34/'Cover Sheet'!$E$27","v":{"$error":"#DIV/0!"}}]
["F10C",125,{"$f":"'Cover Sheet'!$E$19","v":0},{"$f":"'Cover Sheet'!$E$23","v":"00:00:00"},5,{"$f":"'Form 10C'!F35/'Cover Sheet'!$E$27","v":{"$error":"#DIV/0!"}}]
["F10C",126,{"$f":"'Cover Sheet'!$E$19","v":0},{"$f":"'Cover Sheet'!$E$23","v":"00:00:00"},5,{"$f":"'Form 10C'!F36/'Cover Sheet'!$E$27","v":{"$error":"#DIV/0!"}}]
["F10C",127,{"$f":"'Cover Sheet'!$E$19","v":0},{"$f":"'Cover Sheet'!$E$23","v":"00:00:00"},5,{"$f":"'Form 10C'!F37/'Cover Sheet'!$E$27","v":{"$error":"#DIV/0!"}}]
["F10C",128,{"$f":"'Cover Sheet'!$E$19","v":0},{"$f":"'Cover Sheet'!$E$23","v":"00:00:00"},5,{"$f":"'Form 10C'!F38/'Cover Sheet'!$E$27","v":{"$error":"#DIV/0!"}}]
["F10C",129,{"$f":"'Cover Sheet'!$E$19","v":0},{"$f":"'Cover Sheet'!$E$23","v":"00:00:00"},5,{"$f":"'Form 10C'!F39/'Cover Sheet'!$E$27","v":{"$error":"#DIV/0!"}}]
["F10C",130,{"$f":"'Cover Sheet'!$E$19","v":0},{"$f":"'Cover Sheet'!$E$23","v":"00:00:00"},5,{"$f":"'Form 10C'!F40/'Cover Sheet'!$E$27","v":{"$error":"#DIV/0!"}}]
["F10C",131,{"$f":"'Cover Sheet'!$E$19","v":0},{"$f":"'Cover Sheet'!$E$23","v":"00:00:00"},5,{"$f":"'Form 10C'!F41/'Cover Sheet'!$E$27","v":{"$error":"#DIV/0!"}}]
["F10C",101,{"$f":"'Cover Sheet'!$E$19","v":0},{"$f":"'Cover Sheet'!$E$23","v":"00:00:00"},6,{"$f":"'Form 10C'!G11/'Cover Sheet'!$E$27","v":{"$error":"#DIV/0!"}}]
["F10C",102,{"$f":"'Cover Sheet'!$E$19","v":0},{"$f":"'Cover Sheet'!$E$23","v":"00:00:00"},6,{"$f":"'Form 10C'!G12/'Cover Sheet'!$E$27","v":{"$error":"#DIV/0!"}}]
["F10C",103,{"$f":"'Cover Sheet'!$E$19","v":0},{"$f":"'Cover Sheet'!$E$23","v":"00:00:00"},6,{"$f":"'Form 10C'!G13/'Cover Sheet'!$E$27","v":{"$error":"#DIV/0!"}}]
["F10C",104,{"$f":"'Cover Sheet'!$E$19","v":0},{"$f":"'Cover Sheet'!$E$23","v":"00:00:00"},6,{"$f":"'Form 10C'!G14/'Cover Sheet'!$E$27","v":{"$error":"#DIV/0!"}}]
["F10C",105,{"$f":"'Cover Sheet'!$E$19","v":0},{"$f":"'Cover Sheet'!$E$23","v":"00:00:00"},6,{"$f":"'Form 10C'!G15/'Cover Sheet'!$E$27","v":{"$error":"#DIV/0!"}}]
["F10C",106,{"$f":"'Cover Sheet'!$E$19","v":0},{"$f":"'Cover Sheet'!$E$23","v":"00:00:00"},6,{"$f":"'Form 10C'!G16/'Cover Sheet'!$E$27","v":{"$error":"#DIV/0!"}}]
["F10C",107,{"$f":"'Cover Sheet'!$E$19","v":0},{"$f":"'Cover Sheet'!$E$23","v":"00:00:00"},6,{"$f":"'Form 10C'!G17/'Cover Sheet'!$E$27","v":{"$error":"#DIV/0!"}}]
["F10C",108,{"$f":"'Cover Sheet'!$E$19","v":0},{"$f":"'Cover Sheet'!$E$23","v":"00:00:00"},6,{"$f":"'Form 10C'!G18/'Cover Sheet'!$E$27","v":{"$error":"#DIV/0!"}}]
["F10C",109,{"$f":"'Cover Sheet'!$E$19","v":0},{"$f":"'Cover Sheet'!$E$23","v":"00:00:00"},6,{"$f":"'Form 10C'!G19/'Cover Sheet'!$E$27","v":{"$error":"#DIV/0!"}}]
["F10C",110,{"$f":"'Cover Sheet'!$E$19","v":0},{"$f":"'Cover Sheet'!$E$23","v":"00:00:00"},6,{"$f":"'Form 10C'!G20/'Cover Sheet'!$E$27","v":{"$error":"#DIV/0!"}}]
["F10C",111,{"$f":"'Cover Sheet'!$E$19","v":0},{"$f":"'Cover Sheet'!$E$23","v":"00:00:00"},6,{"$f":"'Form 10C'!G21/'Cover Sheet'!$E$27","v":{"$error":"#DIV/0!"}}]
["F10C",112,{"$f":"'Cover Sheet'!$E$19","v":0},{"$f":"'Cover Sheet'!$E$23","v":"00:00:00"},6,{"$f":"'Form 10C'!G22/'Cover Sheet'!$E$27","v":{"$error":"#DIV/0!"}}]
["F10C",113,{"$f":"'Cover Sheet'!$E$19","v":0},{"$f":"'Cover Sheet'!$E$23","v":"00:00:00"},6,{"$f":"'Form 10C'!G23/'Cover Sheet'!$E$27","v":{"$error":"#DIV/0!"}}]
["F10C",114,{"$f":"'Cover Sheet'!$E$19","v":0},{"$f":"'Cover Sheet'!$E$23","v":"00:00:00"},6,{"$f":"'Form 10C'!G24/'Cover Sheet'!$E$27","v":{"$error":"#DIV/0!"}}]
["F10C",115,{"$f":"'Cover Sheet'!$E$19","v":0},{"$f":"'Cover Sheet'!$E$23","v":"00:00:00"},6,{"$f":"'Form 10C'!G25/'Cover Sheet'!$E$27","v":{"$error":"#DIV/0!"}}]
["F10C",116,{"$f":"'Cover Sheet'!$E$19","v":0},{"$f":"'Cover Sheet'!$E$23","v":"00:00:00"},6,{"$f":"'Form 10C'!G26/'Cover Sheet'!$E$27","v":{"$error":"#DIV/0!"}}]
["F10C",117,{"$f":"'Cover Sheet'!$E$19","v":0},{"$f":"'Cover Sheet'!$E$23","v":"00:00:00"},6,{"$f":"'Form 10C'!G27/'Cover Sheet'!$E$27","v":{"$error":"#DIV/0!"}}]
["F10C",118,{"$f":"'Cover Sheet'!$E$19","v":0},{"$f":"'Cover Sheet'!$E$23","v":"00:00:00"},6,{"$f":"'Form 10C'!G28/'Cover Sheet'!$E$27","v":{"$error":"#DIV/0!"}}]
["F10C",119,{"$f":"'Cover Sheet'!$E$19","v":0},{"$f":"'Cover Sheet'!$E$23","v":"00:00:00"},6,{"$f":"'Form 10C'!G29/'Cover Sheet'!$E$27","v":{"$error":"#DIV/0!"}}]
["F10C",120,{"$f":"'Cover Sheet'!$E$19","v":0},{"$f":"'Cover Sheet'!$E$23","v":"00:00:00"},6,{"$f":"'Form 10C'!G30/'Cover Sheet'!$E$27","v":{"$error":"#DIV/0!"}}]
["F10C",121,{"$f":"'Cover Sheet'!$E$19","v":0},{"$f":"'Cover Sheet'!$E$23","v":"00:00:00"},6,{"$f":"'Form 10C'!G31/'Cover Sheet'!$E$27","v":{"$error":"#DIV/0!"}}]
["F10C",122,{"$f":"'Cover Sheet'!$E$19","v":0},{"$f":"'Cover Sheet'!$E$23","v":"00:00:00"},6,{"$f":"'Form 10C'!G32/'Cover Sheet'!$E$27","v":{"$error":"#DIV/0!"}}]
["F10C",123,{"$f":"'Cover Sheet'!$E$19","v":0},{"$f":"'Cover Sheet'!$E$23","v":"00:00:00"},6,{"$f":"'Form 10C'!G33/'Cover Sheet'!$E$27","v":{"$error":"#DIV/0!"}}]
["F10C",124,{"$f":"'Cover Sheet'!$E$19","v":0},{"$f":"'Cover Sheet'!$E$23","v":"00:00:00"},6,{"$f":"'Form 10C'!G34/'Cover Sheet'!$E$27","v":{"$error":"#DIV/0!"}}]
["F10C",125,{"$f":"'Cover Sheet'!$E$19","v":0},{"$f":"'Cover Sheet'!$E$23","v":"00:00:00"},6,{"$f":"'Form 10C'!G35/'Cover Sheet'!$E$27","v":{"$error":"#DIV/0!"}}]
["F10C",126,{"$f":"'Cover Sheet'!$E$19","v":0},{"$f":"'Cover Sheet'!$E$23","v":"00:00:00"},6,{"$f":"'Form 10C'!G36/'Cover Sheet'!$E$27","v":{"$error":"#DIV/0!"}}]
["F10C",127,{"$f":"'Cover Sheet'!$E$19","v":0},{"$f":"'Cover Sheet'!$E$23","v":"00:00:00"},6,{"$f":"'Form 10C'!G37/'Cover Sheet'!$E$27","v":{"$error":"#DIV/0!"}}]
["F10C",128,{"$f":"'Cover Sheet'!$E$19","v":0},{"$f":"'Cover Sheet'!$E$23","v":"00:00:00"},6,{"$f":"'Form 10C'!G38/'Cover Sheet'!$E$27","v":{"$error":"#DIV/0!"}}]
["F10C",129,{"$f":"'Cover Sheet'!$E$19","v":0},{"$f":"'Cover Sheet'!$E$23","v":"00:00:00"},6,{"$f":"'Form 10C'!G39/'Cover Sheet'!$E$27","v":{"$error":"#DIV/0!"}}]
["F10C",130,{"$f":"'Cover Sheet'!$E$19","v":0},{"$f":"'Cover Sheet'!$E$23","v":"00:00:00"},6,{"$f":"'Form 10C'!G40/'Cover Sheet'!$E$27","v":{"$error":"#DIV/0!"}}]
["F10C",131,{"$f":"'Cover Sheet'!$E$19","v":0},{"$f":"'Cover Sheet'!$E$23","v":"00:00:00"},6,{"$f":"'Form 10C'!G41/'Cover Sheet'!$E$27","v":{"$error":"#DIV/0!"}}]
["F10C",101,{"$f":"'Cover Sheet'!$E$19","v":0},{"$f":"'Cover Sheet'!$E$23","v":"00:00:00"},7,{"$f":"'Form 10C'!H11/'Cover Sheet'!$E$27","v":{"$error":"#DIV/0!"}}]
["F10C",102,{"$f":"'Cover Sheet'!$E$19","v":0},{"$f":"'Cover Sheet'!$E$23","v":"00:00:00"},7,{"$f":"'Form 10C'!H12/'Cover Sheet'!$E$27","v":{"$error":"#DIV/0!"}}]
["F10C",103,{"$f":"'Cover Sheet'!$E$19","v":0},{"$f":"'Cover Sheet'!$E$23","v":"00:00:00"},7,{"$f":"'Form 10C'!H13/'Cover Sheet'!$E$27","v":{"$error":"#DIV/0!"}}]
["F10C",104,{"$f":"'Cover Sheet'!$E$19","v":0},{"$f":"'Cover Sheet'!$E$23","v":"00:00:00"},7,{"$f":"'Form 10C'!H14/'Cover Sheet'!$E$27","v":{"$error":"#DIV/0!"}}]
["F10C",105,{"$f":"'Cover Sheet'!$E$19","v":0},{"$f":"'Cover Sheet'!$E$23","v":"00:00:00"},7,{"$f":"'Form 10C'!H15/'Cover Sheet'!$E$27","v":{"$error":"#DIV/0!"}}]
["F10C",106,{"$f":"'Cover Sheet'!$E$19","v":0},{"$f":"'Cover Sheet'!$E$23","v":"00:00:00"},7,{"$f":"'Form 10C'!H16/'Cover Sheet'!$E$27","v":{"$error":"#DIV/0!"}}]
["F10C",107,{"$f":"'Cover Sheet'!$E$19","v":0},{"$f":"'Cover Sheet'!$E$23","v":"00:00:00"},7,{"$f":"'Form 10C'!H17/'Cover Sheet'!$E$27","v":{"$error":"#DIV/0!"}}]
["F10C",108,{"$f":"'Cover Sheet'!$E$19","v":0},{"$f":"'Cover Sheet'!$E$23","v":"00:00:00"},7,{"$f":"'Form 10C'!H18/'Cover Sheet'!$E$27","v":{"$error":"#DIV/0!"}}]
["F10C",109,{"$f":"'Cover Sheet'!$E$19","v":0},{"$f":"'Cover Sheet'!$E$23","v":"00:00:00"},7,{"$f":"'Form 10C'!H19/'Cover Sheet'!$E$27","v":{"$error":"#DIV/0!"}}]
["F10C",110,{"$f":"'Cover Sheet'!$E$19","v":0},{"$f":"'Cover Sheet'!$E$23","v":"00:00:00"},7,{"$f":"'Form 10C'!H20/'Cover Sheet'!$E$27","v":{"$error":"#DIV/0!"}}]
["F10C",111,{"$f":"'Cover Sheet'!$E$19","v":0},{"$f":"'Cover Sheet'!$E$23","v":"00:00:00"},7,{"$f":"'Form 10C'!H21/'Cover Sheet'!$E$27","v":{"$error":"#DIV/0!"}}]
["F10C",112,{"$f":"'Cover Sheet'!$E$19","v":0},{"$f":"'Cover Sheet'!$E$23","v":"00:00:00"},7,{"$f":"'Form 10C'!H22/'Cover Sheet'!$E$27","v":{"$error":"#DIV/0!"}}]
["F10C",113,{"$f":"'Cover Sheet'!$E$19","v":0},{"$f":"'Cover Sheet'!$E$23","v":"00:00:00"},7,{"$f":"'Form 10C'!H23/'Cover Sheet'!$E$27","v":{"$error":"#DIV/0!"}}]
["F10C",114,{"$f":"'Cover Sheet'!$E$19","v":0},{"$f":"'Cover Sheet'!$E$23","v":"00:00:00"},7,{"$f":"'Form 10C'!H24/'Cover Sheet'!$E$27","v":{"$error":"#DIV/0!"}}]
["F10C",115,{"$f":"'Cover Sheet'!$E$19","v":0},{"$f":"'Cover Sheet'!$E$23","v":"00:00:00"},7,{"$f":"'Form 10C'!H25/'Cover Sheet'!$E$27","v":{"$error":"#DIV/0!"}}]
["F10C",116,{"$f":"'Cover Sheet'!$E$19","v":0},{"$f":"'Cover Sheet'!$E$23","v":"00:00:00"},7,{"$f":"'Form 10C'!H26/'Cover Sheet'!$E$27","v":{"$error":"#DIV/0!"}}]
["F10C",117,{"$f":"'Cover Sheet'!$E$19","v":0},{"$f":"'Cover Sheet'!$E$23","v":"00:00:00"},7,{"$f":"'Form 10C'!H27/'Cover Sheet'!$E$27","v":{"$error":"#DIV/0!"}}]
["F10C",118,{"$f":"'Cover Sheet'!$E$19","v":0},{"$f":"'Cover Sheet'!$E$23","v":"00:00:00"},7,{"$f":"'Form 10C'!H28/'Cover Sheet'!$E$27","v":{"$error":"#DIV/0!"}}]
["F10C",119,{"$f":"'Cover Sheet'!$E$19","v":0},{"$f":"'Cover Sheet'!$E$23","v":"00:00:00"},7,{"$f":"'Form 10C'!H29/'Cover Sheet'!$E$27","v":{"$error":"#DIV/0!"}}]
["F10C",120,{"$f":"'Cover Sheet'!$E$19","v":0},{"$f":"'Cover Sheet'!$E$23","v":"00:00:00"},7,{"$f":"'Form 10C'!H30/'Cover Sheet'!$E$27","v":{"$error":"#DIV/0!"}}]
["F10C",121,{"$f":"'Cover Sheet'!$E$19","v":0},{"$f":"'Cover Sheet'!$E$23","v":"00:00:00"},7,{"$f":"'Form 10C'!H31/'Cover Sheet'!$E$27","v":{"$error":"#DIV/0!"}}]
["F10C",122,{"$f":"'Cover Sheet'!$E$19","v":0},{"$f":"'Cover Sheet'!$E$23","v":"00:00:00"},7,{"$f":"'Form 10C'!H32/'Cover Sheet'!$E$27","v":{"$error":"#DIV/0!"}}]
["F10C",123,{"$f":"'Cover Sheet'!$E$19","v":0},{"$f":"'Cover Sheet'!$E$23","v":"00:00:00"},7,{"$f":"'Form 10C'!H33/'Cover Sheet'!$E$27","v":{"$error":"#DIV/0!"}}]
["F10C",124,{"$f":"'Cover Sheet'!$E$19","v":0},{"$f":"'Cover Sheet'!$E$23","v":"00:00:00"},7,{"$f":"'Form 10C'!H34/'Cover Sheet'!$E$27","v":{"$error":"#DIV/0!"}}]
["F10C",125,{"$f":"'Cover Sheet'!$E$19","v":0},{"$f":"'Cover Sheet'!$E$23","v":"00:00:00"},7,{"$f":"'Form 10C'!H35/'Cover Sheet'!$E$27","v":{"$error":"#DIV/0!"}}]
["F10C",126,{"$f":"'Cover Sheet'!$E$19","v":0},{"$f":"'Cover Sheet'!$E$23","v":"00:00:00"},7,{"$f":"'Form 10C'!H36/'Cover Sheet'!$E$27","v":{"$error":"#DIV/0!"}}]
["F10C",127,{"$f":"'Cover Sheet'!$E$19","v":0},{"$f":"'Cover Sheet'!$E$23","v":"00:00:00"},7,{"$f":"'Form 10C'!H37/'Cover Sheet'!$E$27","v":{"$error":"#DIV/0!"}}]
["F10C",128,{"$f":"'Cover Sheet'!$E$19","v":0},{"$f":"'Cover Sheet'!$E$23","v":"00:00:00"},7,{"$f":"'Form 10C'!H38/'Cover Sheet'!$E$27","v":{"$error":"#DIV/0!"}}]
["F10C",129,{"$f":"'Cover Sheet'!$E$19","v":0},{"$f":"'Cover Sheet'!$E$23","v":"00:00:00"},7,{"$f":"'Form 10C'!H39/'Cover Sheet'!$E$27","v":{"$error":"#DIV/0!"}}]
["F10C",130,{"$f":"'Cover Sheet'!$E$19","v":0},{"$f":"'Cover Sheet'!$E$23","v":"00:00:00"},7,{"$f":"'Form 10C'!H40/'Cover Sheet'!$E$27","v":{"$error":"#DIV/0!"}}]
["F10C",131,{"$f":"'Cover Sheet'!$E$19","v":0},{"$f":"'Cover Sheet'!$E$23","v":"00:00:00"},7,{"$f":"'Form 10C'!H41/'Cover Sheet'!$E$27","v":{"$error":"#DIV/0!"}}]
["F10C",101,{"$f":"'Cover Sheet'!$E$19","v":0},{"$f":"'Cover Sheet'!$E$23","v":"00:00:00"},8,{"$f":"'Form 10C'!I11","v":0}]
["F10C",102,{"$f":"'Cover Sheet'!$E$19","v":0},{"$f":"'Cover Sheet'!$E$23","v":"00:00:00"},8,{"$f":"'Form 10C'!I12","v":0}]
["F10C",103,{"$f":"'Cover Sheet'!$E$19","v":0},{"$f":"'Cover Sheet'!$E$23","v":"00:00:00"},8,{"$f":"'Form 10C'!I13","v":0}]
["F10C",104,{"$f":"'Cover Sheet'!$E$19","v":0},{"$f":"'Cover Sheet'!$E$23","v":"00:00:00"},8,{"$f":"'Form 10C'!I14","v":0}]
["F10C",105,{"$f":"'Cover Sheet'!$E$19","v":0},{"$f":"'Cover Sheet'!$E$23","v":"00:00:00"},8,{"$f":"'Form 10C'!I15","v":0}]
["F10C",106,{"$f":"'Cover Sheet'!$E$19","v":0},{"$f":"'Cover Sheet'!$E$23","v":"00:00:00"},8,{"$f":"'Form 10C'!I16","v":0}]
["F10C",107,{"$f":"'Cover Sheet'!$E$19","v":0},{"$f":"'Cover Sheet'!$E$23","v":"00:00:00"},8,{"$f":"'Form 10C'!I17","v":0}]
["F10C",108,{"$f":"'Cover Sheet'!$E$19","v":0},{"$f":"'Cover Sheet'!$E$23","v":"00:00:00"},8,{"$f":"'Form 10C'!I18","v":0}]
["F10C",109,{"$f":"'Cover Sheet'!$E$19","v":0},{"$f":"'Cover Sheet'!$E$23","v":"00:00:00"},8,{"$f":"'Form 10C'!I19","v":0}]
["F10C",110,{"$f":"'Cover Sheet'!$E$19","v":0},{"$f":"'Cover Sheet'!$E$23","v":"00:00:00"},8,{"$f":"'Form 10C'!I20","v":0}]
["F10C",111,{"$f":"'Cover Sheet'!$E$19","v":0},{"$f":"'Cover Sheet'!$E$23","v":"00:00:00"},8,{"$f":"'Form 10C'!I21","v":0}]
["F10C",112,{"$f":"'Cover Sheet'!$E$19","v":0},{"$f":"'Cover Sheet'!$E$23","v":"00:00:00"},8,{"$f":"'Form 10C'!I22","v":0}]
["F10C",113,{"$f":"'Cover Sheet'!$E$19","v":0},{"$f":"'Cover Sheet'!$E$23","v":"00:00:00"},8,{"$f":"'Form 10C'!I23","v":0}]
["F10C",114,{"$f":"'Cover Sheet'!$E$19","v":0},{"$f":"'Cover Sheet'!$E$23","v":"00:00:00"},8,{"$f":"'Form 10C'!I24","v":0}]
["F10C",115,{"$f":"'Cover Sheet'!$E$19","v":0},{"$f":"'Cover Sheet'!$E$23","v":"00:00:00"},8,{"$f":"'Form 10C'!I25","v":0}]
["F10C",116,{"$f":"'Cover Sheet'!$E$19","v":0},{"$f":"'Cover Sheet'!$E$23","v":"00:00:00"},8,{"$f":"'Form 10C'!I26","v":0}]
["F10C",117,{"$f":"'Cover Sheet'!$E$19","v":0},{"$f":"'Cover Sheet'!$E$23","v":"00:00:00"},8,{"$f":"'Form 10C'!I27","v":0}]
["F10C",118,{"$f":"'Cover Sheet'!$E$19","v":0},{"$f":"'Cover Sheet'!$E$23","v":"00:00:00"},8,{"$f":"'Form 10C'!I28","v":0}]
["F10C",119,{"$f":"'Cover Sheet'!$E$19","v":0},{"$f":"'Cover Sheet'!$E$23","v":"00:00:00"},8,{"$f":"'Form 10C'!I29","v":0}]
["F10C",120,{"$f":"'Cover Sheet'!$E$19","v":0},{"$f":"'Cover Sheet'!$E$23","v":"00:00:00"},8,{"$f":"'Form 10C'!I30","v":0}]
["F10C",121,{"$f":"'Cover Sheet'!$E$19","v":0},{"$f":"'Cover Sheet'!$E$23","v":"00:00:00"},8,{"$f":"'Form 10C'!I31","v":0}]
["F10C",122,{"$f":"'Cover Sheet'!$E$19","v":0},{"$f":"'Cover Sheet'!$E$23","v":"00:00:00"},8,{"$f":"'Form 10C'!I32","v":0}]
["F10C",123,{"$f":"'Cover Sheet'!$E$19","v":0},{"$f":"'Cover Sheet'!$E$23","v":"00:00:00"},8,{"$f":"'Form 10C'!I33","v":0}]
["F10C",124,{"$f":"'Cover Sheet'!$E$19","v":0},{"$f":"'Cover Sheet'!$E$23","v":"00:00:00"},8,{"$f":"'Form 10C'!I34","v":0}]
["F10C",125,{"$f":"'Cover Sheet'!$E$19","v":0},{"$f":"'Cover Sheet'!$E$23","v":"00:00:00"},8,{"$f":"'Form 10C'!I35","v":0}]
["F10C",126,{"$f":"'Cover Sheet'!$E$19","v":0},{"$f":"'Cover Sheet'!$E$23","v":"00:00:00"},8,{"$f":"'Form 10C'!I36","v":0}]
["F10C",127,{"$f":"'Cover Sheet'!$E$19","v":0},{"$f":"'Cover Sheet'!$E$23","v":"00:00:00"},8,{"$f":"'Form 10C'!I37","v":0}]
["F10C",128,{"$f":"'Cover Sheet'!$E$19","v":0},{"$f":"'Cover Sheet'!$E$23","v":"00:00:00"},8,{"$f":"'Form 10C'!I38","v":0}]
["F10C",129,{"$f":"'Cover Sheet'!$E$19","v":0},{"$f":"'Cover Sheet'!$E$23","v":"00:00:00"},8,{"$f":"'Form 10C'!I39","v":0}]
["F10C",130,{"$f":"'Cover Sheet'!$E$19","v":0},{"$f":"'Cover Sheet'!$E$23","v":"00:00:00"},8,{"$f":"'Form 10C'!I40","v":0}]
["F10C",131,{"$f":"'Cover Sheet'!$E$19","v":0},{"$f":"'Cover Sheet'!$E$23","v":"00:00:00"},8,{"$f":"'Form 10C'!I41","v":0}]
["F10C",101,{"$f":"'Cover Sheet'!$E$19","v":0},{"$f":"'Cover Sheet'!$E$23","v":"00:00:00"},9,{"$f":"'Form 10C'!J11","v":0}]
["F10C",102,{"$f":"'Cover Sheet'!$E$19","v":0},{"$f":"'Cover Sheet'!$E$23","v":"00:00:00"},9,{"$f":"'Form 10C'!J12","v":0}]
["F10C",103,{"$f":"'Cover Sheet'!$E$19","v":0},{"$f":"'Cover Sheet'!$E$23","v":"00:00:00"},9,{"$f":"'Form 10C'!J13","v":0}]
["F10C",104,{"$f":"'Cover Sheet'!$E$19","v":0},{"$f":"'Cover Sheet'!$E$23","v":"00:00:00"},9,{"$f":"'Form 10C'!J14","v":0}]
["F10C",105,{"$f":"'Cover Sheet'!$E$19","v":0},{"$f":"'Cover Sheet'!$E$23","v":"00:00:00"},9,{"$f":"'Form 10C'!J15","v":0}]
["F10C",106,{"$f":"'Cover Sheet'!$E$19","v":0},{"$f":"'Cover Sheet'!$E$23","v":"00:00:00"},9,{"$f":"'Form 10C'!J16","v":0}]
["F10C",107,{"$f":"'Cover Sheet'!$E$19","v":0},{"$f":"'Cover Sheet'!$E$23","v":"00:00:00"},9,{"$f":"'Form 10C'!J17","v":0}]
["F10C",108,{"$f":"'Cover Sheet'!$E$19","v":0},{"$f":"'Cover Sheet'!$E$23","v":"00:00:00"},9,{"$f":"'Form 10C'!J18","v":0}]
["F10C",109,{"$f":"'Cover Sheet'!$E$19","v":0},{"$f":"'Cover Sheet'!$E$23","v":"00:00:00"},9,{"$f":"'Form 10C'!J19","v":0}]
["F10C",110,{"$f":"'Cover Sheet'!$E$19","v":0},{"$f":"'Cover Sheet'!$E$23","v":"00:00:00"},9,{"$f":"'Form 10C'!J20","v":0}]
["F10C",111,{"$f":"'Cover Sheet'!$E$19","v":0},{"$f":"'Cover Sheet'!$E$23","v":"00:00:00"},9,{"$f":"'Form 10C'!J21","v":0}]
["F10C",112,{"$f":"'Cover Sheet'!$E$19","v":0},{"$f":"'Cover Sheet'!$E$23","v":"00:00:00"},9,{"$f":"'Form 10C'!J22","v":0}]
["F10C",113,{"$f":"'Cover Sheet'!$E$19","v":0},{"$f":"'Cover Sheet'!$E$23","v":"00:00:00"},9,{"$f":"'Form 10C'!J23","v":0}]
["F10C",114,{"$f":"'Cover Sheet'!$E$19","v":0},{"$f":"'Cover Sheet'!$E$23","v":"00:00:00"},9,{"$f":"'Form 10C'!J24","v":0}]
["F10C",115,{"$f":"'Cover Sheet'!$E$19","v":0},{"$f":"'Cover Sheet'!$E$23","v":"00:00:00"},9,{"$f":"'Form 10C'!J25","v":0}]
["F10C",116,{"$f":"'Cover Sheet'!$E$19","v":0},{"$f":"'Cover Sheet'!$E$23","v":"00:00:00"},9,{"$f":"'Form 10C'!J26","v":0}]
["F10C",117,{"$f":"'Cover Sheet'!$E$19","v":0},{"$f":"'Cover Sheet'!$E$23","v":"00:00:00"},9,{"$f":"'Form 10C'!J27","v":0}]
["F10C",118,{"$f":"'Cover Sheet'!$E$19","v":0},{"$f":"'Cover Sheet'!$E$23","v":"00:00:00"},9,{"$f":"'Form 10C'!J28","v":0}]
["F10C",119,{"$f":"'Cover Sheet'!$E$19","v":0},{"$f":"'Cover Sheet'!$E$23","v":"00:00:00"},9,{"$f":"'Form 10C'!J29","v":0}]
["F10C",120,{"$f":"'Cover Sheet'!$E$19","v":0},{"$f":"'Cover Sheet'!$E$23","v":"00:00:00"},9,{"$f":"'Form 10C'!J30","v":0}]
["F10C",121,{"$f":"'Cover Sheet'!$E$19","v":0},{"$f":"'Cover Sheet'!$E$23","v":"00:00:00"},9,{"$f":"'Form 10C'!J31","v":0}]
["F10C",122,{"$f":"'Cover Sheet'!$E$19","v":0},{"$f":"'Cover Sheet'!$E$23","v":"00:00:00"},9,{"$f":"'Form 10C'!J32","v":0}]
["F10C",123,{"$f":"'Cover Sheet'!$E$19","v":0},{"$f":"'Cover Sheet'!$E$23","v":"00:00:00"},9,{"$f":"'Form 10C'!J33","v":0}]
["F10C",124,{"$f":"'Cover Sheet'!$E$19","v":0},{"$f":"'Cover Sheet'!$E$23","v":"00:00:00"},9,{"$f":"'Form 10C'!J34","v":0}]
["F10C",125,{"$f":"'Cover Sheet'!$E$19","v":0},{"$f":"'Cover Sheet'!$E$23","v":"00:00:00"},9,{"$f":"'Form 10C'!J35","v":0}]
["F10C",126,{"$f":"'Cover Sheet'!$E$19","v":0},{"$f":"'Cover Sheet'!$E$23","v":"00:00:00"},9,{"$f":"'Form 10C'!J36","v":0}]
["F10C",127,{"$f":"'Cover Sheet'!$E$19","v":0},{"$f":"'Cover Sheet'!$E$23","v":"00:00:00"},9,{"$f":"'Form 10C'!J37","v":0}]
["F10C",128,{"$f":"'Cover Sheet'!$E$19","v":0},{"$f":"'Cover Sheet'!$E$23","v":"00:00:00"},9,{"$f":"'Form 10C'!J38","v":0}]
["F10C",129,{"$f":"'Cover Sheet'!$E$19","v":0},{"$f":"'Cover Sheet'!$E$23","v":"00:00:00"},9,{"$f":"'Form 10C'!J39","v":0}]
["F10C",130,{"$f":"'Cover Sheet'!$E$19","v":0},{"$f":"'Cover Sheet'!$E$23","v":"00:00:00"},9,{"$f":"'Form 10C'!J40","v":0}]
["F10C",131,{"$f":"'Cover Sheet'!$E$19","v":0},{"$f":"'Cover Sheet'!$E$23","v":"00:00:00"},9,{"$f":"'Form 10C'!J41","v":0}]
["F10C",101,{"$f":"'Cover Sheet'!$E$19","v":0},{"$f":"'Cover Sheet'!$E$23","v":"00:00:00"},10,{"$f":"'Form 10C'!K11/'Cover Sheet'!$E$27","v":{"$error":"#DIV/0!"}}]
["F10C",102,{"$f":"'Cover Sheet'!$E$19","v":0},{"$f":"'Cover Sheet'!$E$23","v":"00:00:00"},10,{"$f":"'Form 10C'!K12/'Cover Sheet'!$E$27","v":{"$error":"#DIV/0!"}}]
["F10C",103,{"$f":"'Cover Sheet'!$E$19","v":0},{"$f":"'Cover Sheet'!$E$23","v":"00:00:00"},10,{"$f":"'Form 10C'!K13/'Cover Sheet'!$E$27","v":{"$error":"#DIV/0!"}}]
["F10C",104,{"$f":"'Cover Sheet'!$E$19","v":0},{"$f":"'Cover Sheet'!$E$23","v":"00:00:00"},10,{"$f":"'Form 10C'!K14/'Cover Sheet'!$E$27","v":{"$error":"#DIV/0!"}}]
["F10C",105,{"$f":"'Cover Sheet'!$E$19","v":0},{"$f":"'Cover Sheet'!$E$23","v":"00:00:00"},10,{"$f":"'Form 10C'!K15/'Cover Sheet'!$E$27","v":{"$error":"#DIV/0!"}}]
["F10C",106,{"$f":"'Cover Sheet'!$E$19","v":0},{"$f":"'Cover Sheet'!$E$23","v":"00:00:00"},10,{"$f":"'Form 10C'!K16/'Cover Sheet'!$E$27","v":{"$error":"#DIV/0!"}}]
["F10C",107,{"$f":"'Cover Sheet'!$E$19","v":0},{"$f":"'Cover Sheet'!$E$23","v":"00:00:00"},10,{"$f":"'Form 10C'!K17/'Cover Sheet'!$E$27","v":{"$error":"#DIV/0!"}}]
["F10C",108,{"$f":"'Cover Sheet'!$E$19","v":0},{"$f":"'Cover Sheet'!$E$23","v":"00:00:00"},10,{"$f":"'Form 10C'!K18/'Cover Sheet'!$E$27","v":{"$error":"#DIV/0!"}}]
["F10C",109,{"$f":"'Cover Sheet'!$E$19","v":0},{"$f":"'Cover Sheet'!$E$23","v":"00:00:00"},10,{"$f":"'Form 10C'!K19/'Cover Sheet'!$E$27","v":{"$error":"#DIV/0!"}}]
["F10C",110,{"$f":"'Cover Sheet'!$E$19","v":0},{"$f":"'Cover Sheet'!$E$23","v":"00:00:00"},10,{"$f":"'Form 10C'!K20/'Cover Sheet'!$E$27","v":{"$error":"#DIV/0!"}}]
["F10C",111,{"$f":"'Cover Sheet'!$E$19","v":0},{"$f":"'Cover Sheet'!$E$23","v":"00:00:00"},10,{"$f":"'Form 10C'!K21/'Cover Sheet'!$E$27","v":{"$error":"#DIV/0!"}}]
["F10C",112,{"$f":"'Cover Sheet'!$E$19","v":0},{"$f":"'Cover Sheet'!$E$23","v":"00:00:00"},10,{"$f":"'Form 10C'!K22/'Cover Sheet'!$E$27","v":{"$error":"#DIV/0!"}}]
["F10C",113,{"$f":"'Cover Sheet'!$E$19","v":0},{"$f":"'Cover Sheet'!$E$23","v":"00:00:00"},10,{"$f":"'Form 10C'!K23/'Cover Sheet'!$E$27","v":{"$error":"#DIV/0!"}}]
["F10C",114,{"$f":"'Cover Sheet'!$E$19","v":0},{"$f":"'Cover Sheet'!$E$23","v":"00:00:00"},10,{"$f":"'Form 10C'!K24/'Cover Sheet'!$E$27","v":{"$error":"#DIV/0!"}}]
["F10C",115,{"$f":"'Cover Sheet'!$E$19","v":0},{"$f":"'Cover Sheet'!$E$23","v":"00:00:00"},10,{"$f":"'Form 10C'!K25/'Cover Sheet'!$E$27","v":{"$error":"#DIV/0!"}}]
["F10C",116,{"$f":"'Cover Sheet'!$E$19","v":0},{"$f":"'Cover Sheet'!$E$23","v":"00:00:00"},10,{"$f":"'Form 10C'!K26/'Cover Sheet'!$E$27","v":{"$error":"#DIV/0!"}}]
["F10C",117,{"$f":"'Cover Sheet'!$E$19","v":0},{"$f":"'Cover Sheet'!$E$23","v":"00:00:00"},10,{"$f":"'Form 10C'!K27/'Cover Sheet'!$E$27","v":{"$error":"#DIV/0!"}}]
["F10C",118,{"$f":"'Cover Sheet'!$E$19","v":0},{"$f":"'Cover Sheet'!$E$23","v":"00:00:00"},10,{"$f":"'Form 10C'!K28/'Cover Sheet'!$E$27","v":{"$error":"#DIV/0!"}}]
["F10C",119,{"$f":"'Cover Sheet'!$E$19","v":0},{"$f":"'Cover Sheet'!$E$23","v":"00:00:00"},10,{"$f":"'Form 10C'!K29/'Cover Sheet'!$E$27","v":{"$error":"#DIV/0!"}}]
["F10C",120,{"$f":"'Cover Sheet'!$E$19","v":0},{"$f":"'Cover Sheet'!$E$23","v":"00:00:00"},10,{"$f":"'Form 10C'!K30/'Cover Sheet'!$E$27","v":{"$error":"#DIV/0!"}}]
["F10C",121,{"$f":"'Cover Sheet'!$E$19","v":0},{"$f":"'Cover Sheet'!$E$23","v":"00:00:00"},10,{"$f":"'Form 10C'!K31/'Cover Sheet'!$E$27","v":{"$error":"#DIV/0!"}}]
["F10C",122,{"$f":"'Cover Sheet'!$E$19","v":0},{"$f":"'Cover Sheet'!$E$23","v":"00:00:00"},10,{"$f":"'Form 10C'!K32/'Cover Sheet'!$E$27","v":{"$error":"#DIV/0!"}}]
["F10C",123,{"$f":"'Cover Sheet'!$E$19","v":0},{"$f":"'Cover Sheet'!$E$23","v":"00:00:00"},10,{"$f":"'Form 10C'!K33/'Cover Sheet'!$E$27","v":{"$error":"#DIV/0!"}}]
["F10C",124,{"$f":"'Cover Sheet'!$E$19","v":0},{"$f":"'Cover Sheet'!$E$23","v":"00:00:00"},10,{"$f":"'Form 10C'!K34/'Cover Sheet'!$E$27","v":{"$error":"#DIV/0!"}}]
["F10C",125,{"$f":"'Cover Sheet'!$E$19","v":0},{"$f":"'Cover Sheet'!$E$23","v":"00:00:00"},10,{"$f":"'Form 10C'!K35/'Cover Sheet'!$E$27","v":{"$error":"#DIV/0!"}}]
["F10C",126,{"$f":"'Cover Sheet'!$E$19","v":0},{"$f":"'Cover Sheet'!$E$23","v":"00:00:00"},10,{"$f":"'Form 10C'!K36/'Cover Sheet'!$E$27","v":{"$error":"#DIV/0!"}}]
["F10C",127,{"$f":"'Cover Sheet'!$E$19","v":0},{"$f":"'Cover Sheet'!$E$23","v":"00:00:00"},10,{"$f":"'Form 10C'!K37/'Cover Sheet'!$E$27","v":{"$error":"#DIV/0!"}}]
["F10C",128,{"$f":"'Cover Sheet'!$E$19","v":0},{"$f":"'Cover Sheet'!$E$23","v":"00:00:00"},10,{"$f":"'Form 10C'!K38/'Cover Sheet'!$E$27","v":{"$error":"#DIV/0!"}}]
["F10C",129,{"$f":"'Cover Sheet'!$E$19","v":0},{"$f":"'Cover Sheet'!$E$23","v":"00:00:00"},10,{"$f":"'Form 10C'!K39/'Cover Sheet'!$E$27","v":{"$error":"#DIV/0!"}}]
["F10C",130,{"$f":"'Cover Sheet'!$E$19","v":0},{"$f":"'Cover Sheet'!$E$23","v":"00:00:00"},10,{"$f":"'Form 10C'!K40/'Cover Sheet'!$E$27","v":{"$error":"#DIV/0!"}}]
["F10C",131,{"$f":"'Cover Sheet'!$E$19","v":0},{"$f":"'Cover Sheet'!$E$23","v":"00:00:00"},10,{"$f":"'Form 10C'!K41/'Cover Sheet'!$E$27","v":{"$error":"#DIV/0!"}}]
["F10C",101,{"$f":"'Cover Sheet'!$E$19","v":0},{"$f":"'Cover Sheet'!$E$23","v":"00:00:00"},11,{"$f":"'Form 10C'!L11/'Cover Sheet'!$E$27","v":{"$error":"#DIV/0!"}}]
["F10C",102,{"$f":"'Cover Sheet'!$E$19","v":0},{"$f":"'Cover Sheet'!$E$23","v":"00:00:00"},11,{"$f":"'Form 10C'!L12/'Cover Sheet'!$E$27","v":{"$error":"#DIV/0!"}}]
["F10C",103,{"$f":"'Cover Sheet'!$E$19","v":0},{"$f":"'Cover Sheet'!$E$23","v":"00:00:00"},11,{"$f":"'Form 10C'!L13/'Cover Sheet'!$E$27","v":{"$error":"#DIV/0!"}}]
["F10C",104,{"$f":"'Cover Sheet'!$E$19","v":0},{"$f":"'Cover Sheet'!$E$23","v":"00:00:00"},11,{"$f":"'Form 10C'!L14/'Cover Sheet'!$E$27","v":{"$error":"#DIV/0!"}}]
["F10C",105,{"$f":"'Cover Sheet'!$E$19","v":0},{"$f":"'Cover Sheet'!$E$23","v":"00:00:00"},11,{"$f":"'Form 10C'!L15/'Cover Sheet'!$E$27","v":{"$error":"#DIV/0!"}}]
["F10C",106,{"$f":"'Cover Sheet'!$E$19","v":0},{"$f":"'Cover Sheet'!$E$23","v":"00:00:00"},11,{"$f":"'Form 10C'!L16/'Cover Sheet'!$E$27","v":{"$error":"#DIV/0!"}}]
["F10C",107,{"$f":"'Cover Sheet'!$E$19","v":0},{"$f":"'Cover Sheet'!$E$23","v":"00:00:00"},11,{"$f":"'Form 10C'!L17/'Cover Sheet'!$E$27","v":{"$error":"#DIV/0!"}}]
["F10C",108,{"$f":"'Cover Sheet'!$E$19","v":0},{"$f":"'Cover Sheet'!$E$23","v":"00:00:00"},11,{"$f":"'Form 10C'!L18/'Cover Sheet'!$E$27","v":{"$error":"#DIV/0!"}}]
["F10C",109,{"$f":"'Cover Sheet'!$E$19","v":0},{"$f":"'Cover Sheet'!$E$23","v":"00:00:00"},11,{"$f":"'Form 10C'!L19/'Cover Sheet'!$E$27","v":{"$error":"#DIV/0!"}}]
["F10C",110,{"$f":"'Cover Sheet'!$E$19","v":0},{"$f":"'Cover Sheet'!$E$23","v":"00:00:00"},11,{"$f":"'Form 10C'!L20/'Cover Sheet'!$E$27","v":{"$error":"#DIV/0!"}}]
["F10C",111,{"$f":"'Cover Sheet'!$E$19","v":0},{"$f":"'Cover Sheet'!$E$23","v":"00:00:00"},11,{"$f":"'Form 10C'!L21/'Cover Sheet'!$E$27","v":{"$error":"#DIV/0!"}}]
["F10C",112,{"$f":"'Cover Sheet'!$E$19","v":0},{"$f":"'Cover Sheet'!$E$23","v":"00:00:00"},11,{"$f":"'Form 10C'!L22/'Cover Sheet'!$E$27","v":{"$error":"#DIV/0!"}}]
["F10C",113,{"$f":"'Cover Sheet'!$E$19","v":0},{"$f":"'Cover Sheet'!$E$23","v":"00:00:00"},11,{"$f":"'Form 10C'!L23/'Cover Sheet'!$E$27","v":{"$error":"#DIV/0!"}}]
["F10C",114,{"$f":"'Cover Sheet'!$E$19","v":0},{"$f":"'Cover Sheet'!$E$23","v":"00:00:00"},11,{"$f":"'Form 10C'!L24/'Cover Sheet'!$E$27","v":{"$error":"#DIV/0!"}}]
["F10C",115,{"$f":"'Cover Sheet'!$E$19","v":0},{"$f":"'Cover Sheet'!$E$23","v":"00:00:00"},11,{"$f":"'Form 10C'!L25/'Cover Sheet'!$E$27","v":{"$error":"#DIV/0!"}}]
["F10C",116,{"$f":"'Cover Sheet'!$E$19","v":0},{"$f":"'Cover Sheet'!$E$23","v":"00:00:00"},11,{"$f":"'Form 10C'!L26/'Cover Sheet'!$E$27","v":{"$error":"#DIV/0!"}}]
["F10C",117,{"$f":"'Cover Sheet'!$E$19","v":0},{"$f":"'Cover Sheet'!$E$23","v":"00:00:00"},11,{"$f":"'Form 10C'!L27/'Cover Sheet'!$E$27","v":{"$error":"#DIV/0!"}}]
["F10C",118,{"$f":"'Cover Sheet'!$E$19","v":0},{"$f":"'Cover Sheet'!$E$23","v":"00:00:00"},11,{"$f":"'Form 10C'!L28/'Cover Sheet'!$E$27","v":{"$error":"#DIV/0!"}}]
["F10C",119,{"$f":"'Cover Sheet'!$E$19","v":0},{"$f":"'Cover Sheet'!$E$23","v":"00:00:00"},11,{"$f":"'Form 10C'!L29/'Cover Sheet'!$E$27","v":{"$error":"#DIV/0!"}}]
["F10C",120,{"$f":"'Cover Sheet'!$E$19","v":0},{"$f":"'Cover Sheet'!$E$23","v":"00:00:00"},11,{"$f":"'Form 10C'!L30/'Cover Sheet'!$E$27","v":{"$error":"#DIV/0!"}}]
["F10C",121,{"$f":"'Cover Sheet'!$E$19","v":0},{"$f":"'Cover Sheet'!$E$23","v":"00:00:00"},11,{"$f":"'Form 10C'!L31/'Cover Sheet'!$E$27","v":{"$error":"#DIV/0!"}}]
["F10C",122,{"$f":"'Cover Sheet'!$E$19","v":0},{"$f":"'Cover Sheet'!$E$23","v":"00:00:00"},11,{"$f":"'Form 10C'!L32/'Cover Sheet'!$E$27","v":{"$error":"#DIV/0!"}}]
["F10C",123,{"$f":"'Cover Sheet'!$E$19","v":0},{"$f":"'Cover Sheet'!$E$23","v":"00:00:00"},11,{"$f":"'Form 10C'!L33/'Cover Sheet'!$E$27","v":{"$error":"#DIV/0!"}}]
["F10C",124,{"$f":"'Cover Sheet'!$E$19","v":0},{"$f":"'Cover Sheet'!$E$23","v":"00:00:00"},11,{"$f":"'Form 10C'!L34/'Cover Sheet'!$E$27","v":{"$error":"#DIV/0!"}}]
["F10C",125,{"$f":"'Cover Sheet'!$E$19","v":0},{"$f":"'Cover Sheet'!$E$23","v":"00:00:00"},11,{"$f":"'Form 10C'!L35/'Cover Sheet'!$E$27","v":{"$error":"#DIV/0!"}}]
["F10C",126,{"$f":"'Cover Sheet'!$E$19","v":0},{"$f":"'Cover Sheet'!$E$23","v":"00:00:00"},11,{"$f":"'Form 10C'!L36/'Cover Sheet'!$E$27","v":{"$error":"#DIV/0!"}}]
["F10C",127,{"$f":"'Cover Sheet'!$E$19","v":0},{"$f":"'Cover Sheet'!$E$23","v":"00:00:00"},11,{"$f":"'Form 10C'!L37/'Cover Sheet'!$E$27","v":{"$error":"#DIV/0!"}}]
["F10C",128,{"$f":"'Cover Sheet'!$E$19","v":0},{"$f":"'Cover Sheet'!$E$23","v":"00:00:00"},11,{"$f":"'Form 10C'!L38/'Cover Sheet'!$E$27","v":{"$error":"#DIV/0!"}}]
["F10C",129,{"$f":"'Cover Sheet'!$E$19","v":0},{"$f":"'Cover Sheet'!$E$23","v":"00:00:00"},11,{"$f":"'Form 10C'!L39/'Cover Sheet'!$E$27","v":{"$error":"#DIV/0!"}}]
["F10C",130,{"$f":"'Cover Sheet'!$E$19","v":0},{"$f":"'Cover Sheet'!$E$23","v":"00:00:00"},11,{"$f":"'Form 10C'!L40/'Cover Sheet'!$E$27","v":{"$error":"#DIV/0!"}}]
["F10C",131,{"$f":"'Cover Sheet'!$E$19","v":0},{"$f":"'Cover Sheet'!$E$23","v":"00:00:00"},11,{"$f":"'Form 10C'!L41/'Cover Sheet'!$E$27","v":{"$error":"#DIV/0!"}}]
["F10C",101,{"$f":"'Cover Sheet'!$E$19","v":0},{"$f":"'Cover Sheet'!$E$23","v":"00:00:00"},12,{"$f":"'Form 10C'!M11/'Cover Sheet'!$E$27","v":{"$error":"#DIV/0!"}}]
["F10C",102,{"$f":"'Cover Sheet'!$E$19","v":0},{"$f":"'Cover Sheet'!$E$23","v":"00:00:00"},12,{"$f":"'Form 10C'!M12/'Cover Sheet'!$E$27","v":{"$error":"#DIV/0!"}}]
["F10C",103,{"$f":"'Cover Sheet'!$E$19","v":0},{"$f":"'Cover Sheet'!$E$23","v":"00:00:00"},12,{"$f":"'Form 10C'!M13/'Cover Sheet'!$E$27","v":{"$error":"#DIV/0!"}}]
["F10C",104,{"$f":"'Cover Sheet'!$E$19","v":0},{"$f":"'Cover Sheet'!$E$23","v":"00:00:00"},12,{"$f":"'Form 10C'!M14/'Cover Sheet'!$E$27","v":{"$error":"#DIV/0!"}}]
["F10C",105,{"$f":"'Cover Sheet'!$E$19","v":0},{"$f":"'Cover Sheet'!$E$23","v":"00:00:00"},12,{"$f":"'Form 10C'!M15/'Cover Sheet'!$E$27","v":{"$error":"#DIV/0!"}}]
["F10C",106,{"$f":"'Cover Sheet'!$E$19","v":0},{"$f":"'Cover Sheet'!$E$23","v":"00:00:00"},12,{"$f":"'Form 10C'!M16/'Cover Sheet'!$E$27","v":{"$error":"#DIV/0!"}}]
["F10C",107,{"$f":"'Cover Sheet'!$E$19","v":0},{"$f":"'Cover Sheet'!$E$23","v":"00:00:00"},12,{"$f":"'Form 10C'!M17/'Cover Sheet'!$E$27","v":{"$error":"#DIV/0!"}}]
["F10C",108,{"$f":"'Cover Sheet'!$E$19","v":0},{"$f":"'Cover Sheet'!$E$23","v":"00:00:00"},12,{"$f":"'Form 10C'!M18/'Cover Sheet'!$E$27","v":{"$error":"#DIV/0!"}}]
["F10C",109,{"$f":"'Cover Sheet'!$E$19","v":0},{"$f":"'Cover Sheet'!$E$23","v":"00:00:00"},12,{"$f":"'Form 10C'!M19/'Cover Sheet'!$E$27","v":{"$error":"#DIV/0!"}}]
["F10C",110,{"$f":"'Cover Sheet'!$E$19","v":0},{"$f":"'Cover Sheet'!$E$23","v":"00:00:00"},12,{"$f":"'Form 10C'!M20/'Cover Sheet'!$E$27","v":{"$error":"#DIV/0!"}}]
["F10C",111,{"$f":"'Cover Sheet'!$E$19","v":0},{"$f":"'Cover Sheet'!$E$23","v":"00:00:00"},12,{"$f":"'Form 10C'!M21/'Cover Sheet'!$E$27","v":{"$error":"#DIV/0!"}}]
["F10C",112,{"$f":"'Cover Sheet'!$E$19","v":0},{"$f":"'Cover Sheet'!$E$23","v":"00:00:00"},12,{"$f":"'Form 10C'!M22/'Cover Sheet'!$E$27","v":{"$error":"#DIV/0!"}}]
["F10C",113,{"$f":"'Cover Sheet'!$E$19","v":0},{"$f":"'Cover Sheet'!$E$23","v":"00:00:00"},12,{"$f":"'Form 10C'!M23/'Cover Sheet'!$E$27","v":{"$error":"#DIV/0!"}}]
["F10C",114,{"$f":"'Cover Sheet'!$E$19","v":0},{"$f":"'Cover Sheet'!$E$23","v":"00:00:00"},12,{"$f":"'Form 10C'!M24/'Cover Sheet'!$E$27","v":{"$error":"#DIV/0!"}}]
["F10C",115,{"$f":"'Cover Sheet'!$E$19","v":0},{"$f":"'Cover Sheet'!$E$23","v":"00:00:00"},12,{"$f":"'Form 10C'!M25/'Cover Sheet'!$E$27","v":{"$error":"#DIV/0!"}}]
["F10C",116,{"$f":"'Cover Sheet'!$E$19","v":0},{"$f":"'Cover Sheet'!$E$23","v":"00:00:00"},12,{"$f":"'Form 10C'!M26/'Cover Sheet'!$E$27","v":{"$error":"#DIV/0!"}}]
["F10C",117,{"$f":"'Cover Sheet'!$E$19","v":0},{"$f":"'Cover Sheet'!$E$23","v":"00:00:00"},12,{"$f":"'Form 10C'!M27/'Cover Sheet'!$E$27","v":{"$error":"#DIV/0!"}}]
["F10C",118,{"$f":"'Cover Sheet'!$E$19","v":0},{"$f":"'Cover Sheet'!$E$23","v":"00:00:00"},12,{"$f":"'Form 10C'!M28/'Cover Sheet'!$E$27","v":{"$error":"#DIV/0!"}}]
["F10C",119,{"$f":"'Cover Sheet'!$E$19","v":0},{"$f":"'Cover Sheet'!$E$23","v":"00:00:00"},12,{"$f":"'Form 10C'!M29/'Cover Sheet'!$E$27","v":{"$error":"#DIV/0!"}}]
["F10C",120,{"$f":"'Cover Sheet'!$E$19","v":0},{"$f":"'Cover Sheet'!$E$23","v":"00:00:00"},12,{"$f":"'Form 10C'!M30/'Cover Sheet'!$E$27","v":{"$error":"#DIV/0!"}}]
["F10C",121,{"$f":"'Cover Sheet'!$E$19","v":0},{"$f":"'Cover Sheet'!$E$23","v":"00:00:00"},12,{"$f":"'Form 10C'!M31/'Cover Sheet'!$E$27","v":{"$error":"#DIV/0!"}}]
["F10C",122,{"$f":"'Cover Sheet'!$E$19","v":0},{"$f":"'Cover Sheet'!$E$23","v":"00:00:00"},12,{"$f":"'Form 10C'!M32/'Cover Sheet'!$E$27","v":{"$error":"#DIV/0!"}}]
["F10C",123,{"$f":"'Cover Sheet'!$E$19","v":0},{"$f":"'Cover Sheet'!$E$23","v":"00:00:00"},12,{"$f":"'Form 10C'!M33/'Cover Sheet'!$E$27","v":{"$error":"#DIV/0!"}}]
["F10C",124,{"$f":"'Cover Sheet'!$E$19","v":0},{"$f":"'Cover Sheet'!$E$23","v":"00:00:00"},12,{"$f":"'Form 10C'!M34/'Cover Sheet'!$E$27","v":{"$error":"#DIV/0!"}}]
["F10C",125,{"$f":"'Cover Sheet'!$E$19","v":0},{"$f":"'Cover Sheet'!$E$23","v":"00:00:00"},12,{"$f":"'Form 10C'!M35/'Cover Sheet'!$E$27","v":{"$error":"#DIV/0!"}}]
["F10C",126,{"$f":"'Cover Sheet'!$E$19","v":0},{"$f":"'Cover Sheet'!$E$23","v":"00:00:00"},12,{"$f":"'Form 10C'!M36/'Cover Sheet'!$E$27","v":{"$error":"#DIV/0!"}}]
["F10C",127,{"$f":"'Cover Sheet'!$E$19","v":0},{"$f":"'Cover Sheet'!$E$23","v":"00:00:00"},12,{"$f":"'Form 10C'!M37/'Cover Sheet'!$E$27","v":{"$error":"#DIV/0!"}}]
["F10C",128,{"$f":"'Cover Sheet'!$E$19","v":0},{"$f":"'Cover Sheet'!$E$23","v":"00:00:00"},12,{"$f":"'Form 10C'!M38/'Cover Sheet'!$E$27","v":{"$error":"#DIV/0!"}}]
["F10C",129,{"$f":"'Cover Sheet'!$E$19","v":0},{"$f":"'Cover Sheet'!$E$23","v":"00:00:00"},12,{"$f":"'Form 10C'!M39/'Cover Sheet'!$E$27","v":{"$error":"#DIV/0!"}}]
["F10C",130,{"$f":"'Cover Sheet'!$E$19","v":0},{"$f":"'Cover Sheet'!$E$23","v":"00:00:00"},12,{"$f":"'Form 10C'!M40/'Cover Sheet'!$E$27","v":{"$error":"#DIV/0!"}}]
["F10C",131,{"$f":"'Cover Sheet'!$E$19","v":0},{"$f":"'Cover Sheet'!$E$23","v":"00:00:00"},12,{"$f":"'Form 10C'!M41/'Cover Sheet'!$E$27","v":{"$error":"#DIV/0!"}}]
["F10C",101,{"$f":"'Cover Sheet'!$E$19","v":0},{"$f":"'Cover Sheet'!$E$23","v":"00:00:00"},13,{"$f":"'Form 10C'!N11/'Cover Sheet'!$E$27","v":{"$error":"#DIV/0!"}}]
["F10C",102,{"$f":"'Cover Sheet'!$E$19","v":0},{"$f":"'Cover Sheet'!$E$23","v":"00:00:00"},13,{"$f":"'Form 10C'!N12/'Cover Sheet'!$E$27","v":{"$error":"#DIV/0!"}}]
["F10C",103,{"$f":"'Cover Sheet'!$E$19","v":0},{"$f":"'Cover Sheet'!$E$23","v":"00:00:00"},13,{"$f":"'Form 10C'!N13/'Cover Sheet'!$E$27","v":{"$error":"#DIV/0!"}}]
["F10C",104,{"$f":"'Cover Sheet'!$E$19","v":0},{"$f":"'Cover Sheet'!$E$23","v":"00:00:00"},13,{"$f":"'Form 10C'!N14/'Cover Sheet'!$E$27","v":{"$error":"#DIV/0!"}}]
["F10C",105,{"$f":"'Cover Sheet'!$E$19","v":0},{"$f":"'Cover Sheet'!$E$23","v":"00:00:00"},13,{"$f":"'Form 10C'!N15/'Cover Sheet'!$E$27","v":{"$error":"#DIV/0!"}}]
["F10C",106,{"$f":"'Cover Sheet'!$E$19","v":0},{"$f":"'Cover Sheet'!$E$23","v":"00:00:00"},13,{"$f":"'Form 10C'!N16/'Cover Sheet'!$E$27","v":{"$error":"#DIV/0!"}}]
["F10C",107,{"$f":"'Cover Sheet'!$E$19","v":0},{"$f":"'Cover Sheet'!$E$23","v":"00:00:00"},13,{"$f":"'Form 10C'!N17/'Cover Sheet'!$E$27","v":{"$error":"#DIV/0!"}}]
["F10C",108,{"$f":"'Cover Sheet'!$E$19","v":0},{"$f":"'Cover Sheet'!$E$23","v":"00:00:00"},13,{"$f":"'Form 10C'!N18/'Cover Sheet'!$E$27","v":{"$error":"#DIV/0!"}}]
["F10C",109,{"$f":"'Cover Sheet'!$E$19","v":0},{"$f":"'Cover Sheet'!$E$23","v":"00:00:00"},13,{"$f":"'Form 10C'!N19/'Cover Sheet'!$E$27","v":{"$error":"#DIV/0!"}}]
["F10C",110,{"$f":"'Cover Sheet'!$E$19","v":0},{"$f":"'Cover Sheet'!$E$23","v":"00:00:00"},13,{"$f":"'Form 10C'!N20/'Cover Sheet'!$E$27","v":{"$error":"#DIV/0!"}}]
["F10C",111,{"$f":"'Cover Sheet'!$E$19","v":0},{"$f":"'Cover Sheet'!$E$23","v":"00:00:00"},13,{"$f":"'Form 10C'!N21/'Cover Sheet'!$E$27","v":{"$error":"#DIV/0!"}}]
["F10C",112,{"$f":"'Cover Sheet'!$E$19","v":0},{"$f":"'Cover Sheet'!$E$23","v":"00:00:00"},13,{"$f":"'Form 10C'!N22/'Cover Sheet'!$E$27","v":{"$error":"#DIV/0!"}}]
["F10C",113,{"$f":"'Cover Sheet'!$E$19","v":0},{"$f":"'Cover Sheet'!$E$23","v":"00:00:00"},13,{"$f":"'Form 10C'!N23/'Cover Sheet'!$E$27","v":{"$error":"#DIV/0!"}}]
["F10C",114,{"$f":"'Cover Sheet'!$E$19","v":0},{"$f":"'Cover Sheet'!$E$23","v":"00:00:00"},13,{"$f":"'Form 10C'!N24/'Cover Sheet'!$E$27","v":{"$error":"#DIV/0!"}}]
["F10C",115,{"$f":"'Cover Sheet'!$E$19","v":0},{"$f":"'Cover Sheet'!$E$23","v":"00:00:00"},13,{"$f":"'Form 10C'!N25/'Cover Sheet'!$E$27","v":{"$error":"#DIV/0!"}}]
["F10C",116,{"$f":"'Cover Sheet'!$E$19","v":0},{"$f":"'Cover Sheet'!$E$23","v":"00:00:00"},13,{"$f":"'Form 10C'!N26/'Cover Sheet'!$E$27","v":{"$error":"#DIV/0!"}}]
["F10C",117,{"$f":"'Cover Sheet'!$E$19","v":0},{"$f":"'Cover Sheet'!$E$23","v":"00:00:00"},13,{"$f":"'Form 10C'!N27/'Cover Sheet'!$E$27","v":{"$error":"#DIV/0!"}}]
["F10C",118,{"$f":"'Cover Sheet'!$E$19","v":0},{"$f":"'Cover Sheet'!$E$23","v":"00:00:00"},13,{"$f":"'Form 10C'!N28/'Cover Sheet'!$E$27","v":{"$error":"#DIV/0!"}}]
["F10C",119,{"$f":"'Cover Sheet'!$E$19","v":0},{"$f":"'Cover Sheet'!$E$23","v":"00:00:00"},13,{"$f":"'Form 10C'!N29/'Cover Sheet'!$E$27","v":{"$error":"#DIV/0!"}}]
["F10C",120,{"$f":"'Cover Sheet'!$E$19","v":0},{"$f":"'Cover Sheet'!$E$23","v":"00:00:00"},13,{"$f":"'Form 10C'!N30/'Cover Sheet'!$E$27","v":{"$error":"#DIV/0!"}}]
["F10C",121,{"$f":"'Cover Sheet'!$E$19","v":0},{"$f":"'Cover Sheet'!$E$23","v":"00:00:00"},13,{"$f":"'Form 10C'!N31/'Cover Sheet'!$E$27","v":{"$error":"#DIV/0!"}}]
["F10C",122,{"$f":"'Cover Sheet'!$E$19","v":0},{"$f":"'Cover Sheet'!$E$23","v":"00:00:00"},13,{"$f":"'Form 10C'!N32/'Cover Sheet'!$E$27","v":{"$error":"#DIV/0!"}}]
["F10C",123,{"$f":"'Cover Sheet'!$E$19","v":0},{"$f":"'Cover Sheet'!$E$23","v":"00:00:00"},13,{"$f":"'Form 10C'!N33/'Cover Sheet'!$E$27","v":{"$error":"#DIV/0!"}}]
["F10C",124,{"$f":"'Cover Sheet'!$E$19","v":0},{"$f":"'Cover Sheet'!$E$23","v":"00:00:00"},13,{"$f":"'Form 10C'!N34/'Cover Sheet'!$E$27","v":{"$error":"#DIV/0!"}}]
["F10C",125,{"$f":"'Cover Sheet'!$E$19","v":0},{"$f":"'Cover Sheet'!$E$23","v":"00:00:00"},13,{"$f":"'Form 10C'!N35/'Cover Sheet'!$E$27","v":{"$error":"#DIV/0!"}}]
["F10C",126,{"$f":"'Cover Sheet'!$E$19","v":0},{"$f":"'Cover Sheet'!$E$23","v":"00:00:00"},13,{"$f":"'Form 10C'!N36/'Cover Sheet'!$E$27","v":{"$error":"#DIV/0!"}}]
["F10C",127,{"$f":"'Cover Sheet'!$E$19","v":0},{"$f":"'Cover Sheet'!$E$23","v":"00:00:00"},13,{"$f":"'Form 10C'!N37/'Cover Sheet'!$E$27","v":{"$error":"#DIV/0!"}}]
["F10C",128,{"$f":"'Cover Sheet'!$E$19","v":0},{"$f":"'Cover Sheet'!$E$23","v":"00:00:00"},13,{"$f":"'Form 10C'!N38/'Cover Sheet'!$E$27","v":{"$error":"#DIV/0!"}}]
["F10C",129,{"$f":"'Cover Sheet'!$E$19","v":0},{"$f":"'Cover Sheet'!$E$23","v":"00:00:00"},13,{"$f":"'Form 10C'!N39/'Cover Sheet'!$E$27","v":{"$error":"#DIV/0!"}}]
["F10C",130,{"$f":"'Cover Sheet'!$E$19","v":0},{"$f":"'Cover Sheet'!$E$23","v":"00:00:00"},13,{"$f":"'Form 10C'!N40/'Cover Sheet'!$E$27","v":{"$error":"#DIV/0!"}}]
["F10C",131,{"$f":"'Cover Sheet'!$E$19","v":0},{"$f":"'Cover Sheet'!$E$23","v":"00:00:00"},13,{"$f":"'Form 10C'!N41/'Cover Sheet'!$E$27","v":{"$error":"#DIV/0!"}}]
["F10C",101,{"$f":"'Cover Sheet'!$E$19","v":0},{"$f":"'Cover Sheet'!$E$23","v":"00:00:00"},14,{"$f":"'Form 10C'!O11/'Cover Sheet'!$E$27","v":{"$error":"#DIV/0!"}}]
["F10C",102,{"$f":"'Cover Sheet'!$E$19","v":0},{"$f":"'Cover Sheet'!$E$23","v":"00:00:00"},14,{"$f":"'Form 10C'!O12/'Cover Sheet'!$E$27","v":{"$error":"#DIV/0!"}}]
["F10C",103,{"$f":"'Cover Sheet'!$E$19","v":0},{"$f":"'Cover Sheet'!$E$23","v":"00:00:00"},14,{"$f":"'Form 10C'!O13/'Cover Sheet'!$E$27","v":{"$error":"#DIV/0!"}}]
["F10C",104,{"$f":"'Cover Sheet'!$E$19","v":0},{"$f":"'Cover Sheet'!$E$23","v":"00:00:00"},14,{"$f":"'Form 10C'!O14/'Cover Sheet'!$E$27","v":{"$error":"#DIV/0!"}}]
["F10C",105,{"$f":"'Cover Sheet'!$E$19","v":0},{"$f":"'Cover Sheet'!$E$23","v":"00:00:00"},14,{"$f":"'Form 10C'!O15/'Cover Sheet'!$E$27","v":{"$error":"#DIV/0!"}}]
["F10C",106,{"$f":"'Cover Sheet'!$E$19","v":0},{"$f":"'Cover Sheet'!$E$23","v":"00:00:00"},14,{"$f":"'Form 10C'!O16/'Cover Sheet'!$E$27","v":{"$error":"#DIV/0!"}}]
["F10C",107,{"$f":"'Cover Sheet'!$E$19","v":0},{"$f":"'Cover Sheet'!$E$23","v":"00:00:00"},14,{"$f":"'Form 10C'!O17/'Cover Sheet'!$E$27","v":{"$error":"#DIV/0!"}}]
["F10C",108,{"$f":"'Cover Sheet'!$E$19","v":0},{"$f":"'Cover Sheet'!$E$23","v":"00:00:00"},14,{"$f":"'Form 10C'!O18/'Cover Sheet'!$E$27","v":{"$error":"#DIV/0!"}}]
["F10C",109,{"$f":"'Cover Sheet'!$E$19","v":0},{"$f":"'Cover Sheet'!$E$23","v":"00:00:00"},14,{"$f":"'Form 10C'!O19/'Cover Sheet'!$E$27","v":{"$error":"#DIV/0!"}}]
["F10C",110,{"$f":"'Cover Sheet'!$E$19","v":0},{"$f":"'Cover Sheet'!$E$23","v":"00:00:00"},14,{"$f":"'Form 10C'!O20/'Cover Sheet'!$E$27","v":{"$error":"#DIV/0!"}}]
["F10C",111,{"$f":"'Cover Sheet'!$E$19","v":0},{"$f":"'Cover Sheet'!$E$23","v":"00:00:00"},14,{"$f":"'Form 10C'!O21/'Cover Sheet'!$E$27","v":{"$error":"#DIV/0!"}}]
["F10C",112,{"$f":"'Cover Sheet'!$E$19","v":0},{"$f":"'Cover Sheet'!$E$23","v":"00:00:00"},14,{"$f":"'Form 10C'!O22/'Cover Sheet'!$E$27","v":{"$error":"#DIV/0!"}}]
["F10C",113,{"$f":"'Cover Sheet'!$E$19","v":0},{"$f":"'Cover Sheet'!$E$23","v":"00:00:00"},14,{"$f":"'Form 10C'!O23/'Cover Sheet'!$E$27","v":{"$error":"#DIV/0!"}}]
["F10C",114,{"$f":"'Cover Sheet'!$E$19","v":0},{"$f":"'Cover Sheet'!$E$23","v":"00:00:00"},14,{"$f":"'Form 10C'!O24/'Cover Sheet'!$E$27","v":{"$error":"#DIV/0!"}}]
["F10C",115,{"$f":"'Cover Sheet'!$E$19","v":0},{"$f":"'Cover Sheet'!$E$23","v":"00:00:00"},14,{"$f":"'Form 10C'!O25/'Cover Sheet'!$E$27","v":{"$error":"#DIV/0!"}}]
["F10C",116,{"$f":"'Cover Sheet'!$E$19","v":0},{"$f":"'Cover Sheet'!$E$23","v":"00:00:00"},14,{"$f":"'Form 10C'!O26/'Cover Sheet'!$E$27","v":{"$error":"#DIV/0!"}}]
["F10C",117,{"$f":"'Cover Sheet'!$E$19","v":0},{"$f":"'Cover Sheet'!$E$23","v":"00:00:00"},14,{"$f":"'Form 10C'!O27/'Cover Sheet'!$E$27","v":{"$error":"#DIV/0!"}}]
["F10C",118,{"$f":"'Cover Sheet'!$E$19","v":0},{"$f":"'Cover Sheet'!$E$23","v":"00:00:00"},14,{"$f":"'Form 10C'!O28/'Cover Sheet'!$E$27","v":{"$error":"#DIV/0!"}}]
["F10C",119,{"$f":"'Cover Sheet'!$E$19","v":0},{"$f":"'Cover Sheet'!$E$23","v":"00:00:00"},14,{"$f":"'Form 10C'!O29/'Cover Sheet'!$E$27","v":{"$error":"#DIV/0!"}}]
["F10C",120,{"$f":"'Cover Sheet'!$E$19","v":0},{"$f":"'Cover Sheet'!$E$23","v":"00:00:00"},14,{"$f":"'Form 10C'!O30/'Cover Sheet'!$E$27","v":{"$error":"#DIV/0!"}}]
["F10C",121,{"$f":"'Cover Sheet'!$E$19","v":0},{"$f":"'Cover Sheet'!$E$23","v":"00:00:00"},14,{"$f":"'Form 10C'!O31/'Cover Sheet'!$E$27","v":{"$error":"#DIV/0!"}}]
["F10C",122,{"$f":"'Cover Sheet'!$E$19","v":0},{"$f":"'Cover Sheet'!$E$23","v":"00:00:00"},14,{"$f":"'Form 10C'!O32/'Cover Sheet'!$E$27","v":{"$error":"#DIV/0!"}}]
["F10C",123,{"$f":"'Cover Sheet'!$E$19","v":0},{"$f":"'Cover Sheet'!$E$23","v":"00:00:00"},14,{"$f":"'Form 10C'!O33/'Cover Sheet'!$E$27","v":{"$error":"#DIV/0!"}}]
["F10C",124,{"$f":"'Cover Sheet'!$E$19","v":0},{"$f":"'Cover Sheet'!$E$23","v":"00:00:00"},14,{"$f":"'Form 10C'!O34/'Cover Sheet'!$E$27","v":{"$error":"#DIV/0!"}}]
["F10C",125,{"$f":"'Cover Sheet'!$E$19","v":0},{"$f":"'Cover Sheet'!$E$23","v":"00:00:00"},14,{"$f":"'Form 10C'!O35/'Cover Sheet'!$E$27","v":{"$error":"#DIV/0!"}}]
["F10C",126,{"$f":"'Cover Sheet'!$E$19","v":0},{"$f":"'Cover Sheet'!$E$23","v":"00:00:00"},14,{"$f":"'Form 10C'!O36/'Cover Sheet'!$E$27","v":{"$error":"#DIV/0!"}}]
["F10C",127,{"$f":"'Cover Sheet'!$E$19","v":0},{"$f":"'Cover Sheet'!$E$23","v":"00:00:00"},14,{"$f":"'Form 10C'!O37/'Cover Sheet'!$E$27","v":{"$error":"#DIV/0!"}}]
["F10C",128,{"$f":"'Cover Sheet'!$E$19","v":0},{"$f":"'Cover Sheet'!$E$23","v":"00:00:00"},14,{"$f":"'Form 10C'!O38/'Cover Sheet'!$E$27","v":{"$error":"#DIV/0!"}}]
["F10C",129,{"$f":"'Cover Sheet'!$E$19","v":0},{"$f":"'Cover Sheet'!$E$23","v":"00:00:00"},14,{"$f":"'Form 10C'!O39/'Cover Sheet'!$E$27","v":{"$error":"#DIV/0!"}}]
["F10C",130,{"$f":"'Cover Sheet'!$E$19","v":0},{"$f":"'Cover Sheet'!$E$23","v":"00:00:00"},14,{"$f":"'Form 10C'!O40/'Cover Sheet'!$E$27","v":{"$error":"#DIV/0!"}}]
["F10C",131,{"$f":"'Cover Sheet'!$E$19","v":0},{"$f":"'Cover Sheet'!$E$23","v":"00:00:00"},14,{"$f":"'Form 10C'!O41/'Cover Sheet'!$E$27","v":{"$error":"#DIV/0!"}}]
["F10C",101,{"$f":"'Cover Sheet'!$E$19","v":0},{"$f":"'Cover Sheet'!$E$23","v":"00:00:00"},15,{"$f":"'Form 10C'!P11/'Cover Sheet'!$E$27","v":{"$error":"#DIV/0!"}}]
["F10C",102,{"$f":"'Cover Sheet'!$E$19","v":0},{"$f":"'Cover Sheet'!$E$23","v":"00:00:00"},15,{"$f":"'Form 10C'!P12/'Cover Sheet'!$E$27","v":{"$error":"#DIV/0!"}}]
["F10C",103,{"$f":"'Cover Sheet'!$E$19","v":0},{"$f":"'Cover Sheet'!$E$23","v":"00:00:00"},15,{"$f":"'Form 10C'!P13/'Cover Sheet'!$E$27","v":{"$error":"#DIV/0!"}}]
["F10C",104,{"$f":"'Cover Sheet'!$E$19","v":0},{"$f":"'Cover Sheet'!$E$23","v":"00:00:00"},15,{"$f":"'Form 10C'!P14/'Cover Sheet'!$E$27","v":{"$error":"#DIV/0!"}}]
["F10C",105,{"$f":"'Cover Sheet'!$E$19","v":0},{"$f":"'Cover Sheet'!$E$23","v":"00:00:00"},15,{"$f":"'Form 10C'!P15/'Cover Sheet'!$E$27","v":{"$error":"#DIV/0!"}}]
["F10C",106,{"$f":"'Cover Sheet'!$E$19","v":0},{"$f":"'Cover Sheet'!$E$23","v":"00:00:00"},15,{"$f":"'Form 10C'!P16/'Cover Sheet'!$E$27","v":{"$error":"#DIV/0!"}}]
["F10C",107,{"$f":"'Cover Sheet'!$E$19","v":0},{"$f":"'Cover Sheet'!$E$23","v":"00:00:00"},15,{"$f":"'Form 10C'!P17/'Cover Sheet'!$E$27","v":{"$error":"#DIV/0!"}}]
["F10C",108,{"$f":"'Cover Sheet'!$E$19","v":0},{"$f":"'Cover Sheet'!$E$23","v":"00:00:00"},15,{"$f":"'Form 10C'!P18/'Cover Sheet'!$E$27","v":{"$error":"#DIV/0!"}}]
["F10C",109,{"$f":"'Cover Sheet'!$E$19","v":0},{"$f":"'Cover Sheet'!$E$23","v":"00:00:00"},15,{"$f":"'Form 10C'!P19/'Cover Sheet'!$E$27","v":{"$error":"#DIV/0!"}}]
["F10C",110,{"$f":"'Cover Sheet'!$E$19","v":0},{"$f":"'Cover Sheet'!$E$23","v":"00:00:00"},15,{"$f":"'Form 10C'!P20/'Cover Sheet'!$E$27","v":{"$error":"#DIV/0!"}}]
["F10C",111,{"$f":"'Cover Sheet'!$E$19","v":0},{"$f":"'Cover Sheet'!$E$23","v":"00:00:00"},15,{"$f":"'Form 10C'!P21/'Cover Sheet'!$E$27","v":{"$error":"#DIV/0!"}}]
["F10C",112,{"$f":"'Cover Sheet'!$E$19","v":0},{"$f":"'Cover Sheet'!$E$23","v":"00:00:00"},15,{"$f":"'Form 10C'!P22/'Cover Sheet'!$E$27","v":{"$error":"#DIV/0!"}}]
["F10C",113,{"$f":"'Cover Sheet'!$E$19","v":0},{"$f":"'Cover Sheet'!$E$23","v":"00:00:00"},15,{"$f":"'Form 10C'!P23/'Cover Sheet'!$E$27","v":{"$error":"#DIV/0!"}}]
["F10C",114,{"$f":"'Cover Sheet'!$E$19","v":0},{"$f":"'Cover Sheet'!$E$23","v":"00:00:00"},15,{"$f":"'Form 10C'!P24/'Cover Sheet'!$E$27","v":{"$error":"#DIV/0!"}}]
["F10C",115,{"$f":"'Cover Sheet'!$E$19","v":0},{"$f":"'Cover Sheet'!$E$23","v":"00:00:00"},15,{"$f":"'Form 10C'!P25/'Cover Sheet'!$E$27","v":{"$error":"#DIV/0!"}}]
["F10C",116,{"$f":"'Cover Sheet'!$E$19","v":0},{"$f":"'Cover Sheet'!$E$23","v":"00:00:00"},15,{"$f":"'Form 10C'!P26/'Cover Sheet'!$E$27","v":{"$error":"#DIV/0!"}}]
["F10C",117,{"$f":"'Cover Sheet'!$E$19","v":0},{"$f":"'Cover Sheet'!$E$23","v":"00:00:00"},15,{"$f":"'Form 10C'!P27/'Cover Sheet'!$E$27","v":{"$error":"#DIV/0!"}}]
["F10C",118,{"$f":"'Cover Sheet'!$E$19","v":0},{"$f":"'Cover Sheet'!$E$23","v":"00:00:00"},15,{"$f":"'Form 10C'!P28/'Cover Sheet'!$E$27","v":{"$error":"#DIV/0!"}}]
["F10C",119,{"$f":"'Cover Sheet'!$E$19","v":0},{"$f":"'Cover Sheet'!$E$23","v":"00:00:00"},15,{"$f":"'Form 10C'!P29/'Cover Sheet'!$E$27","v":{"$error":"#DIV/0!"}}]
["F10C",120,{"$f":"'Cover Sheet'!$E$19","v":0},{"$f":"'Cover Sheet'!$E$23","v":"00:00:00"},15,{"$f":"'Form 10C'!P30/'Cover Sheet'!$E$27","v":{"$error":"#DIV/0!"}}]
["F10C",121,{"$f":"'Cover Sheet'!$E$19","v":0},{"$f":"'Cover Sheet'!$E$23","v":"00:00:00"},15,{"$f":"'Form 10C'!P31/'Cover Sheet'!$E$27","v":{"$error":"#DIV/0!"}}]
["F10C",122,{"$f":"'Cover Sheet'!$E$19","v":0},{"$f":"'Cover Sheet'!$E$23","v":"00:00:00"},15,{"$f":"'Form 10C'!P32/'Cover Sheet'!$E$27","v":{"$error":"#DIV/0!"}}]
["F10C",123,{"$f":"'Cover Sheet'!$E$19","v":0},{"$f":"'Cover Sheet'!$E$23","v":"00:00:00"},15,{"$f":"'Form 10C'!P33/'Cover Sheet'!$E$27","v":{"$error":"#DIV/0!"}}]
["F10C",124,{"$f":"'Cover Sheet'!$E$19","v":0},{"$f":"'Cover Sheet'!$E$23","v":"00:00:00"},15,{"$f":"'Form 10C'!P34/'Cover Sheet'!$E$27","v":{"$error":"#DIV/0!"}}]
["F10C",125,{"$f":"'Cover Sheet'!$E$19","v":0},{"$f":"'Cover Sheet'!$E$23","v":"00:00:00"},15,{"$f":"'Form 10C'!P35/'Cover Sheet'!$E$27","v":{"$error":"#DIV/0!"}}]
["F10C",126,{"$f":"'Cover Sheet'!$E$19","v":0},{"$f":"'Cover Sheet'!$E$23","v":"00:00:00"},15,{"$f":"'Form 10C'!P36/'Cover Sheet'!$E$27","v":{"$error":"#DIV/0!"}}]
["F10C",127,{"$f":"'Cover Sheet'!$E$19","v":0},{"$f":"'Cover Sheet'!$E$23","v":"00:00:00"},15,{"$f":"'Form 10C'!P37/'Cover Sheet'!$E$27","v":{"$error":"#DIV/0!"}}]
["F10C",128,{"$f":"'Cover Sheet'!$E$19","v":0},{"$f":"'Cover Sheet'!$E$23","v":"00:00:00"},15,{"$f":"'Form 10C'!P38/'Cover Sheet'!$E$27","v":{"$error":"#DIV/0!"}}]
["F10C",129,{"$f":"'Cover Sheet'!$E$19","v":0},{"$f":"'Cover Sheet'!$E$23","v":"00:00:00"},15,{"$f":"'Form 10C'!P39/'Cover Sheet'!$E$27","v":{"$error":"#DIV/0!"}}]
["F10C",130,{"$f":"'Cover Sheet'!$E$19","v":0},{"$f":"'Cover Sheet'!$E$23","v":"00:00:00"},15,{"$f":"'Form 10C'!P40/'Cover Sheet'!$E$27","v":{"$error":"#DIV/0!"}}]
["F10C",131,{"$f":"'Cover Sheet'!$E$19","v":0},{"$f":"'Cover Sheet'!$E$23","v":"00:00:00"},15,{"$f":"'Form 10C'!P41/'Cover Sheet'!$E$27","v":{"$error":"#DIV/0!"}}]
["F10C",101,{"$f":"'Cover Sheet'!$E$19","v":0},{"$f":"'Cover Sheet'!$E$23","v":"00:00:00"},16,{"$f":"'Form 10C'!Q11/'Cover Sheet'!$E$27","v":{"$error":"#DIV/0!"}}]
["F10C",102,{"$f":"'Cover Sheet'!$E$19","v":0},{"$f":"'Cover Sheet'!$E$23","v":"00:00:00"},16,{"$f":"'Form 10C'!Q12/'Cover Sheet'!$E$27","v":{"$error":"#DIV/0!"}}]
["F10C",103,{"$f":"'Cover Sheet'!$E$19","v":0},{"$f":"'Cover Sheet'!$E$23","v":"00:00:00"},16,{"$f":"'Form 10C'!Q13/'Cover Sheet'!$E$27","v":{"$error":"#DIV/0!"}}]
["F10C",104,{"$f":"'Cover Sheet'!$E$19","v":0},{"$f":"'Cover Sheet'!$E$23","v":"00:00:00"},16,{"$f":"'Form 10C'!Q14/'Cover Sheet'!$E$27","v":{"$error":"#DIV/0!"}}]
["F10C",105,{"$f":"'Cover Sheet'!$E$19","v":0},{"$f":"'Cover Sheet'!$E$23","v":"00:00:00"},16,{"$f":"'Form 10C'!Q15/'Cover Sheet'!$E$27","v":{"$error":"#DIV/0!"}}]
["F10C",106,{"$f":"'Cover Sheet'!$E$19","v":0},{"$f":"'Cover Sheet'!$E$23","v":"00:00:00"},16,{"$f":"'Form 10C'!Q16/'Cover Sheet'!$E$27","v":{"$error":"#DIV/0!"}}]
["F10C",107,{"$f":"'Cover Sheet'!$E$19","v":0},{"$f":"'Cover Sheet'!$E$23","v":"00:00:00"},16,{"$f":"'Form 10C'!Q17/'Cover Sheet'!$E$27","v":{"$error":"#DIV/0!"}}]
["F10C",108,{"$f":"'Cover Sheet'!$E$19","v":0},{"$f":"'Cover Sheet'!$E$23","v":"00:00:00"},16,{"$f":"'Form 10C'!Q18/'Cover Sheet'!$E$27","v":{"$error":"#DIV/0!"}}]
["F10C",109,{"$f":"'Cover Sheet'!$E$19","v":0},{"$f":"'Cover Sheet'!$E$23","v":"00:00:00"},16,{"$f":"'Form 10C'!Q19/'Cover Sheet'!$E$27","v":{"$error":"#DIV/0!"}}]
["F10C",110,{"$f":"'Cover Sheet'!$E$19","v":0},{"$f":"'Cover Sheet'!$E$23","v":"00:00:00"},16,{"$f":"'Form 10C'!Q20/'Cover Sheet'!$E$27","v":{"$error":"#DIV/0!"}}]
["F10C",111,{"$f":"'Cover Sheet'!$E$19","v":0},{"$f":"'Cover Sheet'!$E$23","v":"00:00:00"},16,{"$f":"'Form 10C'!Q21/'Cover Sheet'!$E$27","v":{"$error":"#DIV/0!"}}]
["F10C",112,{"$f":"'Cover Sheet'!$E$19","v":0},{"$f":"'Cover Sheet'!$E$23","v":"00:00:00"},16,{"$f":"'Form 10C'!Q22/'Cover Sheet'!$E$27","v":{"$error":"#DIV/0!"}}]
["F10C",113,{"$f":"'Cover Sheet'!$E$19","v":0},{"$f":"'Cover Sheet'!$E$23","v":"00:00:00"},16,{"$f":"'Form 10C'!Q23/'Cover Sheet'!$E$27","v":{"$error":"#DIV/0!"}}]
["F10C",114,{"$f":"'Cover Sheet'!$E$19","v":0},{"$f":"'Cover Sheet'!$E$23","v":"00:00:00"},16,{"$f":"'Form 10C'!Q24/'Cover Sheet'!$E$27","v":{"$error":"#DIV/0!"}}]
["F10C",115,{"$f":"'Cover Sheet'!$E$19","v":0},{"$f":"'Cover Sheet'!$E$23","v":"00:00:00"},16,{"$f":"'Form 10C'!Q25/'Cover Sheet'!$E$27","v":{"$error":"#DIV/0!"}}]
["F10C",116,{"$f":"'Cover Sheet'!$E$19","v":0},{"$f":"'Cover Sheet'!$E$23","v":"00:00:00"},16,{"$f":"'Form 10C'!Q26/'Cover Sheet'!$E$27","v":{"$error":"#DIV/0!"}}]
["F10C",117,{"$f":"'Cover Sheet'!$E$19","v":0},{"$f":"'Cover Sheet'!$E$23","v":"00:00:00"},16,{"$f":"'Form 10C'!Q27/'Cover Sheet'!$E$27","v":{"$error":"#DIV/0!"}}]
["F10C",118,{"$f":"'Cover Sheet'!$E$19","v":0},{"$f":"'Cover Sheet'!$E$23","v":"00:00:00"},16,{"$f":"'Form 10C'!Q28/'Cover Sheet'!$E$27","v":{"$error":"#DIV/0!"}}]
["F10C",119,{"$f":"'Cover Sheet'!$E$19","v":0},{"$f":"'Cover Sheet'!$E$23","v":"00:00:00"},16,{"$f":"'Form 10C'!Q29/'Cover Sheet'!$E$27","v":{"$error":"#DIV/0!"}}]
["F10C",120,{"$f":"'Cover Sheet'!$E$19","v":0},{"$f":"'Cover Sheet'!$E$23","v":"00:00:00"},16,{"$f":"'Form 10C'!Q30/'Cover Sheet'!$E$27","v":{"$error":"#DIV/0!"}}]
["F10C",121,{"$f":"'Cover Sheet'!$E$19","v":0},{"$f":"'Cover Sheet'!$E$23","v":"00:00:00"},16,{"$f":"'Form 10C'!Q31/'Cover Sheet'!$E$27","v":{"$error":"#DIV/0!"}}]
["F10C",122,{"$f":"'Cover Sheet'!$E$19","v":0},{"$f":"'Cover Sheet'!$E$23","v":"00:00:00"},16,{"$f":"'Form 10C'!Q32/'Cover Sheet'!$E$27","v":{"$error":"#DIV/0!"}}]
["F10C",123,{"$f":"'Cover Sheet'!$E$19","v":0},{"$f":"'Cover Sheet'!$E$23","v":"00:00:00"},16,{"$f":"'Form 10C'!Q33/'Cover Sheet'!$E$27","v":{"$error":"#DIV/0!"}}]
["F10C",124,{"$f":"'Cover Sheet'!$E$19","v":0},{"$f":"'Cover Sheet'!$E$23","v":"00:00:00"},16,{"$f":"'Form 10C'!Q34/'Cover Sheet'!$E$27","v":{"$error":"#DIV/0!"}}]
["F10C",125,{"$f":"'Cover Sheet'!$E$19","v":0},{"$f":"'Cover Sheet'!$E$23","v":"00:00:00"},16,{"$f":"'Form 10C'!Q35/'Cover Sheet'!$E$27","v":{"$error":"#DIV/0!"}}]
["F10C",126,{"$f":"'Cover Sheet'!$E$19","v":0},{"$f":"'Cover Sheet'!$E$23","v":"00:00:00"},16,{"$f":"'Form 10C'!Q36/'Cover Sheet'!$E$27","v":{"$error":"#DIV/0!"}}]
["F10C",127,{"$f":"'Cover Sheet'!$E$19","v":0},{"$f":"'Cover Sheet'!$E$23","v":"00:00:00"},16,{"$f":"'Form 10C'!Q37/'Cover Sheet'!$E$27","v":{"$error":"#DIV/0!"}}]
["F10C",128,{"$f":"'Cover Sheet'!$E$19","v":0},{"$f":"'Cover Sheet'!$E$23","v":"00:00:00"},16,{"$f":"'Form 10C'!Q38/'Cover Sheet'!$E$27","v":{"$error":"#DIV/0!"}}]
["F10C",129,{"$f":"'Cover Sheet'!$E$19","v":0},{"$f":"'Cover Sheet'!$E$23","v":"00:00:00"},16,{"$f":"'Form 10C'!Q39/'Cover Sheet'!$E$27","v":{"$error":"#DIV/0!"}}]
["F10C",130,{"$f":"'Cover Sheet'!$E$19","v":0},{"$f":"'Cover Sheet'!$E$23","v":"00:00:00"},16,{"$f":"'Form 10C'!Q40/'Cover Sheet'!$E$27","v":{"$error":"#DIV/0!"}}]
["F10C",131,{"$f":"'Cover Sheet'!$E$19","v":0},{"$f":"'Cover Sheet'!$E$23","v":"00:00:00"},16,{"$f":"'Form 10C'!Q41/'Cover Sheet'!$E$27","v":{"$error":"#DIV/0!"}}]
["F10C",101,{"$f":"'Cover Sheet'!$E$19","v":0},{"$f":"'Cover Sheet'!$E$23","v":"00:00:00"},17,{"$f":"'Form 10C'!R11/'Cover Sheet'!$E$27","v":{"$error":"#DIV/0!"}}]
["F10C",102,{"$f":"'Cover Sheet'!$E$19","v":0},{"$f":"'Cover Sheet'!$E$23","v":"00:00:00"},17,{"$f":"'Form 10C'!R12/'Cover Sheet'!$E$27","v":{"$error":"#DIV/0!"}}]
["F10C",103,{"$f":"'Cover Sheet'!$E$19","v":0},{"$f":"'Cover Sheet'!$E$23","v":"00:00:00"},17,{"$f":"'Form 10C'!R13/'Cover Sheet'!$E$27","v":{"$error":"#DIV/0!"}}]
["F10C",104,{"$f":"'Cover Sheet'!$E$19","v":0},{"$f":"'Cover Sheet'!$E$23","v":"00:00:00"},17,{"$f":"'Form 10C'!R14/'Cover Sheet'!$E$27","v":{"$error":"#DIV/0!"}}]
["F10C",105,{"$f":"'Cover Sheet'!$E$19","v":0},{"$f":"'Cover Sheet'!$E$23","v":"00:00:00"},17,{"$f":"'Form 10C'!R15/'Cover Sheet'!$E$27","v":{"$error":"#DIV/0!"}}]
["F10C",106,{"$f":"'Cover Sheet'!$E$19","v":0},{"$f":"'Cover Sheet'!$E$23","v":"00:00:00"},17,{"$f":"'Form 10C'!R16/'Cover Sheet'!$E$27","v":{"$error":"#DIV/0!"}}]
["F10C",107,{"$f":"'Cover Sheet'!$E$19","v":0},{"$f":"'Cover Sheet'!$E$23","v":"00:00:00"},17,{"$f":"'Form 10C'!R17/'Cover Sheet'!$E$27","v":{"$error":"#DIV/0!"}}]
["F10C",108,{"$f":"'Cover Sheet'!$E$19","v":0},{"$f":"'Cover Sheet'!$E$23","v":"00:00:00"},17,{"$f":"'Form 10C'!R18/'Cover Sheet'!$E$27","v":{"$error":"#DIV/0!"}}]
["F10C",109,{"$f":"'Cover Sheet'!$E$19","v":0},{"$f":"'Cover Sheet'!$E$23","v":"00:00:00"},17,{"$f":"'Form 10C'!R19/'Cover Sheet'!$E$27","v":{"$error":"#DIV/0!"}}]
["F10C",110,{"$f":"'Cover Sheet'!$E$19","v":0},{"$f":"'Cover Sheet'!$E$23","v":"00:00:00"},17,{"$f":"'Form 10C'!R20/'Cover Sheet'!$E$27","v":{"$error":"#DIV/0!"}}]
["F10C",111,{"$f":"'Cover Sheet'!$E$19","v":0},{"$f":"'Cover Sheet'!$E$23","v":"00:00:00"},17,{"$f":"'Form 10C'!R21/'Cover Sheet'!$E$27","v":{"$error":"#DIV/0!"}}]
["F10C",112,{"$f":"'Cover Sheet'!$E$19","v":0},{"$f":"'Cover Sheet'!$E$23","v":"00:00:00"},17,{"$f":"'Form 10C'!R22/'Cover Sheet'!$E$27","v":{"$error":"#DIV/0!"}}]
["F10C",113,{"$f":"'Cover Sheet'!$E$19","v":0},{"$f":"'Cover Sheet'!$E$23","v":"00:00:00"},17,{"$f":"'Form 10C'!R23/'Cover Sheet'!$E$27","v":{"$error":"#DIV/0!"}}]
["F10C",114,{"$f":"'Cover Sheet'!$E$19","v":0},{"$f":"'Cover Sheet'!$E$23","v":"00:00:00"},17,{"$f":"'Form 10C'!R24/'Cover Sheet'!$E$27","v":{"$error":"#DIV/0!"}}]
["F10C",115,{"$f":"'Cover Sheet'!$E$19","v":0},{"$f":"'Cover Sheet'!$E$23","v":"00:00:00"},17,{"$f":"'Form 10C'!R25/'Cover Sheet'!$E$27","v":{"$error":"#DIV/0!"}}]
["F10C",116,{"$f":"'Cover Sheet'!$E$19","v":0},{"$f":"'Cover Sheet'!$E$23","v":"00:00:00"},17,{"$f":"'Form 10C'!R26/'Cover Sheet'!$E$27","v":{"$error":"#DIV/0!"}}]
["F10C",117,{"$f":"'Cover Sheet'!$E$19","v":0},{"$f":"'Cover Sheet'!$E$23","v":"00:00:00"},17,{"$f":"'Form 10C'!R27/'Cover Sheet'!$E$27","v":{"$error":"#DIV/0!"}}]
["F10C",118,{"$f":"'Cover Sheet'!$E$19","v":0},{"$f":"'Cover Sheet'!$E$23","v":"00:00:00"},17,{"$f":"'Form 10C'!R28/'Cover Sheet'!$E$27","v":{"$error":"#DIV/0!"}}]
["F10C",119,{"$f":"'Cover Sheet'!$E$19","v":0},{"$f":"'Cover Sheet'!$E$23","v":"00:00:00"},17,{"$f":"'Form 10C'!R29/'Cover Sheet'!$E$27","v":{"$error":"#DIV/0!"}}]
["F10C",120,{"$f":"'Cover Sheet'!$E$19","v":0},{"$f":"'Cover Sheet'!$E$23","v":"00:00:00"},17,{"$f":"'Form 10C'!R30/'Cover Sheet'!$E$27","v":{"$error":"#DIV/0!"}}]
["F10C",121,{"$f":"'Cover Sheet'!$E$19","v":0},{"$f":"'Cover Sheet'!$E$23","v":"00:00:00"},17,{"$f":"'Form 10C'!R31/'Cover Sheet'!$E$27","v":{"$error":"#DIV/0!"}}]
["F10C",122,{"$f":"'Cover Sheet'!$E$19","v":0},{"$f":"'Cover Sheet'!$E$23","v":"00:00:00"},17,{"$f":"'Form 10C'!R32/'Cover Sheet'!$E$27","v":{"$error":"#DIV/0!"}}]
["F10C",123,{"$f":"'Cover Sheet'!$E$19","v":0},{"$f":"'Cover Sheet'!$E$23","v":"00:00:00"},17,{"$f":"'Form 10C'!R33/'Cover Sheet'!$E$27","v":{"$error":"#DIV/0!"}}]
["F10C",124,{"$f":"'Cover Sheet'!$E$19","v":0},{"$f":"'Cover Sheet'!$E$23","v":"00:00:00"},17,{"$f":"'Form 10C'!R34/'Cover Sheet'!$E$27","v":{"$error":"#DIV/0!"}}]
["F10C",125,{"$f":"'Cover Sheet'!$E$19","v":0},{"$f":"'Cover Sheet'!$E$23","v":"00:00:00"},17,{"$f":"'Form 10C'!R35/'Cover Sheet'!$E$27","v":{"$error":"#DIV/0!"}}]
["F10C",126,{"$f":"'Cover Sheet'!$E$19","v":0},{"$f":"'Cover Sheet'!$E$23","v":"00:00:00"},17,{"$f":"'Form 10C'!R36/'Cover Sheet'!$E$27","v":{"$error":"#DIV/0!"}}]
["F10C",127,{"$f":"'Cover Sheet'!$E$19","v":0},{"$f":"'Cover Sheet'!$E$23","v":"00:00:00"},17,{"$f":"'Form 10C'!R37/'Cover Sheet'!$E$27","v":{"$error":"#DIV/0!"}}]
["F10C",128,{"$f":"'Cover Sheet'!$E$19","v":0},{"$f":"'Cover Sheet'!$E$23","v":"00:00:00"},17,{"$f":"'Form 10C'!R38/'Cover Sheet'!$E$27","v":{"$error":"#DIV/0!"}}]
["F10C",129,{"$f":"'Cover Sheet'!$E$19","v":0},{"$f":"'Cover Sheet'!$E$23","v":"00:00:00"},17,{"$f":"'Form 10C'!R39/'Cover Sheet'!$E$27","v":{"$error":"#DIV/0!"}}]
["F10C",130,{"$f":"'Cover Sheet'!$E$19","v":0},{"$f":"'Cover Sheet'!$E$23","v":"00:00:00"},17,{"$f":"'Form 10C'!R40/'Cover Sheet'!$E$27","v":{"$error":"#DIV/0!"}}]
["F10C",131,{"$f":"'Cover Sheet'!$E$19","v":0},{"$f":"'Cover Sheet'!$E$23","v":"00:00:00"},17,{"$f":"'Form 10C'!R41/'Cover Sheet'!$E$27","v":{"$error":"#DIV/0!"}}]
["F10C",101,{"$f":"'Cover Sheet'!$E$19","v":0},{"$f":"'Cover Sheet'!$E$23","v":"00:00:00"},18,{"$f":"'Form 10C'!S11/'Cover Sheet'!$E$27","v":{"$error":"#DIV/0!"}}]
["F10C",102,{"$f":"'Cover Sheet'!$E$19","v":0},{"$f":"'Cover Sheet'!$E$23","v":"00:00:00"},18,{"$f":"'Form 10C'!S12/'Cover Sheet'!$E$27","v":{"$error":"#DIV/0!"}}]
["F10C",103,{"$f":"'Cover Sheet'!$E$19","v":0},{"$f":"'Cover Sheet'!$E$23","v":"00:00:00"},18,{"$f":"'Form 10C'!S13/'Cover Sheet'!$E$27","v":{"$error":"#DIV/0!"}}]
["F10C",104,{"$f":"'Cover Sheet'!$E$19","v":0},{"$f":"'Cover Sheet'!$E$23","v":"00:00:00"},18,{"$f":"'Form 10C'!S14/'Cover Sheet'!$E$27","v":{"$error":"#DIV/0!"}}]
["F10C",105,{"$f":"'Cover Sheet'!$E$19","v":0},{"$f":"'Cover Sheet'!$E$23","v":"00:00:00"},18,{"$f":"'Form 10C'!S15/'Cover Sheet'!$E$27","v":{"$error":"#DIV/0!"}}]
["F10C",106,{"$f":"'Cover Sheet'!$E$19","v":0},{"$f":"'Cover Sheet'!$E$23","v":"00:00:00"},18,{"$f":"'Form 10C'!S16/'Cover Sheet'!$E$27","v":{"$error":"#DIV/0!"}}]
["F10C",107,{"$f":"'Cover Sheet'!$E$19","v":0},{"$f":"'Cover Sheet'!$E$23","v":"00:00:00"},18,{"$f":"'Form 10C'!S17/'Cover Sheet'!$E$27","v":{"$error":"#DIV/0!"}}]
["F10C",108,{"$f":"'Cover Sheet'!$E$19","v":0},{"$f":"'Cover Sheet'!$E$23","v":"00:00:00"},18,{"$f":"'Form 10C'!S18/'Cover Sheet'!$E$27","v":{"$error":"#DIV/0!"}}]
["F10C",109,{"$f":"'Cover Sheet'!$E$19","v":0},{"$f":"'Cover Sheet'!$E$23","v":"00:00:00"},18,{"$f":"'Form 10C'!S19/'Cover Sheet'!$E$27","v":{"$error":"#DIV/0!"}}]
["F10C",110,{"$f":"'Cover Sheet'!$E$19","v":0},{"$f":"'Cover Sheet'!$E$23","v":"00:00:00"},18,{"$f":"'Form 10C'!S20/'Cover Sheet'!$E$27","v":{"$error":"#DIV/0!"}}]
["F10C",111,{"$f":"'Cover Sheet'!$E$19","v":0},{"$f":"'Cover Sheet'!$E$23","v":"00:00:00"},18,{"$f":"'Form 10C'!S21/'Cover Sheet'!$E$27","v":{"$error":"#DIV/0!"}}]
["F10C",112,{"$f":"'Cover Sheet'!$E$19","v":0},{"$f":"'Cover Sheet'!$E$23","v":"00:00:00"},18,{"$f":"'Form 10C'!S22/'Cover Sheet'!$E$27","v":{"$error":"#DIV/0!"}}]
["F10C",113,{"$f":"'Cover Sheet'!$E$19","v":0},{"$f":"'Cover Sheet'!$E$23","v":"00:00:00"},18,{"$f":"'Form 10C'!S23/'Cover Sheet'!$E$27","v":{"$error":"#DIV/0!"}}]
["F10C",114,{"$f":"'Cover Sheet'!$E$19","v":0},{"$f":"'Cover Sheet'!$E$23","v":"00:00:00"},18,{"$f":"'Form 10C'!S24/'Cover Sheet'!$E$27","v":{"$error":"#DIV/0!"}}]
["F10C",115,{"$f":"'Cover Sheet'!$E$19","v":0},{"$f":"'Cover Sheet'!$E$23","v":"00:00:00"},18,{"$f":"'Form 10C'!S25/'Cover Sheet'!$E$27","v":{"$error":"#DIV/0!"}}]
["F10C",116,{"$f":"'Cover Sheet'!$E$19","v":0},{"$f":"'Cover Sheet'!$E$23","v":"00:00:00"},18,{"$f":"'Form 10C'!S26/'Cover Sheet'!$E$27","v":{"$error":"#DIV/0!"}}]
["F10C",117,{"$f":"'Cover Sheet'!$E$19","v":0},{"$f":"'Cover Sheet'!$E$23","v":"00:00:00"},18,{"$f":"'Form 10C'!S27/'Cover Sheet'!$E$27","v":{"$error":"#DIV/0!"}}]
["F10C",118,{"$f":"'Cover Sheet'!$E$19","v":0},{"$f":"'Cover Sheet'!$E$23","v":"00:00:00"},18,{"$f":"'Form 10C'!S28/'Cover Sheet'!$E$27","v":{"$error":"#DIV/0!"}}]
["F10C",119,{"$f":"'Cover Sheet'!$E$19","v":0},{"$f":"'Cover Sheet'!$E$23","v":"00:00:00"},18,{"$f":"'Form 10C'!S29/'Cover Sheet'!$E$27","v":{"$error":"#DIV/0!"}}]
["F10C",120,{"$f":"'Cover Sheet'!$E$19","v":0},{"$f":"'Cover Sheet'!$E$23","v":"00:00:00"},18,{"$f":"'Form 10C'!S30/'Cover Sheet'!$E$27","v":{"$error":"#DIV/0!"}}]
["F10C",121,{"$f":"'Cover Sheet'!$E$19","v":0},{"$f":"'Cover Sheet'!$E$23","v":"00:00:00"},18,{"$f":"'Form 10C'!S31/'Cover Sheet'!$E$27","v":{"$error":"#DIV/0!"}}]
["F10C",122,{"$f":"'Cover Sheet'!$E$19","v":0},{"$f":"'Cover Sheet'!$E$23","v":"00:00:00"},18,{"$f":"'Form 10C'!S32/'Cover Sheet'!$E$27","v":{"$error":"#DIV/0!"}}]
["F10C",123,{"$f":"'Cover Sheet'!$E$19","v":0},{"$f":"'Cover Sheet'!$E$23","v":"00:00:00"},18,{"$f":"'Form 10C'!S33/'Cover Sheet'!$E$27","v":{"$error":"#DIV/0!"}}]
["F10C",124,{"$f":"'Cover Sheet'!$E$19","v":0},{"$f":"'Cover Sheet'!$E$23","v":"00:00:00"},18,{"$f":"'Form 10C'!S34/'Cover Sheet'!$E$27","v":{"$error":"#DIV/0!"}}]
["F10C",125,{"$f":"'Cover Sheet'!$E$19","v":0},{"$f":"'Cover Sheet'!$E$23","v":"00:00:00"},18,{"$f":"'Form 10C'!S35/'Cover Sheet'!$E$27","v":{"$error":"#DIV/0!"}}]
["F10C",126,{"$f":"'Cover Sheet'!$E$19","v":0},{"$f":"'Cover Sheet'!$E$23","v":"00:00:00"},18,{"$f":"'Form 10C'!S36/'Cover Sheet'!$E$27","v":{"$error":"#DIV/0!"}}]
["F10C",127,{"$f":"'Cover Sheet'!$E$19","v":0},{"$f":"'Cover Sheet'!$E$23","v":"00:00:00"},18,{"$f":"'Form 10C'!S37/'Cover Sheet'!$E$27","v":{"$error":"#DIV/0!"}}]
["F10C",128,{"$f":"'Cover Sheet'!$E$19","v":0},{"$f":"'Cover Sheet'!$E$23","v":"00:00:00"},18,{"$f":"'Form 10C'!S38/'Cover Sheet'!$E$27","v":{"$error":"#DIV/0!"}}]
["F10C",129,{"$f":"'Cover Sheet'!$E$19","v":0},{"$f":"'Cover Sheet'!$E$23","v":"00:00:00"},18,{"$f":"'Form 10C'!S39/'Cover Sheet'!$E$27","v":{"$error":"#DIV/0!"}}]
["F10C",130,{"$f":"'Cover Sheet'!$E$19","v":0},{"$f":"'Cover Sheet'!$E$23","v":"00:00:00"},18,{"$f":"'Form 10C'!S40/'Cover Sheet'!$E$27","v":{"$error":"#DIV/0!"}}]
["F10C",131,{"$f":"'Cover Sheet'!$E$19","v":0},{"$f":"'Cover Sheet'!$E$23","v":"00:00:00"},18,{"$f":"'Form 10C'!S41/'Cover Sheet'!$E$27","v":{"$error":"#DIV/0!"}}]
["F10C",101,{"$f":"'Cover Sheet'!$E$19","v":0},{"$f":"'Cover Sheet'!$E$23","v":"00:00:00"},19,{"$f":"'Form 10C'!T11","v":0}]
["F10C",102,{"$f":"'Cover Sheet'!$E$19","v":0},{"$f":"'Cover Sheet'!$E$23","v":"00:00:00"},19,{"$f":"'Form 10C'!T12","v":0}]
["F10C",103,{"$f":"'Cover Sheet'!$E$19","v":0},{"$f":"'Cover Sheet'!$E$23","v":"00:00:00"},19,{"$f":"'Form 10C'!T13","v":0}]
["F10C",104,{"$f":"'Cover Sheet'!$E$19","v":0},{"$f":"'Cover Sheet'!$E$23","v":"00:00:00"},19,{"$f":"'Form 10C'!T14","v":0}]
["F10C",105,{"$f":"'Cover Sheet'!$E$19","v":0},{"$f":"'Cover Sheet'!$E$23","v":"00:00:00"},19,{"$f":"'Form 10C'!T15","v":0}]
["F10C",106,{"$f":"'Cover Sheet'!$E$19","v":0},{"$f":"'Cover Sheet'!$E$23","v":"00:00:00"},19,{"$f":"'Form 10C'!T16","v":0}]
["F10C",107,{"$f":"'Cover Sheet'!$E$19","v":0},{"$f":"'Cover Sheet'!$E$23","v":"00:00:00"},19,{"$f":"'Form 10C'!T17","v":0}]
["F10C",108,{"$f":"'Cover Sheet'!$E$19","v":0},{"$f":"'Cover Sheet'!$E$23","v":"00:00:00"},19,{"$f":"'Form 10C'!T18","v":0}]
["F10C",109,{"$f":"'Cover Sheet'!$E$19","v":0},{"$f":"'Cover Sheet'!$E$23","v":"00:00:00"},19,{"$f":"'Form 10C'!T19","v":0}]
["F10C",110,{"$f":"'Cover Sheet'!$E$19","v":0},{"$f":"'Cover Sheet'!$E$23","v":"00:00:00"},19,{"$f":"'Form 10C'!T20","v":0}]
["F10C",111,{"$f":"'Cover Sheet'!$E$19","v":0},{"$f":"'Cover Sheet'!$E$23","v":"00:00:00"},19,{"$f":"'Form 10C'!T21","v":0}]
["F10C",112,{"$f":"'Cover Sheet'!$E$19","v":0},{"$f":"'Cover Sheet'!$E$23","v":"00:00:00"},19,{"$f":"'Form 10C'!T22","v":0}]
["F10C",113,{"$f":"'Cover Sheet'!$E$19","v":0},{"$f":"'Cover Sheet'!$E$23","v":"00:00:00"},19,{"$f":"'Form 10C'!T23","v":0}]
["F10C",114,{"$f":"'Cover Sheet'!$E$19","v":0},{"$f":"'Cover Sheet'!$E$23","v":"00:00:00"},19,{"$f":"'Form 10C'!T24","v":0}]
["F10C",115,{"$f":"'Cover Sheet'!$E$19","v":0},{"$f":"'Cover Sheet'!$E$23","v":"00:00:00"},19,{"$f":"'Form 10C'!T25","v":0}]
["F10C",116,{"$f":"'Cover Sheet'!$E$19","v":0},{"$f":"'Cover Sheet'!$E$23","v":"00:00:00"},19,{"$f":"'Form 10C'!T26","v":0}]
["F10C",117,{"$f":"'Cover Sheet'!$E$19","v":0},{"$f":"'Cover Sheet'!$E$23","v":"00:00:00"},19,{"$f":"'Form 10C'!T27","v":0}]
["F10C",118,{"$f":"'Cover Sheet'!$E$19","v":0},{"$f":"'Cover Sheet'!$E$23","v":"00:00:00"},19,{"$f":"'Form 10C'!T28","v":0}]
["F10C",119,{"$f":"'Cover Sheet'!$E$19","v":0},{"$f":"'Cover Sheet'!$E$23","v":"00:00:00"},19,{"$f":"'Form 10C'!T29","v":0}]
["F10C",120,{"$f":"'Cover Sheet'!$E$19","v":0},{"$f":"'Cover Sheet'!$E$23","v":"00:00:00"},19,{"$f":"'Form 10C'!T30","v":0}]
["F10C",121,{"$f":"'Cover Sheet'!$E$19","v":0},{"$f":"'Cover Sheet'!$E$23","v":"00:00:00"},19,{"$f":"'Form 10C'!T31","v":0}]
["F10C",122,{"$f":"'Cover Sheet'!$E$19","v":0},{"$f":"'Cover Sheet'!$E$23","v":"00:00:00"},19,{"$f":"'Form 10C'!T32","v":0}]
["F10C",123,{"$f":"'Cover Sheet'!$E$19","v":0},{"$f":"'Cover Sheet'!$E$23","v":"00:00:00"},19,{"$f":"'Form 10C'!T33","v":0}]
["F10C",124,{"$f":"'Cover Sheet'!$E$19","v":0},{"$f":"'Cover Sheet'!$E$23","v":"00:00:00"},19,{"$f":"'Form 10C'!T34","v":0}]
["F10C",125,{"$f":"'Cover Sheet'!$E$19","v":0},{"$f":"'Cover Sheet'!$E$23","v":"00:00:00"},19,{"$f":"'Form 10C'!T35","v":0}]
["F10C",126,{"$f":"'Cover Sheet'!$E$19","v":0},{"$f":"'Cover Sheet'!$E$23","v":"00:00:00"},19,{"$f":"'Form 10C'!T36","v":0}]
["F10C",127,{"$f":"'Cover Sheet'!$E$19","v":0},{"$f":"'Cover Sheet'!$E$23","v":"00:00:00"},19,{"$f":"'Form 10C'!T37","v":0}]
["F10C",128,{"$f":"'Cover Sheet'!$E$19","v":0},{"$f":"'Cover Sheet'!$E$23","v":"00:00:00"},19,{"$f":"'Form 10C'!T38","v":0}]
["F10C",129,{"$f":"'Cover Sheet'!$E$19","v":0},{"$f":"'Cover Sheet'!$E$23","v":"00:00:00"},19,{"$f":"'Form 10C'!T39","v":0}]
["F10C",130,{"$f":"'Cover Sheet'!$E$19","v":0},{"$f":"'Cover Sheet'!$E$23","v":"00:00:00"},19,{"$f":"'Form 10C'!T40","v":0}]
["F10C",131,{"$f":"'Cover Sheet'!$E$19","v":0},{"$f":"'Cover Sheet'!$E$23","v":"00:00:00"},19,{"$f":"'Form 10C'!T41","v":0}]
["F10C",101,{"$f":"'Cover Sheet'!$E$19","v":0},{"$f":"'Cover Sheet'!$E$23","v":"00:00:00"},20,{"$f":"'Form 10C'!U11","v":0}]
["F10C",102,{"$f":"'Cover Sheet'!$E$19","v":0},{"$f":"'Cover Sheet'!$E$23","v":"00:00:00"},20,{"$f":"'Form 10C'!U12","v":0}]
["F10C",103,{"$f":"'Cover Sheet'!$E$19","v":0},{"$f":"'Cover Sheet'!$E$23","v":"00:00:00"},20,{"$f":"'Form 10C'!U13","v":0}]
["F10C",104,{"$f":"'Cover Sheet'!$E$19","v":0},{"$f":"'Cover Sheet'!$E$23","v":"00:00:00"},20,{"$f":"'Form 10C'!U14","v":0}]
["F10C",105,{"$f":"'Cover Sheet'!$E$19","v":0},{"$f":"'Cover Sheet'!$E$23","v":"00:00:00"},20,{"$f":"'Form 10C'!U15","v":0}]
["F10C",106,{"$f":"'Cover Sheet'!$E$19","v":0},{"$f":"'Cover Sheet'!$E$23","v":"00:00:00"},20,{"$f":"'Form 10C'!U16","v":0}]
["F10C",107,{"$f":"'Cover Sheet'!$E$19","v":0},{"$f":"'Cover Sheet'!$E$23","v":"00:00:00"},20,{"$f":"'Form 10C'!U17","v":0}]
["F10C",108,{"$f":"'Cover Sheet'!$E$19","v":0},{"$f":"'Cover Sheet'!$E$23","v":"00:00:00"},20,{"$f":"'Form 10C'!U18","v":0}]
["F10C",109,{"$f":"'Cover Sheet'!$E$19","v":0},{"$f":"'Cover Sheet'!$E$23","v":"00:00:00"},20,{"$f":"'Form 10C'!U19","v":0}]
["F10C",110,{"$f":"'Cover Sheet'!$E$19","v":0},{"$f":"'Cover Sheet'!$E$23","v":"00:00:00"},20,{"$f":"'Form 10C'!U20","v":0}]
["F10C",111,{"$f":"'Cover Sheet'!$E$19","v":0},{"$f":"'Cover Sheet'!$E$23","v":"00:00:00"},20,{"$f":"'Form 10C'!U21","v":0}]
["F10C",112,{"$f":"'Cover Sheet'!$E$19","v":0},{"$f":"'Cover Sheet'!$E$23","v":"00:00:00"},20,{"$f":"'Form 10C'!U22","v":0}]
["F10C",113,{"$f":"'Cover Sheet'!$E$19","v":0},{"$f":"'Cover Sheet'!$E$23","v":"00:00:00"},20,{"$f":"'Form 10C'!U23","v":0}]
["F10C",114,{"$f":"'Cover Sheet'!$E$19","v":0},{"$f":"'Cover Sheet'!$E$23","v":"00:00:00"},20,{"$f":"'Form 10C'!U24","v":0}]
["F10C",115,{"$f":"'Cover Sheet'!$E$19","v":0},{"$f":"'Cover Sheet'!$E$23","v":"00:00:00"},20,{"$f":"'Form 10C'!U25","v":0}]
["F10C",116,{"$f":"'Cover Sheet'!$E$19","v":0},{"$f":"'Cover Sheet'!$E$23","v":"00:00:00"},20,{"$f":"'Form 10C'!U26","v":0}]
["F10C",117,{"$f":"'Cover Sheet'!$E$19","v":0},{"$f":"'Cover Sheet'!$E$23","v":"00:00:00"},20,{"$f":"'Form 10C'!U27","v":0}]
["F10C",118,{"$f":"'Cover Sheet'!$E$19","v":0},{"$f":"'Cover Sheet'!$E$23","v":"00:00:00"},20,{"$f":"'Form 10C'!U28","v":0}]
["F10C",119,{"$f":"'Cover Sheet'!$E$19","v":0},{"$f":"'Cover Sheet'!$E$23","v":"00:00:00"},20,{"$f":"'Form 10C'!U29","v":0}]
["F10C",120,{"$f":"'Cover Sheet'!$E$19","v":0},{"$f":"'Cover Sheet'!$E$23","v":"00:00:00"},20,{"$f":"'Form 10C'!U30","v":0}]
["F10C",121,{"$f":"'Cover Sheet'!$E$19","v":0},{"$f":"'Cover Sheet'!$E$23","v":"00:00:00"},20,{"$f":"'Form 10C'!U31","v":0}]
["F10C",122,{"$f":"'Cover Sheet'!$E$19","v":0},{"$f":"'Cover Sheet'!$E$23","v":"00:00:00"},20,{"$f":"'Form 10C'!U32","v":0}]
["F10C",123,{"$f":"'Cover Sheet'!$E$19","v":0},{"$f":"'Cover Sheet'!$E$23","v":"00:00:00"},20,{"$f":"'Form 10C'!U33","v":0}]
["F10C",124,{"$f":"'Cover Sheet'!$E$19","v":0},{"$f":"'Cover Sheet'!$E$23","v":"00:00:00"},20,{"$f":"'Form 10C'!U34","v":0}]
["F10C",125,{"$f":"'Cover Sheet'!$E$19","v":0},{"$f":"'Cover Sheet'!$E$23","v":"00:00:00"},20,{"$f":"'Form 10C'!U35","v":0}]
["F10C",126,{"$f":"'Cover Sheet'!$E$19","v":0},{"$f":"'Cover Sheet'!$E$23","v":"00:00:00"},20,{"$f":"'Form 10C'!U36","v":0}]
["F10C",127,{"$f":"'Cover Sheet'!$E$19","v":0},{"$f":"'Cover Sheet'!$E$23","v":"00:00:00"},20,{"$f":"'Form 10C'!U37","v":0}]
["F10C",128,{"$f":"'Cover Sheet'!$E$19","v":0},{"$f":"'Cover Sheet'!$E$23","v":"00:00:00"},20,{"$f":"'Form 10C'!U38","v":0}]
["F10C",129,{"$f":"'Cover Sheet'!$E$19","v":0},{"$f":"'Cover Sheet'!$E$23","v":"00:00:00"},20,{"$f":"'Form 10C'!U39","v":0}]
["F10C",130,{"$f":"'Cover Sheet'!$E$19","v":0},{"$f":"'Cover Sheet'!$E$23","v":"00:00:00"},20,{"$f":"'Form 10C'!U40","v":0}]
["F10C",131,{"$f":"'Cover Sheet'!$E$19","v":0},{"$f":"'Cover Sheet'!$E$23","v":"00:00:00"},20,{"$f":"'Form 10C'!U41","v":0}]

{"sheet":"Form 11","index":23,"n_rows":30,"n_cols":5,"rows_kept":30,"cut":false,"hidden":false,"merged":[[21,0,22,0],[25,0,26,0],[29,0,30,0],[0,0,0,1],[9,0,10,0],[13,0,14,0],[17,0,18,0]]}
["Name of Insurance Intermediary:-",null,{"$f":"'Cover Sheet'!E17","v":0},"Year ended : ",{"$f":"IF('Cover Sheet'!$E$23=\"\",\"\",'Cover Sheet'!$E$23)","v":""}]
[]
["Form 11"]
["Underwriting Agreements"]
[]
[]
[null,"Name of authorised undertaking/undertakings and address/es in the case of companies with head office outside Malta","Group/s of classes of business ","Gross premium written under the agreement","Date of expiry of agreement"]
[null,null,null,{"$f":"IF('Cover Sheet'!$E$25=\"\",\"\",'Cover Sheet'!$E$25)","v":""}]
[]
[1]
[]
[]
[]
[2]
[]
[]
[]
[3]
[]
[]
[]
[4]
[]
[]
[]
[5]
[]
[]
[]
[6]

{"sheet":"Form 12","index":24,"n_rows":34,"n_cols":12,"rows_kept":34,"cut":false,"hidden":false,"merged":[[0,5,0,7]]}
["Name of Insurance Intermediary:-",null,null,null,null,{"$f":"'Cover Sheet'!E17","v":0},null,null,"Year ended : ",{"$f":"IF('Cover Sheet'!$E$23=\"\",\"\",'Cover Sheet'!$E$23)","v":""}]
[]
["Form 12"]
["Income Statement ",null,null,null,null,null,null,null,null,{"$f":"IF('Cover Sheet'!$E$25=\"\",\"\",'Cover Sheet'!$E$25)","v":""}]
["(extract from the audited Financial Statements)"]
[]
["To be completed by Insurance Agents and Insurance Brokers"]
[]
[null,"(a) Gross Profit (including net commissions, claims handling fees and other income):",null,null,null,null,null,null,null,null,null,101]
[]
[null,"(b) Administrative Expenses:",null,null,null,null,null,null,null,null,null,102]
[]
[null,"(c) Operating Profit [(a) - (b)]:",null,null,null,null,null,null,null,{"$f":"J9-J11","v":0},null,1]
[]
[null,"(d) Other Net Financial Income:",null,null,null,null,null,null,null,null,null,201]
[]
[null,"(e) Profit Before Tax [(c) + (d)]:",null,null,null,null,null,null,null,{"$f":"J13+J15","v":0},null,2]
[]
[]
["To be completed by Insurance Managers"]
[]
[null,"(a) Management Fees:",null,null,null,null,null,null,null,null,null,301]
[]
[null,"(b) Other Income:",null,null,null,null,null,null,null,null,null,302]
[]
[null,"(c) Total Income [(a) + (b)]:",null,null,null,null,null,null,null,{"$f":"J22+J24","v":0},null,3]
[]
[null,"(d) Administrative Expenses:",null,null,null,null,null,null,null,null,null,401]
[]
[null,"(e) Operating Profit [(c) - (d)]:",null,null,null,null,null,null,null,{"$f":"J26-J28","v":0},null,4]
[]
[null,"(f) Other Net Financial Income:",null,null,null,null,null,null,null,null,null,501]
[]
[null,"(g) Profit Before Tax [(e) + (f)]:",null,null,null,null,null,null,null,{"$f":"J30+J32","v":0},null,5]

{"sheet":"F12","index":25,"n_rows":13,"n_cols":6,"rows_kept":13,"cut":false,"hidden":true,"merged":[]}
["SheetCode","FieldCode","FICode","Date","ColNum","Value"]
["F12",101,{"$f":"'Cover Sheet'!$E$19","v":0},{"$f":"'Cover Sheet'!$E$23","v":"00:00:00"},1,{"$f":"'Form 12'!J9/'Cover Sheet'!$E$27","v":{"$error":"#DIV/0!"}}]
["F12",102,{"$f":"'Cover Sheet'!$E$19","v":0},{"$f":"'Cover Sheet'!$E$23","v":"00:00:00"},1,{"$f":"'Form 12'!J11/'Cover Sheet'!$E$27","v":{"$error":"#DIV/0!"}}]
["F12",1,{"$f":"'Cover Sheet'!$E$19","v":0},{"$f":"'Cover Sheet'!$E$23","v":"00:00:00"},1,{"$f":"'Form 12'!J13/'Cover Sheet'!$E$27","v":{"$error":"#DIV/0!"}}]
["F12",201,{"$f":"'Cover Sheet'!$E$19","v":0},{"$f":"'Cover Sheet'!$E$23","v":"00:00:00"},1,{"$f":"'Form 12'!J15/'Cover Sheet'!$E$27","v":{"$error":"#DIV/0!"}}]
["F12",2,{"$f":"'Cover Sheet'!$E$19","v":0},{"$f":"'Cover Sheet'!$E$23","v":"00:00:00"},1,{"$f":"'Form 12'!J17/'Cover Sheet'!$E$27","v":{"$error":"#DIV/0!"}}]
["F12",301,{"$f":"'Cover Sheet'!$E$19","v":0},{"$f":"'Cover Sheet'!$E$23","v":"00:00:00"},1,{"$f":"'Form 12'!J22/'Cover Sheet'!$E$27","v":{"$error":"#DIV/0!"}}]
["F12",302,{"$f":"'Cover Sheet'!$E$19","v":0},{"$f":"'Cover Sheet'!$E$23","v":"00:00:00"},1,{"$f":"'Form 12'!J24/'Cover Sheet'!$E$27","v":{"$error":"#DIV/0!"}}]
["F12",3,{"$f":"'Cover Sheet'!$E$19","v":0},{"$f":"'Cover Sheet'!$E$23","v":"00:00:00"},1,{"$f":"'Form 12'!J26/'Cover Sheet'!$E$27","v":{"$error":"#DIV/0!"}}]
["F12",401,{"$f":"'Cover Sheet'!$E$19","v":0},{"$f":"'Cover Sheet'!$E$23","v":"00:00:00"},1,{"$f":"'Form 12'!J28/'Cover Sheet'!$E$27","v":{"$error":"#DIV/0!"}}]
["F12",4,{"$f":"'Cover Sheet'!$E$19","v":0},{"$f":"'Cover Sheet'!$E$23","v":"00:00:00"},1,{"$f":"'Form 12'!J30/'Cover Sheet'!$E$27","v":{"$error":"#DIV/0!"}}]
["F12",501,{"$f":"'Cover Sheet'!$E$19","v":0},{"$f":"'Cover Sheet'!$E$23","v":"00:00:00"},1,{"$f":"'Form 12'!J32/'Cover Sheet'!$E$27","v":{"$error":"#DIV/0!"}}]
["F12",5,{"$f":"'Cover Sheet'!$E$19","v":0},{"$f":"'Cover Sheet'!$E$23","v":"00:00:00"},1,{"$f":"'Form 12'!J34/'Cover Sheet'!$E$27","v":{"$error":"#DIV/0!"}}]

{"sheet":"Form 13","index":26,"n_rows":12,"n_cols":12,"rows_kept":12,"cut":false,"hidden":false,"merged":[[1,5,1,7]]}
[]
["Name of Insurance Intermediary:-",null,null,null,null,{"$f":"'Cover Sheet'!E17","v":0},null,null,"Year ended : ",{"$f":"IF('Cover Sheet'!$E$23=\"\",\"\",'Cover Sheet'!$E$23)","v":""}]
[]
["Form 13"]
["Remuneration",null,null,null,null,null,null,null,null,{"$f":"IF('Cover Sheet'!$E$25=\"\",\"\",'Cover Sheet'!$E$25)","v":""}]
[" (extract from the audited Financial Statements)"]
[]
[null,"(a) Total reported number of employees (excluding directors):",null,null,null,null,null,null,null,null,null,1]
[]
[null,"(b) Wages and Salaries ",null,null,null,null,null,null,null,null,null,2]
[]
[null,"(c) Directors' Remuneration/Emoluments",null,null,null,null,null,null,null,null,null,3]

{"sheet":"F13","index":27,"n_rows":7,"n_cols":6,"rows_kept":7,"cut":false,"hidden":true,"merged":[]}
["SheetCode","FieldCode","FICode","Date","ColNum","Value"]
["F13",1,{"$f":"'Cover Sheet'!$E$19","v":0},{"$f":"'Cover Sheet'!$E$23","v":"00:00:00"},1,{"$f":"'Form 13'!I8","v":0}]
["F13",2,{"$f":"'Cover Sheet'!$E$19","v":0},{"$f":"'Cover Sheet'!$E$23","v":"00:00:00"},1,{"$f":"'Form 13'!I10","v":0}]
["F13",3,{"$f":"'Cover Sheet'!$E$19","v":0},{"$f":"'Cover Sheet'!$E$23","v":"00:00:00"},1,{"$f":"'Form 13'!I12","v":0}]
["F13",1,{"$f":"'Cover Sheet'!$E$19","v":0},{"$f":"'Cover Sheet'!$E$23","v":"00:00:00"},2,{"$f":"'Form 13'!J8","v":0}]
["F13",2,{"$f":"'Cover Sheet'!$E$19","v":0},{"$f":"'Cover Sheet'!$E$23","v":"00:00:00"},2,{"$f":"'Form 13'!J10/'Cover Sheet'!$E$27","v":{"$error":"#DIV/0!"}}]
["F13",3,{"$f":"'Cover Sheet'!$E$19","v":0},{"$f":"'Cover Sheet'!$E$23","v":"00:00:00"},2,{"$f":"'Form 13'!J12/'Cover Sheet'!$E$27","v":{"$error":"#DIV/0!"}}]

{"sheet":"Form 14","index":28,"n_rows":45,"n_cols":8,"rows_kept":45,"cut":false,"hidden":false,"merged":[[25,1,25,2],[20,1,20,2],[21,1,21,2],[22,1,22,2],[23,1,23,2],[24,1,24,2]]}
["Name of Insurance Intermediary:-",null,null,{"$f":"'Cover Sheet'!E17","v":0},null,"Year ended : ",{"$f":"IF('Cover Sheet'!$E$23=\"\",\"\",'Cover Sheet'!$E$23)","v":""}]
[]
["Form 14"]
["Statement of Financial Position",null,null,null,{"$f":"IF('Cover Sheet'!$E$25=\"\",\"\",'Cover Sheet'!$E$25)","v":""},{"$f":"IF('Cover Sheet'!$E$25=\"\",\"\",'Cover Sheet'!$E$25)","v":""}]
["(extract from the audited Financial Statements)"]
[]
[null,"Assets"]
[]
[null,"Non-current assets",null,null,null,null,null,101]
[]
[null,"Current Assets:-"]
[null,"Trade debtors",null,null,null,null,null,102]
[null,"Other current assets",null,null,null,{"$f":"E12+E13","v":0},null,103]
[]
[null,"Total Assets",null,null,null,{"$f":"F9+F13","v":0},null,1]
[]
[]
[null,"Equity and Liabilities"]
[]
[null,"Equity"]
[]
[null,"Called up issued share capital",null,null,null,null,null,201]
[]
[null,"Retained earnings and other reserves",null,null,null,null,null,202]
[]
[null,"Total Equity",null,null,null,{"$f":"F22+F24","v":0},null,2]
[]
[]
[null,"Liabilities"]
[]
[null,"Non-current liabilities",null,null,null,null,null,301]
[]
[null,"Current Liabilities:-"]
[null,"Trade creditors",null,null,null,null,null,302]
[null,"Other current liabilities",null,null,null,{"$f":"E34+E35","v":0},null,303]
[]
[null,"Total Liabilities",null,null,null,{"$f":"F31+F35","v":0},null,3]
[]
[]
[null,"Total Equity and Liabilities",null,null,null,{"$f":"F26+F37","v":0},null,4]
[]
[]
[]
[]
[null,"Balance Sheet Check",null,null,null,{"$f":"IF(F15-F40<-10,\"Error\",IF(F15-F40>10,\"Error\",\"OK\"))","v":"OK"}]

{"sheet":"Sheet1","index":29,"n_rows":3,"n_cols":2,"rows_kept":3,"cut":false,"hidden":true,"merged":[]}
[]
[null,"YES"]
[null,"NO"]

{"sheet":"F14","index":30,"n_rows":25,"n_cols":6,"rows_kept":25,"cut":false,"hidden":true,"merged":[]}
["SheetCode","FieldCode","FICode","Date","ColNum","Value"]
["F14",101,{"$f":"'Cover Sheet'!$E$19","v":0},{"$f":"'Cover Sheet'!$E$23","v":"00:00:00"},1,{"$f":"'Form 14'!E9/'Cover Sheet'!$E$27","v":{"$error":"#DIV/0!"}}]
["F14",102,{"$f":"'Cover Sheet'!$E$19","v":0},{"$f":"'Cover Sheet'!$E$23","v":"00:00:00"},1,{"$f":"'Form 14'!E12/'Cover Sheet'!$E$27","v":{"$error":"#DIV/0!"}}]
["F14",103,{"$f":"'Cover Sheet'!$E$19","v":0},{"$f":"'Cover Sheet'!$E$23","v":"00:00:00"},1,{"$f":"'Form 14'!E13/'Cover Sheet'!$E$27","v":{"$error":"#DIV/0!"}}]
["F14",1,{"$f":"'Cover Sheet'!$E$19","v":0},{"$f":"'Cover Sheet'!$E$23","v":"00:00:00"},1,{"$f":"'Form 14'!E15/'Cover Sheet'!$E$27","v":{"$error":"#DIV/0!"}}]
["F14",201,{"$f":"'Cover Sheet'!$E$19","v":0},{"$f":"'Cover Sheet'!$E$23","v":"00:00:00"},1,{"$f":"'Form 14'!E22/'Cover Sheet'!$E$27","v":{"$error":"#DIV/0!"}}]
["F14",202,{"$f":"'Cover Sheet'!$E$19","v":0},{"$f":"'Cover Sheet'!$E$23","v":"00:00:00"},1,{"$f":"'Form 14'!E24/'Cover Sheet'!$E$27","v":{"$error":"#DIV/0!"}}]
["F14",2,{"$f":"'Cover Sheet'!$E$19","v":0},{"$f":"'Cover Sheet'!$E$23","v":"00:00:00"},1,{"$f":"'Form 14'!E26/'Cover Sheet'!$E$27","v":{"$error":"#DIV/0!"}}]
["F14",301,{"$f":"'Cover Sheet'!$E$19","v":0},{"$f":"'Cover Sheet'!$E$23","v":"00:00:00"},1,{"$f":"'Form 14'!E31/'Cover Sheet'!$E$27","v":{"$error":"#DIV/0!"}}]
["F14",302,{"$f":"'Cover Sheet'!$E$19","v":0},{"$f":"'Cover Sheet'!$E$23","v":"00:00:00"},1,{"$f":"'Form 14'!E34/'Cover Sheet'!$E$27","v":{"$error":"#DIV/0!"}}]
["F14",303,{"$f":"'Cover Sheet'!$E$19","v":0},{"$f":"'Cover Sheet'!$E$23","v":"00:00:00"},1,{"$f":"'Form 14'!E35/'Cover Sheet'!$E$27","v":{"$error":"#DIV/0!"}}]
["F14",3,{"$f":"'Cover Sheet'!$E$19","v":0},{"$f":"'Cover Sheet'!$E$23","v":"00:00:00"},1,{"$f":"'Form 14'!E37/'Cover Sheet'!$E$27","v":{"$error":"#DIV/0!"}}]
["F14",4,{"$f":"'Cover Sheet'!$E$19","v":0},{"$f":"'Cover Sheet'!$E$23","v":"00:00:00"},1,{"$f":"'Form 14'!E40/'Cover Sheet'!$E$27","v":{"$error":"#DIV/0!"}}]
["F14",101,{"$f":"'Cover Sheet'!$E$19","v":0},{"$f":"'Cover Sheet'!$E$23","v":"00:00:00"},2,{"$f":"'Form 14'!F9/'Cover Sheet'!$E$27","v":{"$error":"#DIV/0!"}}]
["F14",102,{"$f":"'Cover Sheet'!$E$19","v":0},{"$f":"'Cover Sheet'!$E$23","v":"00:00:00"},2,{"$f":"'Form 14'!F12/'Cover Sheet'!$E$27","v":{"$error":"#DIV/0!"}}]
["F14",103,{"$f":"'Cover Sheet'!$E$19","v":0},{"$f":"'Cover Sheet'!$E$23","v":"00:00:00"},2,{"$f":"'Form 14'!F13/'Cover Sheet'!$E$27","v":{"$error":"#DIV/0!"}}]
["F14",1,{"$f":"'Cover Sheet'!$E$19","v":0},{"$f":"'Cover Sheet'!$E$23","v":"00:00:00"},2,{"$f":"'Form 14'!F15/'Cover Sheet'!$E$27","v":{"$error":"#DIV/0!"}}]
["F14",201,{"$f":"'Cover Sheet'!$E$19","v":0},{"$f":"'Cover Sheet'!$E$23","v":"00:00:00"},2,{"$f":"'Form 14'!F22/'Cover Sheet'!$E$27","v":{"$error":"#DIV/0!"}}]
["F14",202,{"$f":"'Cover Sheet'!$E$19","v":0},{"$f":"'Cover Sheet'!$E$23","v":"00:00:00"},2,{"$f":"'Form 14'!F24/'Cover Sheet'!$E$27","v":{"$error":"#DIV/0!"}}]
["F14",2,{"$f":"'Cover Sheet'!$E$19","v":0},{"$f":"'Cover Sheet'!$E$23","v":"00:00:00"},2,{"$f":"'Form 14'!F26/'Cover Sheet'!$E$27","v":{"$error":"#DIV/0!"}}]
["F14",301,{"$f":"'Cover Sheet'!$E$19","v":0},{"$f":"'Cover Sheet'!$E$23","v":"00:00:00"},2,{"$f":"'Form 14'!F31/'Cover Sheet'!$E$27","v":{"$error":"#DIV/0!"}}]
["F14",302,{"$f":"'Cover Sheet'!$E$19","v":0},{"$f":"'Cover Sheet'!$E$23","v":"00:00:00"},2,{"$f":"'Form 14'!F34/'Cover Sheet'!$E$27","v":{"$error":"#DIV/0!"}}]
["F14",303,{"$f":"'Cover Sheet'!$E$19","v":0},{"$f":"'Cover Sheet'!$E$23","v":"00:00:00"},2,{"$f":"'Form 14'!F35/'Cover Sheet'!$E$27","v":{"$error":"#DIV/0!"}}]
["F14",3,{"$f":"'Cover Sheet'!$E$19","v":0},{"$f":"'Cover Sheet'!$E$23","v":"00:00:00"},2,{"$f":"'Form 14'!F37/'Cover Sheet'!$E$27","v":{"$error":"#DIV/0!"}}]
["F14",4,{"$f":"'Cover Sheet'!$E$19","v":0},{"$f":"'Cover Sheet'!$E$23","v":"00:00:00"},2,{"$f":"'Form 14'!F40/'Cover Sheet'!$E$27","v":{"$error":"#DIV/0!"}}]