{"text_format":"1","workbook":"xlsx","n_sheets":17,"sheets":["Review sheet - Self-Managed","Cover Sheet","Strategies","Data Validation Sheet","1. Supplementary Documentation","2. Balance Sheet","3. Statement of Income","4. Dealings & Net Asset Changes","5.Valuation of Assets&Liab","6. Cross-border activities","7.Additional Information","8. Portfolio Statement","9. SFDR","Rep Sheet","8. Self-Managed AIFs or UCITS","8. Self-Managed PIFs","Validation Checks"],"not_rendered":{"charts":0,"images":0,"macros":0,"external_links":16,"defined_names":214,"comments":0,"pivot_tables":0},"unopened":[],"bounds":{"document_bytes":16777216,"sheet_cells":100000,"rows_first":2000,"rows_last":500,"rows_between":2000,"halvings":0,"cell_chars":16384,"cell_head_chars":4096},"cells_cut":0,"cells_raw":0,"read":"whole","date_system":"1900"}

{"sheet":"Review sheet - Self-Managed","index":0,"n_rows":68,"n_cols":5,"rows_kept":68,"cut":false,"hidden":true,"merged":[[55,3,56,3],[55,4,56,4],[57,3,58,3],[57,4,58,4],[60,3,60,4],[54,3,54,4],[42,3,42,4],[43,3,43,4],[44,3,44,4],[45,3,45,4],[46,3,46,4],[47,3,47,4],[48,3,48,4],[49,3,49,4],[50,3,50,4],[51,3,51,4],[52,3,52,4],[41,3,41,4],[29,0,29,1],[32,3,32,4],[33,3,33,4],[34,3,34,4],[35,3,35,4],[36,3,36,4],[37,3,37,4],[38,3,38,4],[39,3,39,4],[40,0,40,1],[40,3,40,4],[22,0,23,0],[0,0,1,1],[3,0,3,1],[3,3,3,4],[16,0,16,1],[17,0,18,0]]}
[{"$f":"'Cover Sheet'!B5","v":"00:00:00"},null,null,"Review of"]
[null,null,null,"as at",{"$f":"B10","v":"00:00:00"}]
[]
["Company Details",null,null,"Validation Checks"]
["Licence Holder Name",{"$f":"A1","v":0}]
["Licence Holder Code",{"$f":"'Cover Sheet'!B7:C7","v":0}]
["Licence Category",{"$f":"'Cover Sheet'!B9:C9","v":0}]
[]
{"$rows_left_out":61}
{"sheet":"Cover Sheet","index":1,"n_rows":47,"n_cols":4,"rows_kept":47,"cut":false,"hidden":false,"merged":[[25,1,25,3],[11,1,11,3],[8,1,8,3],[10,1,10,3],[13,1,13,3],[15,1,15,3],[16,1,16,3],[1,0,1,3],[24,0,24,1],[21,1,22,2],[14,0,14,1],[5,1,5,2],[6,1,6,3],[4,1,4,3],[20,1,20,3],[23,1,23,3],[18,1,18,3]]}
["Version no. 1.9"]
["Annual Fund Return"]
[]
[]
["Name of Licence Holder"]
[]
["Licence Holder Code"]
[]
{"$rows_left_out":40}
{"sheet":"Strategies","index":2,"n_rows":64,"n_cols":46,"rows_kept":64,"cut":false,"hidden":false,"merged":[]}
["Item No."]
[]
[1,null,"Investment Strategy"]
[]
[null,null,"As at: ",{"$f":"'Cover Sheet'!B17","v":"00:00:00"}]
[]
[1.1000000000000001,null,null,null,null,null,null,"Sub-Fund Name","Sub-Fund Name","Sub-Fund Name","Sub-Fund Name","Sub-Fund Name","Sub-Fund Name","Sub-Fund Name","Sub-Fund Name","Sub-Fund Name","Sub-Fund Name","Sub-Fund Name","Sub-Fund Name","Sub-Fund Name","Sub-Fund Name","Sub-Fund Name","Sub-Fund Name","Sub-Fund Name","Sub-Fund Name","Sub-Fund Name","Sub-Fund Name","Sub-Fund Name","Sub-Fund Name","Sub-Fund Name","Sub-Fund Name","Sub-Fund Name","Sub-Fund Name","Sub-Fund Name","Sub-Fund Name","Sub-Fund Name","Sub-Fund Name","Sub-Fund Name","Sub-Fund Name","Sub-Fund Name","Sub-Fund Name","Sub-Fund Name","Sub-Fund Name","Sub-Fund Name","Sub-Fund Name","Sub-Fund Name"]
[1.2,null,null,null,null,null,null,"LEI Code","LEI Code","LEI Code","LEI Code","LEI Code","LEI Code","LEI Code","LEI Code","LEI Code","LEI Code","LEI Code","LEI Code","LEI Code","LEI Code","LEI Code","LEI Code","LEI Code","LEI Code","LEI Code","LEI Code","LEI Code","LEI Code","LEI Code","LEI Code","LEI Code","LEI Code","LEI Code","LEI Code","LEI Code","LEI Code","LEI Code","LEI Code","LEI Code","LEI Code","LEI Code","LEI Code","LEI Code","LEI Code","LEI Code"]
{"$rows_left_out":57}
{"sheet":"Data Validation Sheet","index":3,"n_rows":240,"n_cols":24,"rows_kept":240,"cut":false,"hidden":true,"merged":[]}
["Decision","Auditor Opinion Type",null,"Management Type","Accounting convention","Fund Regulatory Type","Investment Strategy","Breach Type","Breach Nature","Country Code","Country Name","Currency Code","Frequency","Asset Type","Managenent response","Derivative","Trading",null,"Cash and cash equivalents",null,null,null,null,"Not Applicable"]
["Yes","Clean",null,"Self-Managed","IFRS","AIF","Large-Mid Cap Equity focus: Long Bias","Rules","Advertent"," AD","Andorra","AED","NA","NA","Not Applicable","Equity derivative","Traded",null,"Cash held in margin",null,null,null,null,"Yes"]
["No","Emphasis of matter",null,"Third Party Managed",null,"NAIF","Large-Mid Cap Equity focus: Long/Short","Prospectus","Inadvertent"," AE","United Arab Emirates","ALL","Monthly","Level 2","In agreement","Credit default swap","Non-Traded",null,"Local Listed Equity",null,null,null,null,"Repeated"]
["Repeated","Material Uncertainty relating to Going Concern",null,null,null,"PIF","Large-Mid Cap Equity Focus: Market neutral","Rules and Prospectus",null," AF","Afghanistan","AMD","Quarterly","Level 3","Partial agreement","Foreign exchange derivative",null,null,"Local Unlisted Equity"]
[null,"Qualified Opinion",null,null,null,"UCITS","Large-Mid Cap Equity Focus: Short Bias",null,null," AG","Antigua and Barbuda","ANG","Semi-Annually","Level 2 and Level 3","In disagreement","Interest rate derivative",null,null,"Foreign Listed Equity"]
["Yes","Adverse Opinion",null,null,null,null,"Small Cap Equity focus: Long Bias",null,null," AI","Anguilla","AOA","Annually",null,null,"Commodity derivative",null,null,"Foreign Unlisted Equity"]
["No","Disclaimer of Opinion",null,null,null,null,"Small Cap Equity focus: Long/Short",null,null," AL","Albania","ARS",null,null,null,"Other derivative",null,null,"Local Bond"]
["NA","Emphasis of Matter and Qualified Opinion",null,null,null,null,"Small Cap Equity focus: Market neutral",null,null," AM","Armenia","AUD",null,null,null,null,null,null,"Foreign Bond"]
{"$rows_left_out":233}
{"sheet":"1. Supplementary Documentation","index":4,"n_rows":105,"n_cols":11,"rows_kept":105,"cut":false,"hidden":false,"merged":[[80,2,81,9],[67,10,67,11],[33,2,37,11],[8,2,12,11],[15,2,19,11],[26,2,30,11],[43,2,46,9]]}
["Item No."]
[]
[2,null,"Supplementary Financial Documentation"]
[]
[]
[2.1,null,"Independent Auditor's Report"]
[]
["2.1.1",null,"Auditor's Opinion"]
{"$rows_left_out":98}
{"sheet":"2. Balance Sheet","index":5,"n_rows":203,"n_cols":46,"rows_kept":203,"cut":false,"hidden":false,"merged":[[182,2,182,4],[183,2,183,4],[184,2,184,4],[177,2,177,4],[178,2,178,4],[179,2,179,4],[180,2,180,4],[181,2,181,4],[172,2,172,4],[173,2,173,4],[174,2,174,4],[175,2,175,4],[176,2,176,4],[167,2,167,4],[168,2,168,4],[169,2,169,4],[170,2,170,4],[171,2,171,4],[162,2,162,4],[163,2,163,4],[164,2,164,4],[165,2,165,4],[166,2,166,4],[159,2,159,4],[160,2,160,4],[161,2,161,4],[120,2,120,4],[121,2,121,4],[122,2,122,4],[155,2,155,4],[156,2,156,4],[141,2,141,4],[142,2,142,4],[143,2,143,4],[129,2,129,4],[130,2,130,4],[131,2,131,4],[146,2,146,4],[132,2,132,4],[150,2,150,4],[134,2,134,4],[135,2,135,4],[136,2,136,4],[137,2,137,4],[138,2,138,4],[118,2,118,4],[119,2,119,4],[110,2,110,4],[111,2,111,4],[112,2,112,4],[113,2,113,4],[114,2,114,4],[157,2,157,4],[158,2,158,4],[139,2,139,4],[140,2,140,4],[89,2,89,4],[90,2,90,4],[91,2,91,4],[125,2,125,4],[93,2,93,4],[94,2,94,4],[95,2,95,4],[96,2,96,4],[97,2,97,4],[98,2,98,4],[99,2,99,4],[105,2,105,4],[106,2,106,4],[107,2,107,4],[108,2,108,4],[109,2,109,4],[100,2,100,4],[101,2,101,4],[102,2,102,4],[103,2,103,4],[104,2,104,4],[115,2,115,4],[116,2,116,4],[117,2,117,4],[84,2,84,4],[85,2,85,4],[86,2,86,4],[76,2,76,4],[77,2,77,4],[78,2,78,4],[187,2,187,4],[81,2,81,4],[152,2,152,4],[133,2,133,4],[144,2,144,4],[145,2,145,4],[153,2,153,4],[154,2,154,4],[147,2,147,4],[148,2,148,4],[149,2,149,4],[151,2,151,4],[126,2,126,4],[186,2,186,4],[127,2,127,4],[128,2,128,4],[87,2,87,4],[88,2,88,4],[11,2,11,4],[12,2,12,4],[124,2,124,4],[24,2,24,4],[27,2,27,4],[79,2,79,4],[80,2,80,4],[25,2,25,4],[26,2,26,4],[48,2,48,4],[49,2,49,4],[50,2,50,4],[65,2,65,4],[123,2,123,4],[75,2,75,4],[92,2,92,4],[23,2,23,4],[63,2,63,4],[64,2,64,4],[51,2,51,4],[82,2,82,4],[83,2,83,4],[52,2,52,4],[66,2,66,4],[67,2,67,4],[68,2,68,4],[73,2,73,4],[74,2,74,4],[69,2,69,4],[70,2,70,4],[71,2,71,4],[72,2,72,4],[31,2,31,4],[56,2,56,4]]}
["Item No."]
[]
[3,null,"Statement of Financial Position"]
[]
[null,null,"As at",{"$f":"'Cover Sheet'!B17","v":"00:00:00"}]
[]
[3.1,null,null,null,null,"Scheme Combined","Scheme",{"$f":"Strategies!H7","v":"Sub-Fund Name"},{"$f":"Strategies!I7","v":"Sub-Fund Name"},{"$f":"Strategies!J7","v":"Sub-Fund Name"},{"$f":"Strategies!K7","v":"Sub-Fund Name"},{"$f":"Strategies!L7","v":"Sub-Fund Name"},{"$f":"Strategies!M7","v":"Sub-Fund Name"},{"$f":"Strategies!N7","v":"Sub-Fund Name"},{"$f":"Strategies!O7","v":"Sub-Fund Name"},{"$f":"Strategies!P7","v":"Sub-Fund Name"},{"$f":"Strategies!Q7","v":"Sub-Fund Name"},{"$f":"Strategies!R7","v":"Sub-Fund Name"},{"$f":"Strategies!S7","v":"Sub-Fund Name"},{"$f":"Strategies!T7","v":"Sub-Fund Name"},{"$f":"Strategies!U7","v":"Sub-Fund Name"},{"$f":"Strategies!V7","v":"Sub-Fund Name"},{"$f":"Strategies!W7","v":"Sub-Fund Name"},{"$f":"Strategies!X7","v":"Sub-Fund Name"},{"$f":"Strategies!Y7","v":"Sub-Fund Name"},{"$f":"Strategies!Z7","v":"Sub-Fund Name"},{"$f":"Strategies!AA7","v":"Sub-Fund Name"},{"$f":"Strategies!AB7","v":"Sub-Fund Name"},{"$f":"Strategies!AC7","v":"Sub-Fund Name"},{"$f":"Strategies!AD7","v":"Sub-Fund Name"},{"$f":"Strategies!AE7","v":"Sub-Fund Name"},{"$f":"Strategies!AF7","v":"Sub-Fund Name"},{"$f":"Strategies!AG7","v":"Sub-Fund Name"},{"$f":"Strategies!AH7","v":"Sub-Fund Name"},{"$f":"Strategies!AI7","v":"Sub-Fund Name"},{"$f":"Strategies!AJ7","v":"Sub-Fund Name"},{"$f":"Strategies!AK7","v":"Sub-Fund Name"},{"$f":"Strategies!AL7","v":"Sub-Fund Name"},{"$f":"Strategies!AM7","v":"Sub-Fund Name"},{"$f":"Strategies!AN7","v":"Sub-Fund Name"},{"$f":"Strategies!AO7","v":"Sub-Fund Name"},{"$f":"Strategies!AP7","v":"Sub-Fund Name"},{"$f":"Strategies!AQ7","v":"Sub-Fund Name"},{"$f":"Strategies!AR7","v":"Sub-Fund Name"},{"$f":"Strategies!AS7","v":"Sub-Fund Name"},{"$f":"Strategies!AT7","v":"Sub-Fund Name"}]
[3.2,null,"Assets"]
{"$rows_left_out":196}
{"sheet":"3. Statement of Income","index":6,"n_rows":72,"n_cols":48,"rows_kept":72,"cut":false,"hidden":false,"merged":[[57,2,57,6],[20,2,20,6],[53,2,54,8],[14,2,14,6],[15,2,15,6],[16,2,16,6],[42,2,42,6],[43,2,43,6],[44,2,44,6]]}
["Item No."]
[]
[4,null,"Statement of Comprehensive Income"]
[]
[null,null,"As at",{"$f":"'Cover Sheet'!B17:D17","v":"00:00:00"},0,0]
[]
[4.0999999999999996,null,null,null,null,null,null,"Scheme Combined",{"$f":"'2. Balance Sheet'!col_start","v":"Scheme"},{"$f":"'2. Balance Sheet'!H7","v":"Sub-Fund Name"},{"$f":"'2. Balance Sheet'!I7","v":"Sub-Fund Name"},{"$f":"'2. Balance Sheet'!J7","v":"Sub-Fund Name"},{"$f":"'2. Balance Sheet'!K7","v":"Sub-Fund Name"},{"$f":"'2. Balance Sheet'!L7","v":"Sub-Fund Name"},{"$f":"'2. Balance Sheet'!M7","v":"Sub-Fund Name"},{"$f":"'2. Balance Sheet'!N7","v":"Sub-Fund Name"},{"$f":"'2. Balance Sheet'!O7","v":"Sub-Fund Name"},{"$f":"'2. Balance Sheet'!P7","v":"Sub-Fund Name"},{"$f":"'2. Balance Sheet'!Q7","v":"Sub-Fund Name"},{"$f":"'2. Balance Sheet'!R7","v":"Sub-Fund Name"},{"$f":"'2. Balance Sheet'!S7","v":"Sub-Fund Name"},{"$f":"'2. Balance Sheet'!T7","v":"Sub-Fund Name"},{"$f":"'2. Balance Sheet'!U7","v":"Sub-Fund Name"},{"$f":"'2. Balance Sheet'!V7","v":"Sub-Fund Name"},{"$f":"'2. Balance Sheet'!W7","v":"Sub-Fund Name"},{"$f":"'2. Balance Sheet'!X7","v":"Sub-Fund Name"},{"$f":"'2. Balance Sheet'!Y7","v":"Sub-Fund Name"},{"$f":"'2. Balance Sheet'!Z7","v":"Sub-Fund Name"},{"$f":"'2. Balance Sheet'!AA7","v":"Sub-Fund Name"},{"$f":"'2. Balance Sheet'!AB7","v":"Sub-Fund Name"},{"$f":"'2. Balance Sheet'!AC7","v":"Sub-Fund Name"},{"$f":"'2. Balance Sheet'!AD7","v":"Sub-Fund Name"},{"$f":"'2. Balance Sheet'!AE7","v":"Sub-Fund Name"},{"$f":"'2. Balance Sheet'!AF7","v":"Sub-Fund Name"},{"$f":"'2. Balance Sheet'!AG7","v":"Sub-Fund Name"},{"$f":"'2. Balance Sheet'!AH7","v":"Sub-Fund Name"},{"$f":"'2. Balance Sheet'!AI7","v":"Sub-Fund Name"},{"$f":"'2. Balance Sheet'!AJ7","v":"Sub-Fund Name"},{"$f":"'2. Balance Sheet'!AK7","v":"Sub-Fund Name"},{"$f":"'2. Balance Sheet'!AL7","v":"Sub-Fund Name"},{"$f":"'2. Balance Sheet'!AM7","v":"Sub-Fund Name"},{"$f":"'2. Balance Sheet'!AN7","v":"Sub-Fund Name"},{"$f":"'2. Balance Sheet'!AO7","v":"Sub-Fund Name"},{"$f":"'2. Balance Sheet'!AP7","v":"Sub-Fund Name"},{"$f":"'2. Balance Sheet'!AQ7","v":"Sub-Fund Name"},{"$f":"'2. Balance Sheet'!AR7","v":"Sub-Fund Name"},{"$f":"'2. Balance Sheet'!AS7","v":"Sub-Fund Name"},{"$f":"'2. Balance Sheet'!AT7","v":"Sub-Fund Name"}]
[4.2,null,"Income"]
{"$rows_left_out":65}
{"sheet":"4. Dealings & Net Asset Changes","index":7,"n_rows":39,"n_cols":48,"rows_kept":39,"cut":false,"hidden":false,"merged":[[17,2,17,4],[18,2,18,4],[19,2,19,4],[23,2,23,4]]}
["Item No."]
[]
[5,null,"Statement of changes in net assets attributable to shareholders"]
[]
[null,null,"As at: ",{"$f":"'Cover Sheet'!B17","v":"00:00:00"}]
[]
[5.0999999999999996,null,null,null,null,null,null,"Scheme Combined","Scheme",{"$f":"'2. Balance Sheet'!H7","v":"Sub-Fund Name"},{"$f":"'2. Balance Sheet'!I7","v":"Sub-Fund Name"},{"$f":"'2. Balance Sheet'!J7","v":"Sub-Fund Name"},{"$f":"'2. Balance Sheet'!K7","v":"Sub-Fund Name"},{"$f":"'2. Balance Sheet'!L7","v":"Sub-Fund Name"},{"$f":"'2. Balance Sheet'!M7","v":"Sub-Fund Name"},{"$f":"'2. Balance Sheet'!N7","v":"Sub-Fund Name"},{"$f":"'2. Balance Sheet'!O7","v":"Sub-Fund Name"},{"$f":"'2. Balance Sheet'!P7","v":"Sub-Fund Name"},{"$f":"'2. Balance Sheet'!Q7","v":"Sub-Fund Name"},{"$f":"'2. Balance Sheet'!R7","v":"Sub-Fund Name"},{"$f":"'2. Balance Sheet'!S7","v":"Sub-Fund Name"},{"$f":"'2. Balance Sheet'!T7","v":"Sub-Fund Name"},{"$f":"'2. Balance Sheet'!U7","v":"Sub-Fund Name"},{"$f":"'2. Balance Sheet'!V7","v":"Sub-Fund Name"},{"$f":"'2. Balance Sheet'!W7","v":"Sub-Fund Name"},{"$f":"'2. Balance Sheet'!X7","v":"Sub-Fund Name"},{"$f":"'2. Balance Sheet'!Y7","v":"Sub-Fund Name"},{"$f":"'2. Balance Sheet'!Z7","v":"Sub-Fund Name"},{"$f":"'2. Balance Sheet'!AA7","v":"Sub-Fund Name"},{"$f":"'2. Balance Sheet'!AB7","v":"Sub-Fund Name"},{"$f":"'2. Balance Sheet'!AC7","v":"Sub-Fund Name"},{"$f":"'2. Balance Sheet'!AD7","v":"Sub-Fund Name"},{"$f":"'2. Balance Sheet'!AE7","v":"Sub-Fund Name"},{"$f":"'2. Balance Sheet'!AF7","v":"Sub-Fund Name"},{"$f":"'2. Balance Sheet'!AG7","v":"Sub-Fund Name"},{"$f":"'2. Balance Sheet'!AH7","v":"Sub-Fund Name"},{"$f":"'2. Balance Sheet'!AI7","v":"Sub-Fund Name"},{"$f":"'2. Balance Sheet'!AJ7","v":"Sub-Fund Name"},{"$f":"'2. Balance Sheet'!AK7","v":"Sub-Fund Name"},{"$f":"'2. Balance Sheet'!AL7","v":"Sub-Fund Name"},{"$f":"'2. Balance Sheet'!AM7","v":"Sub-Fund Name"},{"$f":"'2. Balance Sheet'!AN7","v":"Sub-Fund Name"},{"$f":"'2. Balance Sheet'!AO7","v":"Sub-Fund Name"},{"$f":"'2. Balance Sheet'!AP7","v":"Sub-Fund Name"},{"$f":"'2. Balance Sheet'!AQ7","v":"Sub-Fund Name"},{"$f":"'2. Balance Sheet'!AR7","v":"Sub-Fund Name"},{"$f":"'2. Balance Sheet'!AS7","v":"Sub-Fund Name"},{"$f":"'2. Balance Sheet'!AT7","v":"Sub-Fund Name"}]
[]
{"$rows_left_out":32}
{"sheet":"5.Valuation of Assets&Liab","index":8,"n_rows":131,"n_cols":13,"rows_kept":131,"cut":false,"hidden":false,"merged":[[78,2,79,3],[80,2,81,3],[82,2,83,3],[84,2,85,3],[68,2,69,3],[70,2,71,3],[72,2,73,3],[74,2,75,3],[76,2,77,3],[48,2,49,3],[50,2,51,3],[52,2,53,3],[54,2,55,3],[56,2,57,3],[58,2,59,3],[60,2,61,3],[62,2,63,3],[64,2,65,3],[66,2,67,3],[2,2,2,9],[8,2,9,3],[10,2,11,3],[12,2,13,3],[6,2,6,3],[7,7,7,9],[44,2,45,3],[46,2,47,3],[28,2,29,3],[30,2,31,3],[32,2,33,3],[34,2,35,3],[36,2,37,3],[38,2,39,3],[40,2,41,3],[42,2,43,3],[7,10,7,12],[24,2,25,3],[26,2,27,3],[14,2,15,3],[16,2,17,3],[18,2,19,3],[20,2,21,3],[22,2,23,3]]}
["Item No."]
[]
[6,null,"Valuation of Assets/Liaibilities in terms of IFRS 13"]
[]
[null,null,"As at",{"$f":"'Cover Sheet'!B17:D17","v":"00:00:00"},0,0]
[]
[null,null,null,null,null,"Total Financial Assets","Total Financial Liabilities","Level 1","Level 2","Level 3","Level 1","Level 2","Level 3"]
[null,null,null,null,null,null,null,"Financial Assets",null,null,"Financial Liabilities"]
{"$rows_left_out":124}
{"sheet":"6. Cross-border activities","index":9,"n_rows":64,"n_cols":50,"rows_kept":64,"cut":false,"hidden":false,"merged":[[6,2,6,4],[18,2,18,7],[19,2,19,7],[20,2,20,7],[29,2,29,7],[28,2,28,7],[21,2,21,7],[22,2,22,7],[23,2,23,7],[24,2,24,7],[25,2,25,7],[26,2,26,7],[27,2,27,7],[57,2,57,7],[30,2,30,7],[31,2,31,7],[37,2,37,7],[38,2,38,7],[39,2,39,7],[36,2,36,7],[46,2,46,7],[47,2,47,7],[52,2,52,7],[48,2,48,7],[49,2,49,7],[50,2,50,7],[51,2,51,7],[45,2,45,7],[32,2,32,7],[10,10,10,11],[53,2,53,7],[54,2,54,7],[55,2,55,7],[56,2,56,7],[33,2,33,7],[34,2,34,7],[35,2,35,7],[44,2,44,7],[40,2,40,7],[41,2,41,7],[42,2,42,7],[43,2,43,7]]}
["Item No."]
[]
[7,null,"Passporting (Marketing of Units)"]
[]
[null,null,{"$f":"'2. Balance Sheet'!D5","v":"00:00:00"}]
[]
[null,null,"NOT APPLICABLE TO PIFS"]
[]
{"$rows_left_out":57}
{"sheet":"7.Additional Information","index":10,"n_rows":262,"n_cols":50,"rows_kept":262,"cut":false,"hidden":false,"merged":[[71,2,71,7],[12,2,12,7],[13,2,13,7],[14,2,14,7],[10,2,10,7],[70,2,70,7],[60,2,60,7],[56,2,56,7],[61,2,61,7],[6,2,6,3],[29,2,29,7],[68,2,68,7],[51,2,51,7],[52,2,52,7],[54,2,54,7],[42,2,42,7],[36,2,36,7],[222,2,222,6],[62,2,62,7],[63,2,63,7],[69,2,69,7],[19,2,19,7],[20,2,20,7],[37,2,37,7],[35,2,35,7],[49,2,49,7],[50,2,50,7],[64,2,64,7],[55,2,55,7],[72,2,72,7],[21,2,21,7],[27,2,27,7],[28,2,28,7]]}
["Item No."]
[]
[8,null,"ADDITIONAL INFORMATION"]
[]
[null,null,{"$f":"'2. Balance Sheet'!D5","v":"00:00:00"}]
[]
[null,null,"NOT APPLICABLE TO PIFS"]
[]
{"$rows_left_out":255}
{"sheet":"8. Portfolio Statement","index":11,"n_rows":2009,"n_cols":9,"rows_kept":2009,"cut":false,"hidden":false,"merged":[[4,2,4,8],[5,2,5,5]]}
["Item No."]
[]
[9,null,"PORTFOLIO STATEMENT"]
[]
[null,null,"The Scheme is to provide a full list of assets and liabilities held for investment per Sub-Fund, using the below template, clearly distinguishing between different types of assets/liabilities"]
[null,null,"*% of total Sub-Fund Net Assets (Column H) to be included in absolute terms, not in decimal format.Therefore sum of each sub-fund is to amount to 100%, not 1."]
[]
[null,null,"Asset Name","ISIN Code ","LEI Code","Sub-Fund Name","Market Value as at reporting period","% of total Sub-Fund Net Assets*","Asset Type"]
{"$rows_left_out":2002}
{"sheet":"9. SFDR","index":12,"n_rows":19,"n_cols":10,"rows_kept":19,"cut":false,"hidden":false,"merged":[[5,3,5,4]]}
["Item No."]
[]
[10,null,"SFDR"]
[]
[]
[null,null,"APPLICABLE TO SELF-MANAGED SCHEMES ONLY",{"$f":"IF('Cover Sheet'!B11 = \"Self-Managed\", \"\",\"DO NOT COMPLETE\")","v":"DO NOT COMPLETE"}]
[]
[]
{"$rows_left_out":12}
{"sheet":"Rep Sheet","index":13,"n_rows":53,"n_cols":10,"rows_kept":53,"cut":false,"hidden":false,"merged":[[52,2,52,5],[8,2,8,3],[8,5,8,6],[47,2,47,5],[18,1,21,10]]}
[]
[]
[]
[null,"REPRESENTATIONS",null,null,null,{"$f":"'Cover Sheet'!B5","v":0}]
[]
[]
[]
[null,"I am a director of the licence holder and I confirm that during the period:"]
{"$rows_left_out":46}
{"sheet":"8. Self-Managed AIFs or UCITS","index":14,"n_rows":13,"n_cols":10,"rows_kept":13,"cut":false,"hidden":true,"merged":[[8,1,8,5]]}
[]
[]
[]
[null,"FINANCIAL RESOURCES REQUIREMENT"]
[]
[null,"As at ",{"$f":"'Cover Sheet'!B17","v":"00:00:00"},null,null,null,null,null,{"$f":"'Cover Sheet'!B24","v":0}]
[]
[1,"Net Asset Value",null,null,null,null,""]
{"$rows_left_out":6}
{"sheet":"8. Self-Managed PIFs","index":15,"n_rows":13,"n_cols":10,"rows_kept":13,"cut":false,"hidden":true,"merged":[[8,1,8,5]]}
[]
[]
[]
[null,"FINANCIAL RESOURCES REQUIREMENT"]
[]
[null,"As at ",{"$f":"'Cover Sheet'!B17","v":"00:00:00"},null,null,null,null,null,{"$f":"'Cover Sheet'!B24","v":0}]
[]
[1,"Net Asset Value",null,null,null,null,""]
{"$rows_left_out":6}
{"sheet":"Validation Checks","index":16,"n_rows":13,"n_cols":4,"rows_kept":13,"cut":false,"hidden":false,"merged":[]}
["Name of Sheet","Validation ",null,"Error description"]
[]
["Cover Sheet",{"$f":"IF('Cover Sheet'!B47>0,\"ERROR\",\"OK\")","v":"ERROR"},null,{"$f":"IF(B3=\"ERROR\",\"Missing inputs\",\"\")","v":"Missing inputs"}]
["Strategies",{"$f":"IF(Strategies!C63>0,\"ERROR\",\"OK\")","v":"OK"},null,{"$f":"IF(B4=\"ERROR\",\"Missing inputs\",\"\")","v":""}]
["1. Supplementary Documentation",{"$f":"IF('1. Supplementary Documentation'!E105>0,\"ERROR\",\"OK\")","v":"ERROR"},null,{"$f":"IF(B5=\"ERROR\",\"Missing Inputs\",\"\")","v":"Missing Inputs"}]
["2. Balance Sheet",{"$f":"IF('2. Balance Sheet'!C202<=0,\"OK\",\"ERROR\")","v":"ERROR"},null,{"$f":"IF(B6=\"ERROR\",\"Assets, liabilities, shares in issue, NAV per share or founder share capital have not been inputted (if founder share capital is not applicable, fill with 0)\",\"\")","v":"Assets, liabilities, shares in issue, NAV per share or founder share capital have not been inputted (if founder share capital is not applicable, fill with 0)"}]
["3. Statement of Income",{"$f":"IF('3. Statement of Income'!D70<=0,\"OK\",\"ERROR\")","v":"OK"},null,{"$f":"IF(B7=\"ERROR\",\"Income/Expenses not filled in entirely or net increase/decrease in assets figure does not match with figure provided in Sheet 4\",\"\")","v":""}]
["4. Dealings & Net asset changes",{"$f":"IF('4. Dealings & Net Asset Changes'!E38<=0,\"OK\",\"ERROR\")","v":"OK"},null,{"$f":"IF(B8=\"ERROR\",\"Missing inputs or Net assets figure does not match with Net assets figure calculated in Sheet 2\",\"\")","v":""}]
{"$rows_left_out":5}