{"text_format":"1","workbook":"xlsx","n_sheets":20,"sheets":["COVER SHEET","Review","CONTENTS","CSV_workings","CSV_final","Sheet 1","Sheet 2","Sheet 3","Sheet 4","Sheet 4.1","Sheet 4.2","Sheet 5","Sheet 6","Sheet 7","Applicable Percentages","Sheet 8","LH Names & Codes","Non-Malta Funds","VALIDATION SHEET","Subordinated Loan Working"],"not_rendered":{"charts":0,"images":5,"macros":1,"external_links":23,"defined_names":527,"comments":1,"pivot_tables":0},"unopened":[],"bounds":{"document_bytes":16777216,"sheet_cells":100000,"rows_first":2000,"rows_last":500,"rows_between":2000,"halvings":0,"cell_chars":16384,"cell_head_chars":4096},"cells_cut":0,"cells_raw":0,"read":"whole","date_system":"1900"}

{"sheet":"COVER SHEET","index":0,"n_rows":98,"n_cols":10,"rows_kept":98,"cut":false,"hidden":false,"merged":[[43,1,45,2],[53,1,57,2],[26,1,26,2],[14,1,14,2],[7,0,7,2],[9,0,10,2],[11,0,11,2],[13,1,13,2]]}
[null,{"$f":"YEAR(C29)","v":1900}]
[]
[]
[]
[]
[]
[]
["INVESTMENT SERVICES RULES FOR INVESTMENT SERVICES PROVIDERS"]
[]
["PART B: STANDARD LICENCE CONDITIONS"]
{"$rows_left_out":89}
{"sheet":"Review","index":1,"n_rows":82,"n_cols":7,"rows_kept":82,"cut":false,"hidden":true,"merged":[[62,4,62,5],[63,4,63,5],[74,4,74,5],[65,4,65,5],[66,4,66,5],[68,4,68,5],[69,4,70,4],[69,5,70,5],[71,4,72,4],[71,5,72,5],[64,4,64,5],[52,4,52,5],[53,4,53,5],[54,4,54,5],[61,1,61,2],[61,4,61,5],[58,4,58,5],[59,4,59,5],[44,4,44,5],[45,4,45,5],[46,4,46,5],[47,4,47,5],[48,4,48,5],[50,4,50,5],[51,4,51,5],[37,1,37,2],[37,4,37,5],[1,1,2,2],[4,1,4,2],[4,4,4,5],[20,1,20,2],[30,4,30,5],[49,4,49,5],[38,4,38,5],[39,4,39,5],[40,4,40,5],[41,4,41,5],[42,4,42,5],[43,4,43,5]]}
[]
[null,{"$f":"'COVER SHEET'!C18","v":0},null,null,"Review of",{"$f":"IF('COVER SHEET'!B15=\"Annual Financial Return\",\"AFR\",IF('COVER SHEET'!B15=\"Interim Financial Return\",\"IFR\",IF('COVER SHEET'!B15=\"Audited Annual Financial Return\",\"AAFR\",0)))","v":"AAFR"}]
[null,null,null,null,"as at",{"$f":"C11","v":"00:00:00"}]
[]
[null,"Company Details",null,null,"Validation Checks"]
[null,"Licence Holder Name",{"$f":"B2","v":0}]
[null,"Licence Holder Code",{"$f":"'COVER SHEET'!C20","v":""},null,"Cover Sheet",{"$f":"IF('VALIDATION SHEET'!L8=\"error\",0,1)","v":0}]
[null,"Licence Category",{"$f":"'COVER SHEET'!#REF!","v":{"$error":"#REF!"}},null,"Sheet 1"]
[null,null,null,null,"Input Sheet",{"$f":"IF('VALIDATION SHEET'!L10=\"error\",0,1)","v":0}]
[null,"For the period from:",{"$f":"'COVER SHEET'!C28","v":"00:00:00"},null,"Sheet 2"]
{"$rows_left_out":73}
{"sheet":"CONTENTS","index":2,"n_rows":27,"n_cols":11,"rows_kept":27,"cut":false,"hidden":false,"merged":[]}
[]
[null,"CONTENTS"]
[]
[]
[null,"Sheet 1",null,"INPUT SHEET - MANDATORY",null,null,null,null,null,null,{"$f":"+IF('[21]COVER SHEET'!$C$39>0,\"YES\",\"NO\")","v":"NO"}]
[]
[null,"Sheet 2",null,"INCOME STATEMENT ",null,null,null,null,null,null,{"$f":"+IF('[21]COVER SHEET'!$C$39>0,\"YES\",\"NO\")","v":"NO"}]
[]
[{"$f":"IF('COVER SHEET'!B15 =\"Annual Financial Return\",10,0)","v":0},"Sheet 3",null,"BALANCE SHEET ",null,null,null,null,null,null,{"$f":"+IF('[21]COVER SHEET'!$C$39>0,\"YES\",\"NO\")","v":"NO"}]
[]
{"$rows_left_out":18}
{"sheet":"CSV_workings","index":3,"n_rows":389,"n_cols":35,"rows_kept":389,"cut":false,"hidden":true,"merged":[]}
["UnitID","BOP","Table","Year","Freq","MQ","VarID","CountryCode","SectorCode","Doubtful","Input","F01","F02","F03","F04","F05","F06","F07","F08","F09","F10","F11","F12","F13","F14","F15","F16","F17","F18","F19","F20","NewVarLabel",0,"Sheet Name","Line"]
[{"$f":"#REF!","v":{"$error":"#REF!"}},{"$f":"#REF!","v":{"$error":"#REF!"}},1,{"$f":"#REF!","v":{"$error":"#REF!"}},{"$f":"#REF!","v":{"$error":"#REF!"}},{"$f":"#REF!","v":{"$error":"#REF!"}},{"$f":"IF(#REF!=\"\",0,VLOOKUP(#REF!,#REF!,2,FALSE))","v":{"$error":"#REF!"}},{"$f":"IF(#REF!=\"\",0,VLOOKUP(#REF!,#REF!,2,FALSE))","v":{"$error":"#REF!"}},{"$f":"IF(#REF!=\"\",0,VLOOKUP(#REF!,#REF!,2,FALSE))","v":{"$error":"#REF!"}},"00","DPM",{"$f":"#REF!","v":{"$error":"#REF!"}},{"$f":"#REF!","v":{"$error":"#REF!"}},null,null,null,null,null,null,null,null,null,null,null,null,null,null,null,null,null,null,"-",{"$f":"IF(OR(ABS(L2)>=0.55,ABS(M2)>=0.55,ABS(N2)>=0.55,ABS(O2)>=0.55,ABS(P2)>=0.55,ABS(Q2)>=0.55,ABS(R2)>=0.55,ABS(S2)>=0.55,ABS(T2)>=0.55,ABS(U2)>=0.55,ABS(V2)>=0.55,ABS(W2)>=0.55,ABS(X2)>=0.55,ABS(Y2)>=0.55,ABS(Z2)>=0.55,ABS(AA2)>=0.55,ABS(AB2)>=0.55,ABS(AC2)>=0.55,ABS(AD2)>=0.55,ABS(AE2)>=0.55),0,1)","v":{"$error":"#REF!"}},"Sheet 21 Non Nominee'!F15 / G15",15]
[{"$f":"$A$2","v":{"$error":"#REF!"}},{"$f":"$B$2","v":{"$error":"#REF!"}},1,{"$f":"$D$2","v":{"$error":"#REF!"}},{"$f":"$E$2","v":{"$error":"#REF!"}},{"$f":"$F$2","v":{"$error":"#REF!"}},{"$f":"IF(#REF!=\"\",0,VLOOKUP(#REF!,#REF!,2,FALSE))","v":{"$error":"#REF!"}},{"$f":"IF(#REF!=\"\",0,VLOOKUP(#REF!,#REF!,2,FALSE))","v":{"$error":"#REF!"}},{"$f":"IF(#REF!=\"\",0,VLOOKUP(#REF!,#REF!,2,FALSE))","v":{"$error":"#REF!"}},"00","DPM",{"$f":"#REF!","v":{"$error":"#REF!"}},{"$f":"#REF!","v":{"$error":"#REF!"}},null,null,null,null,null,null,null,null,null,null,null,null,null,null,null,null,null,null,"-",{"$error":"#REF!"},null,16]
[{"$error":"#REF!"},{"$error":"#REF!"},1,{"$error":"#REF!"},{"$error":"#REF!"},{"$error":"#REF!"},{"$f":"IF(#REF!=\"\",0,VLOOKUP(#REF!,#REF!,2,FALSE))","v":{"$error":"#REF!"}},{"$f":"IF(#REF!=\"\",0,VLOOKUP(#REF!,#REF!,2,FALSE))","v":{"$error":"#REF!"}},{"$f":"IF(#REF!=\"\",0,VLOOKUP(#REF!,#REF!,2,FALSE))","v":{"$error":"#REF!"}},"00","DPM",{"$f":"#REF!","v":{"$error":"#REF!"}},{"$f":"#REF!","v":{"$error":"#REF!"}},null,null,null,null,null,null,null,null,null,null,null,null,null,null,null,null,null,null,"-",{"$error":"#REF!"},null,17]
[{"$error":"#REF!"},{"$error":"#REF!"},1,{"$error":"#REF!"},{"$error":"#REF!"},{"$error":"#REF!"},{"$f":"IF(#REF!=\"\",0,VLOOKUP(#REF!,#REF!,2,FALSE))","v":{"$error":"#REF!"}},{"$f":"IF(#REF!=\"\",0,VLOOKUP(#REF!,#REF!,2,FALSE))","v":{"$error":"#REF!"}},{"$f":"IF(#REF!=\"\",0,VLOOKUP(#REF!,#REF!,2,FALSE))","v":{"$error":"#REF!"}},"00","DPM",{"$f":"#REF!","v":{"$error":"#REF!"}},{"$f":"#REF!","v":{"$error":"#REF!"}},null,null,null,null,null,null,null,null,null,null,null,null,null,null,null,null,null,null,"-",{"$error":"#REF!"},null,18]
[{"$error":"#REF!"},{"$error":"#REF!"},1,{"$error":"#REF!"},{"$error":"#REF!"},{"$error":"#REF!"},{"$f":"IF(#REF!=\"\",0,VLOOKUP(#REF!,#REF!,2,FALSE))","v":{"$error":"#REF!"}},{"$f":"IF(#REF!=\"\",0,VLOOKUP(#REF!,#REF!,2,FALSE))","v":{"$error":"#REF!"}},{"$f":"IF(#REF!=\"\",0,VLOOKUP(#REF!,#REF!,2,FALSE))","v":{"$error":"#REF!"}},"00","DPM",{"$f":"#REF!","v":{"$error":"#REF!"}},{"$f":"#REF!","v":{"$error":"#REF!"}},null,null,null,null,null,null,null,null,null,null,null,null,null,null,null,null,null,null,"-",{"$error":"#REF!"},null,19]
[{"$error":"#REF!"},{"$error":"#REF!"},1,{"$error":"#REF!"},{"$error":"#REF!"},{"$error":"#REF!"},{"$f":"IF(#REF!=\"\",0,VLOOKUP(#REF!,#REF!,2,FALSE))","v":{"$error":"#REF!"}},{"$f":"IF(#REF!=\"\",0,VLOOKUP(#REF!,#REF!,2,FALSE))","v":{"$error":"#REF!"}},{"$f":"IF(#REF!=\"\",0,VLOOKUP(#REF!,#REF!,2,FALSE))","v":{"$error":"#REF!"}},"00","DPM",{"$f":"#REF!","v":{"$error":"#REF!"}},{"$f":"#REF!","v":{"$error":"#REF!"}},null,null,null,null,null,null,null,null,null,null,null,null,null,null,null,null,null,null,"-",{"$error":"#REF!"},null,20]
[{"$error":"#REF!"},{"$error":"#REF!"},1,{"$error":"#REF!"},{"$error":"#REF!"},{"$error":"#REF!"},{"$f":"IF(#REF!=\"\",0,VLOOKUP(#REF!,#REF!,2,FALSE))","v":{"$error":"#REF!"}},{"$f":"IF(#REF!=\"\",0,VLOOKUP(#REF!,#REF!,2,FALSE))","v":{"$error":"#REF!"}},{"$f":"IF(#REF!=\"\",0,VLOOKUP(#REF!,#REF!,2,FALSE))","v":{"$error":"#REF!"}},"00","DPM",{"$f":"#REF!","v":{"$error":"#REF!"}},{"$f":"#REF!","v":{"$error":"#REF!"}},null,null,null,null,null,null,null,null,null,null,null,null,null,null,null,null,null,null,"-",{"$error":"#REF!"},null,21]
[{"$error":"#REF!"},{"$error":"#REF!"},1,{"$error":"#REF!"},{"$error":"#REF!"},{"$error":"#REF!"},{"$f":"IF(#REF!=\"\",0,VLOOKUP(#REF!,#REF!,2,FALSE))","v":{"$error":"#REF!"}},{"$f":"IF(#REF!=\"\",0,VLOOKUP(#REF!,#REF!,2,FALSE))","v":{"$error":"#REF!"}},{"$f":"IF(#REF!=\"\",0,VLOOKUP(#REF!,#REF!,2,FALSE))","v":{"$error":"#REF!"}},"00","DPM",{"$f":"#REF!","v":{"$error":"#REF!"}},{"$f":"#REF!","v":{"$error":"#REF!"}},null,null,null,null,null,null,null,null,null,null,null,null,null,null,null,null,null,null,"-",{"$error":"#REF!"},null,22]
[{"$error":"#REF!"},{"$error":"#REF!"},1,{"$error":"#REF!"},{"$error":"#REF!"},{"$error":"#REF!"},{"$f":"IF(#REF!=\"\",0,VLOOKUP(#REF!,#REF!,2,FALSE))","v":{"$error":"#REF!"}},{"$f":"IF(#REF!=\"\",0,VLOOKUP(#REF!,#REF!,2,FALSE))","v":{"$error":"#REF!"}},{"$f":"IF(#REF!=\"\",0,VLOOKUP(#REF!,#REF!,2,FALSE))","v":{"$error":"#REF!"}},"00","DPM",{"$f":"#REF!","v":{"$error":"#REF!"}},{"$f":"#REF!","v":{"$error":"#REF!"}},null,null,null,null,null,null,null,null,null,null,null,null,null,null,null,null,null,null,"-",{"$error":"#REF!"},null,23]
{"$rows_left_out":380}
{"sheet":"CSV_final","index":4,"n_rows":0,"n_cols":0,"rows_kept":0,"cut":false,"hidden":true,"merged":[]}

{"sheet":"Sheet 1","index":5,"n_rows":1105,"n_cols":523,"rows_kept":1105,"cut":false,"hidden":false,"merged":[[37,1,37,2],[38,1,38,2],[137,1,137,2],[138,1,138,2],[139,1,139,2],[140,1,140,2],[141,1,141,2],[142,1,142,2],[168,1,168,2],[110,1,110,2],[111,1,111,2],[112,1,112,2],[114,1,114,2],[115,1,115,2],[108,1,108,2],[120,1,120,2],[121,1,121,2],[122,1,122,2],[124,1,124,2],[123,1,123,2],[118,1,118,2],[119,1,119,2],[109,1,109,2],[131,1,131,2],[179,1,179,2],[173,1,173,2],[174,1,174,2],[175,1,175,2],[177,1,177,2],[154,1,154,2],[156,1,156,2],[134,1,134,2],[135,1,135,2],[136,1,136,2],[155,1,155,2],[410,5,410,7],[203,1,203,2],[181,1,181,2],[215,1,215,2],[216,1,216,2],[217,1,217,2],[182,1,182,2],[183,1,183,2],[191,1,191,2],[192,1,192,2],[193,1,193,2],[196,1,196,2],[198,1,198,2],[199,1,199,2],[200,1,200,2],[201,1,201,2],[350,5,350,11],[185,1,185,2],[206,1,206,2],[221,1,221,2],[245,1,245,2],[246,1,246,2],[202,1,202,2],[220,1,220,2],[5,6,5,7],[35,4,35,6],[82,4,82,6],[84,4,84,6],[157,1,157,2],[158,1,158,2],[159,1,159,2],[78,5,78,6],[143,1,143,2],[144,1,144,2],[145,1,145,2],[153,1,153,2],[95,1,95,2],[96,1,96,2],[81,5,81,6],[79,5,79,6],[113,1,113,2],[146,1,146,2],[152,1,152,2],[125,1,125,2],[126,1,126,2],[127,1,127,2],[116,1,116,2],[117,1,117,2],[247,1,247,2],[223,1,223,2],[224,1,224,2],[225,1,225,2],[226,1,226,2],[227,1,227,2],[228,1,228,2],[234,1,234,2],[229,1,229,2],[230,1,230,2],[231,1,231,2],[235,1,235,2],[238,1,238,2],[244,1,244,2],[282,1,282,2],[388,4,390,7],[386,4,387,7],[304,5,304,6],[305,5,305,6],[328,7,328,11],[287,1,287,2],[381,4,382,7],[383,4,385,7],[292,3,293,3],[293,1,293,2],[299,1,299,2],[306,6,307,6],[314,1,314,2],[319,7,319,11],[312,8,312,9],[283,1,283,2],[286,1,286,2],[285,1,285,2],[284,1,284,2],[197,1,197,2],[208,1,208,2],[233,1,233,2],[189,1,189,2],[190,1,190,2],[204,1,204,2],[205,1,205,2],[207,1,207,2],[219,1,219,2],[279,1,279,2],[250,1,250,2],[257,1,257,2],[264,1,264,2],[251,1,251,2],[252,1,252,2],[253,1,253,2],[254,1,254,2],[255,1,255,2],[259,1,259,2],[276,1,276,2],[277,1,277,2],[256,1,256,2],[274,1,274,2],[275,1,275,2],[267,1,267,2],[263,1,263,2],[180,1,180,2],[169,1,169,2],[147,1,147,2],[148,1,148,2],[149,1,149,2],[150,1,150,2],[151,1,151,2],[194,1,194,2],[195,1,195,2],[160,1,160,2],[187,1,187,2],[188,1,188,2],[178,1,178,2],[170,1,170,2],[171,1,171,2],[176,1,176,2],[172,1,172,2],[165,1,165,2],[161,1,161,2],[166,1,166,2],[167,1,167,2],[162,1,162,2],[164,1,164,2],[163,1,163,2],[399,5,399,7],[232,1,232,2],[239,1,239,2],[240,1,240,2],[241,1,241,2],[242,1,242,2],[243,1,243,2],[222,1,222,2],[184,1,184,2],[186,1,186,2],[218,1,218,2],[209,1,209,2],[210,1,210,2],[211,1,211,2],[212,1,212,2],[213,1,213,2],[214,1,214,2],[280,1,280,2],[236,1,236,2],[237,1,237,2],[248,1,248,2],[249,1,249,2],[278,1,278,2],[270,1,270,2],[132,1,132,2],[133,1,133,2],[87,5,87,7],[100,1,100,2],[101,1,101,2],[102,1,102,2],[103,1,103,2],[104,1,104,2],[105,1,105,2],[106,1,106,2],[107,1,107,2],[90,5,90,7],[97,1,97,2],[98,1,98,2],[99,1,99,2],[94,1,94,2],[91,5,91,11],[1104,1,1105,2],[413,5,416,8],[418,5,426,8],[423,1,426,3],[80,5,80,9],[86,5,86,7],[291,1,291,2],[258,1,258,2],[268,1,268,2],[271,1,271,2],[272,1,272,2],[273,1,273,2],[288,1,288,2],[289,1,289,2],[290,1,290,2],[269,1,269,2],[260,1,260,2],[261,1,261,2],[262,1,262,2],[265,1,265,2],[266,1,266,2],[128,1,128,2],[129,1,129,2],[130,1,130,2]]}
[]
[]
[]
[null,"INPUT SHEET"]
[]
[null,"For the period from ",{"$f":"'COVER SHEET'!C28","v":"00:00:00"}," to ",null,null,{"$f":"'COVER SHEET'!C29","v":"00:00:00"}]
[]
[null,null,"Amounts included on the credit should be -ve "]
[null,null,"Amounts included on the debit should be +ve "]
[null,null,null,"As per Trial Balance"]
{"$rows_left_out":1096}
{"sheet":"Sheet 2","index":6,"n_rows":107,"n_cols":14,"rows_kept":107,"cut":false,"hidden":false,"merged":[[62,1,62,5],[63,2,63,5]]}
[]
[null,null,null,null,null,null,null,null,null,"Initialled by the auditor for identification purposes only "]
[]
[null,"INCOME STATEMENT & ITEMS THROUGH STATEMENT OF CHANGES IN EQUITY"]
[]
[null,"For the period from ",null,{"$f":"'COVER SHEET'!C28","v":"00:00:00"}," to ",{"$f":"'COVER SHEET'!C29","v":"00:00:00"}]
[]
[null,null,null,null,null,null,{"$f":"IF('COVER SHEET'!C34=\"\",\"\",'COVER SHEET'!C34)","v":""},null,null,null,{"$f":"IF('COVER SHEET'!C34=\"\",\"\",'COVER SHEET'!C34)","v":""}]
[null,"Dealing Profit / (Loss)"]
[]
{"$rows_left_out":98}
{"sheet":"Sheet 3","index":7,"n_rows":70,"n_cols":10,"rows_kept":70,"cut":false,"hidden":false,"merged":[[69,1,69,9]]}
[]
[null,null,null,null,null,null,null,null,"Initialled by the auditor for identification purposes only "]
[]
[null,"STATEMENT OF FINANCIAL POSITION"]
[]
[null,"As at: ",{"$f":"'COVER SHEET'!C29","v":"00:00:00"}]
[]
[null,"Assets"]
[null,null,null,null,null,null,{"$f":"IF('COVER SHEET'!C34=\"\",\"\",'COVER SHEET'!C34)","v":""},null,null,{"$f":"IF('COVER SHEET'!C34=\"\",\"\",'COVER SHEET'!C34)","v":""}]
[1,"Non-current"]
{"$rows_left_out":61}
{"sheet":"Sheet 4","index":8,"n_rows":103,"n_cols":5,"rows_kept":103,"cut":false,"hidden":false,"merged":[[12,0,14,0],[1,1,1,4]]}
[]
[null,"OWN FUNDS"]
[]
[null,"Rows","Item","Label","Amount"]
[null,"010",1,"OWN FUNDS",{"$f":"SUM(E7+E61+E82)","v":0}]
[null,"015","1.1","TIER 1 CAPITAL",{"$f":"SUM(E7+E61)","v":0}]
[null,"020",{"$f":"C$6&\".1\"","v":"1.1.1"},"COMMON EQUITY TIER 1 CAPITAL",{"$f":"(E8+E17+E22+E23+E24+E25+E26+E27+E28+E34+E38+E41+E42+E43+E47+E48+E49+E50+E51+E52+E53+E54+E55+E56+E57+E58+E59+E60)","v":0}]
[null,"030",{"$f":"C$7&\".1\"","v":"1.1.1.1"},"Capital instruments eligible as CET1 Capital",{"$f":"E9+E11+E12+E16-E10","v":0}]
[null,"040",{"$f":"C$8&\".1\"","v":"1.1.1.1.1"},"Paid up capital instruments ",{"$f":"ABS('Sheet 1'!D356)","v":0}]
[null,"050","1.1.1.1.2*","Memorandum item: Capital instruments not eligible"]
{"$rows_left_out":94}
{"sheet":"Sheet 4.1","index":9,"n_rows":127,"n_cols":5,"rows_kept":127,"cut":false,"hidden":false,"merged":[]}
[]
[null,"C 04.00 - MEMORANDUM ITEMS (CA4)"]
[]
[null,"Row","ID","Item","Amount"]
[null,"Deferred tax assets and liabilities"]
[null,"010",1,"Total deferred tax assets",{"$f":"'Sheet 1'!D92","v":0}]
[null,"020",{"$f":"C$6&\".1\"","v":"1.1"},"Deferred tax assets that do not rely on future profitability"]
[null,"030",{"$f":"C$6&\".2\"","v":"1.2"},"Deferred tax assets that rely on future profitability and do not arise from temporary differences"]
[null,"040",{"$f":"C$6&\".3\"","v":"1.3"},"Deferred tax assets that rely on future profitability and arise from temporary differences"]
[null,"050",2,"Total deferred tax liabilities",{"$f":"-'Sheet 1'!D351","v":0}]
{"$rows_left_out":118}
{"sheet":"Sheet 4.2","index":10,"n_rows":63,"n_cols":11,"rows_kept":63,"cut":false,"hidden":false,"merged":[[1,1,1,10],[3,1,4,3],[3,4,5,4],[3,5,4,5],[3,6,4,6],[3,7,4,7],[3,8,4,8],[3,9,3,10]]}
[]
[null,"C 05.01 - TRANSITIONAL PROVISIONS (CA5.1)"]
[]
[null,"CA 5.1",null,null,"Legal references","Adjustments to CET1","Adjustments to AT1","Adjustments to T2","Adjustments included in RWAs","Memorandum items"]
[null,null,null,null,null,null,null,null,null,"Applicable percentage","Eligible amount without transitional provisions"]
[null,"Code","ID","Item",null,"010","020","030","040","050","060"]
[null,"010","1","TOTAL ADJUSTMENTS",null,{"$f":"SUM(F8+F13+F18)","v":0},{"$f":"SUM(G8+G13+G18)","v":0},{"$f":"SUM(H8+H13+H18)","v":0},0,null,0]
[null,"020","1.1","GRANDFATHERED INSTRUMENTS",null,{"$f":"SUM(F9+F12)","v":0},{"$f":"SUM(G9+G12)","v":0},{"$f":"SUM(H9+H12)","v":0},0,null,0]
[null,"030","1.1.1","Grandfathered instruments: Instruments constituting state aid","Article 462 of CRR",{"$f":"SUM(F10+F11)","v":0},{"$f":"SUM(G10+G11)","v":0},{"$f":"SUM(H10+H11)","v":0}]
[null,"040","1.1.1.1","Instruments that qualified as own funds according to 2006/48/EC","Article 462 (2), (3) and (4) of CRR",0,0,0]
{"$rows_left_out":54}
{"sheet":"Sheet 5","index":11,"n_rows":47,"n_cols":13,"rows_kept":47,"cut":false,"hidden":false,"merged":[[31,1,31,5],[3,1,3,7],[18,1,18,5],[28,1,28,5],[29,1,29,5]]}
[]
[null,null,null,null,null,null,null,"Initialled by the auditor for identification purposes only "]
[]
[null,"FIXED OVERHEAD REQUIREMENT"]
[]
[null,"As at:",{"$f":"'COVER SHEET'!C29","v":"00:00:00"},null,null,null,null,null,null,null,null,null,"Yes"]
[null,null,null,null,null,null,null,null,null,null,null,null,"No"]
[1,"How many months are represented in the recent Audited Financial Statements"]
[]
[2,"Total Expenditure",null,null,null,null,null,null,null,null,null,null,1]
{"$rows_left_out":38}
{"sheet":"Sheet 6","index":12,"n_rows":29,"n_cols":14,"rows_kept":29,"cut":false,"hidden":false,"merged":[[15,2,15,5],[17,1,17,5],[19,1,19,5],[21,1,21,6]]}
[]
[]
[null,null,null,null,null,null,null,null,{"$f":"+IF('[22]COVER SHEET'!$B$22=\"\",0,IF('[22]COVER SHEET'!$B$22=\"Interim Financial Return\",0,IF('[22]Sheet 7'!$K$82=\"\",0,'[22]Sheet 7'!$K$82)))","v":0}]
[null,"FINANCIAL RESOURCES REQUIREMENT"]
[]
[null,"As at ",{"$f":"'COVER SHEET'!C29","v":"00:00:00"}]
[]
[]
[]
["1.0","Total Own Funds",null,null,null,null,null,null,{"$f":"'Sheet 4'!E5","v":0}]
{"$rows_left_out":20}
{"sheet":"Sheet 7","index":13,"n_rows":113,"n_cols":15,"rows_kept":113,"cut":false,"hidden":false,"merged":[[18,2,21,8],[22,2,24,8],[15,2,16,8],[42,1,42,6],[30,1,30,6],[32,1,32,6],[33,1,33,6],[34,1,34,6],[35,1,35,6],[36,1,36,6],[37,1,37,6],[38,1,38,6],[39,1,39,6],[40,1,40,6],[41,1,41,6],[74,1,74,10],[43,1,43,6],[44,1,44,6],[45,1,45,6],[46,1,46,6],[47,1,47,6],[48,1,48,6],[49,1,49,6],[50,1,50,6],[51,1,51,6],[64,2,64,3],[64,5,64,6],[112,2,112,5],[76,1,76,10],[77,1,77,10],[96,2,96,5],[101,2,101,5],[106,9,106,10],[110,8,110,9]]}
[]
[]
[]
[null,"REPRESENTATIONS",null,null,null,{"$f":"IF('COVER SHEET'!C18=\"\",\"\",'COVER SHEET'!C18)","v":""}]
[]
[null,null,null,null,null,null,null,null,null,null,"Insert Yes/ No:"]
[]
["1.","Is the licence holder able, and will it be able for the forseeable future, to meet all of its liabilities ",null,null,null,null,null,null,null,null,null,null,null,null,"YES"]
[null,"as they fall due for payment?",null,null,null,null,null,null,null,null,null,null,null,null,"NO"]
[]
{"$rows_left_out":104}
{"sheet":"Applicable Percentages","index":14,"n_rows":43,"n_cols":7,"rows_kept":43,"cut":false,"hidden":true,"merged":[[0,0,0,1],[13,0,13,1],[29,0,29,2],[37,0,37,2]]}
["GrandFathering Instruments",null,"464(5)"]
[2013,0.9]
[{"$f":"A2+1","v":2014},{"$f":"B2-10%","v":0.8}]
[{"$f":"A3+1","v":2015},{"$f":"B3-10%","v":0.70000000000000007}]
[2016,0.60000000000000009]
[2017,0.50000000000000011]
[2018,0.40000000000000013]
[2019,0.30000000000000016]
[2020,0.20000000000000015]
[2021,0.10000000000000014]
{"$rows_left_out":34}
{"sheet":"Sheet 8","index":15,"n_rows":63,"n_cols":18,"rows_kept":63,"cut":false,"hidden":false,"merged":[[60,1,60,7],[39,2,39,3],[42,2,42,3],[48,2,48,3],[50,2,50,3],[55,1,56,7],[58,1,59,7],[37,2,37,3],[6,2,6,5],[8,3,8,4],[9,3,9,4],[17,3,18,3],[34,2,34,3]]}
[]
[]
[]
[]
[]
[null,null,null,null,null,null,null,null,null,null,null,null,null,"Fixed (€)","Variable/tranche (€)","Variable","Total","Currency"]
[null,null,"ANNUAL SUPERVISORY FEE CALCULATOR",null,null,null,null,null,null,null,null,"Category 1A",null,2000,350,{"$f":"IF($E$27<50000,0,IF($E$27<=1000000,(ROUNDUP((($E$27-50000)/50000),0)*$O$7),(19*$O$7)))","v":0},{"$f":"N7+P7","v":2000},"EUR"]
[null,null,null,null,null,null,null,null,null,null,null,"Category 1B",null,2750,350,{"$f":"IF($E$27<50000,0,IF($E$27<=1000000,(ROUNDUP((($E$27-50000)/50000),0)*$O$8),(19*$O$8)))","v":0},{"$f":"N8+P8","v":2750},"GBP"]
[null,null,null,"(To be compiled and submitted in hard copy on an Annual basis together with the Audited Annual Financial Return)",null,null,null,null,null,null,null,"Category 2",null,4500,400,{"$f":"IF($E$27<250000,0,IF($E$27<=5000000,(ROUNDUP((($E$27-250000)/250000),0)*$O$9),(19*$O$9)))","v":0},{"$f":"N9+P9","v":4500},"USD"]
[null,null,null,null,null,null,null,null,null,null,null,"Category 3",null,6000,400,{"$f":"IF($E$27<250000,0,IF($E$27<=50000000,(ROUNDUP((($E$27-250000)/250000),0)*$O$10),(199*$O$10)))","v":0},{"$f":"N10+P10","v":6000}]
{"$rows_left_out":54}
{"sheet":"LH Names & Codes","index":16,"n_rows":59,"n_cols":5,"rows_kept":59,"cut":false,"hidden":true,"merged":[]}
["LH Name","Code","Licence Type","LEI Code"]
["24 Capital Management Limited ","24CM","AIFM","254900U468UFGFSSUU96"]
["Abalone Asset Management Limited","ABAL","AIFM+UCITS","213800RJPNK256NQ3V19"]
["Accendo Capital Management","ACML14","AIFM","984500BC2E0X69ETCF12"]
["Accolade Investment Company Limited","AICL","AIFM","52990058ACRLCNZ2UY14"]
["Adventum International Limited","ADVN","AIFM","529900SSBWKEESF51507"]
["Agon Asset Management Limited","TIME","AIFM","213800XHYX5J3FINK248"]
["Alanda Capital Management (Malta) Limited","ALND","AIFM","213800ABTM42ACZA6145","lapsed"]
["Alpha Value Management Limited","AVML","AIFM+UCITS","21380023BOO37ZG47O86"]
["Altarius Asset Management Limited","ALTA","AIFM","5299000X84JRI8MS7D35"]
{"$rows_left_out":50}
{"sheet":"Non-Malta Funds","index":17,"n_rows":234,"n_cols":10,"rows_kept":234,"cut":false,"hidden":false,"merged":[[1,1,1,10]]}
[]
[null,"NON-MALTA DOMICILED FUNDS MANAGED IN MALTA"]
[]
[null,null,{"$f":"'COVER SHEET'!C18","v":0},null,null,null,"DATA PROVIDED AS AT",{"$f":"'COVER SHEET'!C29","v":"00:00:00"}]
[]
[null,"Kindly Indicate the number of non-Malta domiciled Collective Investment Schemes (including sub-Funds) managed by the Fund Manager directly or indirectly."]
[null,"In the case of both feeder and master funds being managed, kindly list both funds but include AUM only once.",null,null,null,"Please input in the relevant cells highlighted in blue "]
[]
[0,"Name of non-Malta domiciled Collective Investment Scheme managed by the fund manager","Name  of sub-Fund","Domiciled country of fund (Country where the fund is licensed)","Name of Custodian","Location of Custodian","Other custodians (if any)","Location of other custodians (if any)","Type of fund (equity fund, bond fund, hedge fund, real estate fund,  money market fund, etc.)","Assets Under Management (in EUR)"]
[1]
{"$rows_left_out":225}
{"sheet":"VALIDATION SHEET","index":18,"n_rows":80,"n_cols":19,"rows_kept":80,"cut":false,"hidden":false,"merged":[[5,1,5,2],[5,4,5,7],[5,13,5,20],[46,7,46,18]]}
[]
[null,null,null,null,null,null,null,null,null,null,null,null,null,null,null,null,null,"Initialled by the auditor for identification purposes only "]
[null,null,null,null,null,null,null,null,null,null,null,null,null,null,null,null,null,null,{"$f":"IF('[22]COVER SHEET'!$B$22=\"\",0,IF('[22]COVER SHEET'!$B$22=\"Interim Financial Return\",0,IF('[22]Sheet 7'!$K$82=\"\",0,'[22]Sheet 7'!$K$82)))","v":0}]
[null,"VALIDATION SHEET"]
[]
[null,"Sheet Number:",null,null,"Sheet Title",null,null,null,null,null,null,null,null,"Description of Error"]
[]
[null,"Cover Sheet",null,null,null,null,null,null,null,null,null,{"$f":"+IF(G50>0,\"ERROR\",\"OK\")","v":"ERROR"},null,{"$f":"IF(L8=\"ERROR\",\"CHECK THAT ENTRIES IN COVER SHEET ARE CORRECTLY INPUTTED.\",\"\")","v":"CHECK THAT ENTRIES IN COVER SHEET ARE CORRECTLY INPUTTED."}]
[]
[null,"Sheet 1",{"$f":"+'[22]Sheet 1'!J4","v":"IFR 1"},null,{"$f":"[22]CONTENTS!E5","v":"INPUT SHEET - MANDATORY"},null,null,null,null,null,null,{"$f":"+IF(G54>0,\"ERROR\",\"OK\")","v":"ERROR"},null,{"$f":"IF(L10=\"ERROR\",\"CHECK THAT ALL ENTRIES HAVE BEEN FILLED AND ARE CORRECTLY INPUTTED.\",\"\")","v":"CHECK THAT ALL ENTRIES HAVE BEEN FILLED AND ARE CORRECTLY INPUTTED."}]
{"$rows_left_out":71}
{"sheet":"Subordinated Loan Working","index":19,"n_rows":95,"n_cols":9,"rows_kept":95,"cut":false,"hidden":true,"merged":[[3,1,3,7],[35,1,35,7],[67,1,67,7]]}
[]
[]
[]
[null,"SUBORDINATED LOAN 1 - Perpetual"]
[]
[null,"As at ",{"$f":"'COVER SHEET'!C29","v":"00:00:00"}]
[]
[null,"Subordinated Loan General Information"]
[]
[null,"Nominal Amount",null,null,null,null,null,null,{"$f":"ABS('Sheet 1'!D343)","v":0}]
{"$rows_left_out":85}