{"text_format":"1","workbook":"xlsx","n_sheets":20,"sheets":["COVER SHEET","Review","CONTENTS","CSV_workings","CSV_final","Sheet 1","Sheet 2","Sheet 3","Sheet 4","Sheet 4.1","Sheet 4.2","Sheet 5","Sheet 6","Sheet 7","Applicable Percentages","Sheet 8","LH Names & Codes","Non-Malta Funds","VALIDATION SHEET","Subordinated Loan Working"],"not_rendered":{"charts":0,"images":5,"macros":1,"external_links":23,"defined_names":527,"comments":1,"pivot_tables":0},"unopened":[],"bounds":{"document_bytes":16777216,"sheet_cells":100000,"rows_first":2000,"rows_last":500,"rows_between":2000,"halvings":0,"cell_chars":16384,"cell_head_chars":4096},"cells_cut":0,"cells_raw":0,"read":"whole","date_system":"1900"}

{"sheet":"COVER SHEET","index":0,"n_rows":98,"n_cols":10,"rows_kept":98,"cut":false,"hidden":false,"merged":[[43,1,45,2],[53,1,57,2],[26,1,26,2],[14,1,14,2],[7,0,7,2],[9,0,10,2],[11,0,11,2],[13,1,13,2]]}
[null,{"$f":"YEAR(C29)","v":1900}]
[]
[]
[]
[]
[]
[]
["INVESTMENT SERVICES RULES FOR INVESTMENT SERVICES PROVIDERS"]
[]
["PART B: STANDARD LICENCE CONDITIONS"]
[]
["Appendix 2B"]
[]
[1,"Document Type:"]
[null,"AUDITED ANNUAL FINANCIAL RETURN"]
[null,null,null,null,null,null,null,null,null,"IFRS"]
[null,null,null,null,null,null,null,null,null,"GAPSME"]
[2,"Name of Licence Holder"]
[]
[3,"Licence Holder Code",{"$f":"IF(ISBLANK(C18),\"\",LOOKUP(C18,'LH Names & Codes'!A:A,'LH Names & Codes'!B:B))","v":""}]
[]
[4,"LEI Code",{"$f":"IF(ISBLANK(C18),\"\",LOOKUP(C18,'LH Names & Codes'!A:A,'LH Names & Codes'!D:D))","v":""}]
[]
[5,"Licence Number"]
[]
[7,"Licence Type",{"$f":"IF(ISBLANK(C18),\"\",LOOKUP(C18,'LH Names & Codes'!A:A,'LH Names & Codes'!C:C))","v":""}]
[]
[7,"For the period  from:"]
[null,"                          to:"]
[null,null,null,""]
[8,"Number of months covered by reporting period",{"$f":"IF(C29=\"\",\"\",(YEAR(C29)-YEAR(C28))*12+MONTH(C29)-MONTH(C28)+1)","v":""}]
[null,null,{"$f":"IF(C31>18,\"Kindly ensure that the period inputted is correct\",\"\")","v":"Kindly ensure that the period inputted is correct"}]
[]
[9,"Currency in which accounts are reported"]
[]
[10,"European Central Bank Exchange rate as at end of reporting period converting the reporting currency to EURO"]
[]
[11,"Accounting Framework"]
[]
[12,"Compliance Officer Name & Surname"]
[]
[13,"MLRO Name & Surname"]
[]
[14,"Kindly disclose the up-to-date firm’s website link(s) which are utilised to provide information to clients and potential clients about the firm’s products and services.  Furthermore, kindly indicate the identified jurisdiction and target audience (e.g. specific category of clients) which the website(s) is/are intended for."]
[]
[]
[]
[null,"Target Audience & Jurisdiction","Link"]
[]
[]
[]
[]
[]
[15,"Kindly disclose the up-to-date firm’s links to any social media pages.  Social media includes but is not limited to: websites, microblogs (e.g. Twitter), social and professional networks (such as Facebook and LinkedIn), forums, image and video-sharing platforms (YouTube, Instagram, TikTok). Furthermore, kindly indicate the identified jurisdiction and target audience (e.g. specific category of clients) which the disclosed social media pages are intended for."]
[]
[]
[]
[]
[null,"Target Audience & Jurisdiction","Social Media & Link"]
[]
[]
[]
[]
[]
[]
[null,"Version 9/2023"]
[]
[]
[null,"EUR"]
[null,"GBP"]
[null,"USD","Category 1a"]
[null,null,"Category 1 a & registered under Insurance Mediation Directive"]
[null,null,"Category 1b"]
[null,null,"Category 1b - PII Exemption"]
[null,null,"Category 4"]
[null,null,"AUDITED ANNUAL FINANCIAL RETURN"]
[null,null,"ANNUAL FINANCIAL RETURN"]
[null,null,"INTERIM FINANCIAL RETURN"]
[]
[]
[]
[]
[null,"Validation Checks"]
[null,null,null,{"$f":"IF(C36=\"\",1,0)","v":1}]
[null,"inputting of exchange rate converting reporting currency to euro",null,{"$f":"IF(C34=\"\",1,0)","v":1}]
[null,"Inputting of currency in which the accounts are reported",null,{"$f":"IF(C34=\"\",1,0)","v":1}]
[null,"Inputting of starting period covered by the Financial Return",null,{"$f":"IF(C28=\"\",1,0)","v":1}]
[null,"Inputting of end period covered by the Financial Return",null,{"$f":"IF(C29=\"\",1,0)","v":1}]
[null,"Inputting of LEI Code",null,{"$f":"IF(C22=\"\",1,0)","v":1}]
[null,"Inputting of the licence number of the licence holder",null,{"$f":"IF(C24=\"\",1,0)","v":1}]
[null,"Inputting of the licence holder code",null,{"$f":"IF(C24=\"\",1,0)","v":1}]
[null,"Inputting of name of licence holder",null,{"$f":"IF(C18=\"\",1,0)","v":1}]
[null,"Inputting of type of document",null,{"$f":"SUM(D84:D92)","v":9}]
[]
[]
[]
[null,"Level of application ","Individual"]
[null,null,"Consolidated"]

{"sheet":"Review","index":1,"n_rows":82,"n_cols":7,"rows_kept":82,"cut":false,"hidden":true,"merged":[[62,4,62,5],[63,4,63,5],[74,4,74,5],[65,4,65,5],[66,4,66,5],[68,4,68,5],[69,4,70,4],[69,5,70,5],[71,4,72,4],[71,5,72,5],[64,4,64,5],[52,4,52,5],[53,4,53,5],[54,4,54,5],[61,1,61,2],[61,4,61,5],[58,4,58,5],[59,4,59,5],[44,4,44,5],[45,4,45,5],[46,4,46,5],[47,4,47,5],[48,4,48,5],[50,4,50,5],[51,4,51,5],[37,1,37,2],[37,4,37,5],[1,1,2,2],[4,1,4,2],[4,4,4,5],[20,1,20,2],[30,4,30,5],[49,4,49,5],[38,4,38,5],[39,4,39,5],[40,4,40,5],[41,4,41,5],[42,4,42,5],[43,4,43,5]]}
[]
[null,{"$f":"'COVER SHEET'!C18","v":0},null,null,"Review of",{"$f":"IF('COVER SHEET'!B15=\"Annual Financial Return\",\"AFR\",IF('COVER SHEET'!B15=\"Interim Financial Return\",\"IFR\",IF('COVER SHEET'!B15=\"Audited Annual Financial Return\",\"AAFR\",0)))","v":"AAFR"}]
[null,null,null,null,"as at",{"$f":"C11","v":"00:00:00"}]
[]
[null,"Company Details",null,null,"Validation Checks"]
[null,"Licence Holder Name",{"$f":"B2","v":0}]
[null,"Licence Holder Code",{"$f":"'COVER SHEET'!C20","v":""},null,"Cover Sheet",{"$f":"IF('VALIDATION SHEET'!L8=\"error\",0,1)","v":0}]
[null,"Licence Category",{"$f":"'COVER SHEET'!#REF!","v":{"$error":"#REF!"}},null,"Sheet 1"]
[null,null,null,null,"Input Sheet",{"$f":"IF('VALIDATION SHEET'!L10=\"error\",0,1)","v":0}]
[null,"For the period from:",{"$f":"'COVER SHEET'!C28","v":"00:00:00"},null,"Sheet 2"]
[null,"For the period      to:",{"$f":"'COVER SHEET'!C29","v":"00:00:00"},null,"Income Statement",{"$f":"IF('VALIDATION SHEET'!L14=\"error\",0,1)","v":1}]
[null,null,null,null,"Sheet 3"]
[null,"Number of months",{"$f":"'COVER SHEET'!C31","v":""},null,"Balance Sheet",{"$f":"IF('VALIDATION SHEET'!L17=\"error\",0,1)","v":1}]
[null,null,null,null,"Sheet 4"]
[null,"Reporting Currency",{"$f":"'COVER SHEET'!C34","v":0},null,"Total Own Funds Calculation",{"$f":"IF('VALIDATION SHEET'!L21=\"error\",0,1)","v":1}]
[null,"Exchange Rate",{"$f":"'COVER SHEET'!C36","v":0}]
[null,null,null,null,"Sheet 5 "]
[null,"Total Funds under Management",{"$f":"'Sheet 1'!D414","v":0},null,"Fixed Overhead Requirement",{"$f":"IF('VALIDATION SHEET'!L24=\"error\",0,1)","v":0}]
[null,"Other Asset under Management",{"$f":"'Sheet 1'!D417","v":0}]
[null,null,null,null,"Sheet 6"]
[null,"Financial Resources Requirement",null,null,"Financial Reources Requirement",{"$f":"IF('VALIDATION SHEET'!L27=\"error\",0,1)","v":1}]
[]
[null,"Total Own Funds",{"$f":"'Sheet 6'!I10","v":0},null,"Sheet 7"]
[null,null,null,null,"Representations",{"$f":"IF('VALIDATION SHEET'!L30=\"error\",0,1)","v":0}]
[null,"Fixed Overhead Requirement",{"$f":"'Sheet 6'!I12","v":0},{"$f":"IF(C25<=0,0,1)","v":0}]
[null,"How many months are represented in the F.O.R?",{"$f":"'Sheet 5'!H8","v":0},{"$f":"IF(C26<12,0,1)","v":0},"Sheet 8"]
[null,null,null,null,"Supervisory Fee - Revenue",{"$f":"'Sheet 8'!F16","v":1}]
[null,"Total Initial Capital",{"$f":"'Sheet 6'!I16","v":0},null,"Supervisory Fee - Gross Commission",{"$f":"'Sheet 8'!F19","v":1}]
[null,"Additional Capital Reources before reductions",{"$f":"'Sheet 6'!G18","v":0}]
[null,"Percentage exemption from additional amount of own funds",{"$f":"'Sheet 6'!G20","v":0}]
[null,"Additional Capital Resources after reductions",{"$f":"'Sheet 6'!I22","v":0},null,"Representations"]
[null,"Total Capital",{"$f":"'Sheet 6'!I24","v":0},null,"Question 1",{"$f":"'Sheet 7'!K9","v":0}]
[null,"Capital Resources Requirment",{"$f":"'Sheet 6'!I27","v":0},null,"Question 2",{"$f":"'Sheet 7'!K12","v":0}]
[null,null,null,null,"Question 3",{"$f":"'Sheet 7'!K16","v":0}]
[null,"Financial Resources Requirement",{"$f":"'Sheet 6'!I29","v":0},null,"Question 4",{"$f":"'Sheet 7'!K19","v":0}]
[]
[]
[null,"Financials",null,null,"Financials Comments"]
[null,"Dealing Profit/Loss",{"$f":"'Sheet 2'!K13","v":0},{"$f":"IF(C39<>0,0,1)","v":1}]
[null,"Commissions Received",{"$f":"'Sheet 2'!K27","v":0}]
[null,"Investment Management and \nAdministration fees",{"$f":"'Sheet 2'!K34","v":0},{"$f":"IF(OR(AND(C18<=0,C41>0),AND(C18>0,C41<=0)),0,1)","v":1}]
[null,"Investment Advisory fees",{"$f":"'Sheet 2'!K41","v":0}]
[null,"Other ISA related revenue",{"$f":"'Sheet 2'!K44","v":0}]
[null,"Non-ISA related revenue",{"$f":"'Sheet 2'!K47","v":0},{"$f":"IF(C44>SUM(C39:C43),0,10)","v":10}]
[null,"Total Revenue",{"$f":"'Sheet 2'!K50","v":0}]
[null,"Operating Expenses ",{"$f":"'Sheet 2'!K73","v":0}]
[null,"Administrative Expenses",{"$f":"'Sheet 2'!K78","v":0}]
[null,"Profit/Loss Before Tax",{"$f":"'Sheet 2'!K88","v":0},{"$f":"IF(C48<0,0,1)","v":1}]
[null,"Profit/Loss After Tax",{"$f":"'Sheet 2'!K92","v":0},{"$f":"IF(C49<0,0,1)","v":1}]
[null,"Total Comprehensive Income",{"$f":"'Sheet 2'!K105","v":0}]
[null,"Total Investments (Long Positions)",{"$f":"'Sheet 3'!G18","v":0}]
[null,"Total Investments (Short Positions)",{"$f":"'Sheet 3'!G59","v":0}]
[null,"Bank and Cash Balances ",{"$f":"'Sheet 3'!G25","v":0},null,null,null,"n/a"]
[null,"Intangible Assets",{"$f":"'Sheet 3'!G11","v":0},null,null,null,"YES"]
[null,"Net Asset Value",{"$f":"'Sheet 3'!J28-'Sheet 3'!J65","v":0},null,null,null,"NO"]
[null,"Subordinated Loan",{"$f":"'Sheet 3'!F48","v":0},null,"Subordinated Loan figure matches with agreement?",null,{"$f":"IF(OR(F56=\"yes\",F56=\"N/A\"),1,0)","v":0}]
[null,"Called up ordinary share capital",{"$f":"'Sheet 3'!G33","v":0},null,"Has there been a change in the Ordinary Share Capital?",null,{"$f":"IF(OR(F57=\"no\",F57=\"N/A\"),1,0)","v":0}]
[null,"Retained earnings from previous year",{"$f":"'Sheet 3'!G37","v":0},null,"Retained earnings tallies with previous year's AFR?",null,{"$f":"IF(OR(F58=\"yes\",F58=\"N/A\"),1,0)","v":0}]
[null,"Other Reserves",{"$f":"'Sheet 3'!G41","v":0}]
[null,"Share Premium Account",{"$f":"'Sheet 3'!G36","v":0}]
[]
[null,"Own Funds and Own Funds Requirements",null,null,"Own Funds Comments"]
[null,"Own Funds",{"$f":"'Sheet 4'!E5","v":0}]
[null,"Tier 1 Capital",{"$f":"'Sheet 4'!E6","v":0}]
[null,"Common Equity Tier 1 Capital",{"$f":"'Sheet 4'!E7","v":0}]
[null,"Tier 2 Capital",{"$f":"'Sheet 4'!E82","v":0}]
[]
[]
[null,"Other Details",null,null,"Representations Question 5 - Complaints"]
[null,"Director 1",{"$f":"'Sheet 7'!C97:F97","v":0},null,"Compliants Received",{"$f":"'Sheet 7'!G59","v":0}]
[null,"Director 2",{"$f":"'Sheet 7'!C102:F102","v":0}]
[null,null,null,null,"Unresolved Complaints",{"$f":"'Sheet 7'!I60","v":0}]
[null,"Compliance Officer",{"$f":"'COVER SHEET'!C40","v":0}]
[]
[null,"MLRO",{"$f":"'COVER SHEET'!C42","v":0},null,"Reviewed by"]
[null,null,null,null,"Name"]
[null,null,null,null,"Date",{"$f":"TODAY()","v":"2024-04-29"}]
[null,null,null,null,"Signature"]
[null,null,null,null,"Second Review"]
[null,null,null,null,"Name"]
[null,null,null,null,"Date"]
[null,null,null,null,"Signature"]

{"sheet":"CONTENTS","index":2,"n_rows":27,"n_cols":11,"rows_kept":27,"cut":false,"hidden":false,"merged":[]}
[]
[null,"CONTENTS"]
[]
[]
[null,"Sheet 1",null,"INPUT SHEET - MANDATORY",null,null,null,null,null,null,{"$f":"+IF('[21]COVER SHEET'!$C$39>0,\"YES\",\"NO\")","v":"NO"}]
[]
[null,"Sheet 2",null,"INCOME STATEMENT ",null,null,null,null,null,null,{"$f":"+IF('[21]COVER SHEET'!$C$39>0,\"YES\",\"NO\")","v":"NO"}]
[]
[{"$f":"IF('COVER SHEET'!B15 =\"Annual Financial Return\",10,0)","v":0},"Sheet 3",null,"BALANCE SHEET ",null,null,null,null,null,null,{"$f":"+IF('[21]COVER SHEET'!$C$39>0,\"YES\",\"NO\")","v":"NO"}]
[]
[null,"Sheet 4",null,"TOTAL OWN FUNDS CALCULATION",null,null,null,null,null,null,{"$f":"+IF('[21]COVER SHEET'!$C$39>0,\"YES\",\"NO\")","v":"NO"}]
[]
[null,"Sheet 5",null,"FIXED OVERHEAD REQUIREMENT",null,null,null,null,null,null,{"$f":"+IF('[21]COVER SHEET'!$C$39>0,\"YES\",\"NO\")","v":"NO"}]
[]
[null,"Sheet 6",null,"FINANCIAL RESOURCES REQUIREMENT",null,null,null,null,null,null,{"$f":"+IF('[21]COVER SHEET'!$C$39>0,\"YES\",\"NO\")","v":"NO"}]
[]
[null,"Sheet 7",null,"REPRESENTATIONS - MANDATORY",null,null,null,null,null,null,{"$f":"+IF('[21]COVER SHEET'!$C$39>0,\"YES\",\"NO\")","v":"NO"}]
[]
[null,"Sheet 8",null,"ANNUAL SUPERVISORY FEE - CALCULATOR (to be completed on an annual basis and submitted in original together with the AAFR)"]
[]
[null,"Validation Sheet",null,"VALIDATION SHEET",null,null,null,null,null,null,{"$f":"+IF('[21]COVER SHEET'!$C$39>0,\"YES\",\"NO\")","v":"NO"}]
[]
[null,"Non-Malta Funds",null,"NON MALTA FUNDS"]
[]
[]
[null,"N.B."]
[null,"a) Any of the above Sheet Titles which are marked in blue require manual input."]

{"sheet":"CSV_workings","index":3,"n_rows":389,"n_cols":35,"rows_kept":389,"cut":false,"hidden":true,"merged":[]}
["UnitID","BOP","Table","Year","Freq","MQ","VarID","CountryCode","SectorCode","Doubtful","Input","F01","F02","F03","F04","F05","F06","F07","F08","F09","F10","F11","F12","F13","F14","F15","F16","F17","F18","F19","F20","NewVarLabel",0,"Sheet Name","Line"]
[{"$f":"#REF!","v":{"$error":"#REF!"}},{"$f":"#REF!","v":{"$error":"#REF!"}},1,{"$f":"#REF!","v":{"$error":"#REF!"}},{"$f":"#REF!","v":{"$error":"#REF!"}},{"$f":"#REF!","v":{"$error":"#REF!"}},{"$f":"IF(#REF!=\"\",0,VLOOKUP(#REF!,#REF!,2,FALSE))","v":{"$error":"#REF!"}},{"$f":"IF(#REF!=\"\",0,VLOOKUP(#REF!,#REF!,2,FALSE))","v":{"$error":"#REF!"}},{"$f":"IF(#REF!=\"\",0,VLOOKUP(#REF!,#REF!,2,FALSE))","v":{"$error":"#REF!"}},"00","DPM",{"$f":"#REF!","v":{"$error":"#REF!"}},{"$f":"#REF!","v":{"$error":"#REF!"}},null,null,null,null,null,null,null,null,null,null,null,null,null,null,null,null,null,null,"-",{"$f":"IF(OR(ABS(L2)>=0.55,ABS(M2)>=0.55,ABS(N2)>=0.55,ABS(O2)>=0.55,ABS(P2)>=0.55,ABS(Q2)>=0.55,ABS(R2)>=0.55,ABS(S2)>=0.55,ABS(T2)>=0.55,ABS(U2)>=0.55,ABS(V2)>=0.55,ABS(W2)>=0.55,ABS(X2)>=0.55,ABS(Y2)>=0.55,ABS(Z2)>=0.55,ABS(AA2)>=0.55,ABS(AB2)>=0.55,ABS(AC2)>=0.55,ABS(AD2)>=0.55,ABS(AE2)>=0.55),0,1)","v":{"$error":"#REF!"}},"Sheet 21 Non Nominee'!F15 / G15",15]
[{"$f":"$A$2","v":{"$error":"#REF!"}},{"$f":"$B$2","v":{"$error":"#REF!"}},1,{"$f":"$D$2","v":{"$error":"#REF!"}},{"$f":"$E$2","v":{"$error":"#REF!"}},{"$f":"$F$2","v":{"$error":"#REF!"}},{"$f":"IF(#REF!=\"\",0,VLOOKUP(#REF!,#REF!,2,FALSE))","v":{"$error":"#REF!"}},{"$f":"IF(#REF!=\"\",0,VLOOKUP(#REF!,#REF!,2,FALSE))","v":{"$error":"#REF!"}},{"$f":"IF(#REF!=\"\",0,VLOOKUP(#REF!,#REF!,2,FALSE))","v":{"$error":"#REF!"}},"00","DPM",{"$f":"#REF!","v":{"$error":"#REF!"}},{"$f":"#REF!","v":{"$error":"#REF!"}},null,null,null,null,null,null,null,null,null,null,null,null,null,null,null,null,null,null,"-",{"$error":"#REF!"},null,16]
[{"$error":"#REF!"},{"$error":"#REF!"},1,{"$error":"#REF!"},{"$error":"#REF!"},{"$error":"#REF!"},{"$f":"IF(#REF!=\"\",0,VLOOKUP(#REF!,#REF!,2,FALSE))","v":{"$error":"#REF!"}},{"$f":"IF(#REF!=\"\",0,VLOOKUP(#REF!,#REF!,2,FALSE))","v":{"$error":"#REF!"}},{"$f":"IF(#REF!=\"\",0,VLOOKUP(#REF!,#REF!,2,FALSE))","v":{"$error":"#REF!"}},"00","DPM",{"$f":"#REF!","v":{"$error":"#REF!"}},{"$f":"#REF!","v":{"$error":"#REF!"}},null,null,null,null,null,null,null,null,null,null,null,null,null,null,null,null,null,null,"-",{"$error":"#REF!"},null,17]
[{"$error":"#REF!"},{"$error":"#REF!"},1,{"$error":"#REF!"},{"$error":"#REF!"},{"$error":"#REF!"},{"$f":"IF(#REF!=\"\",0,VLOOKUP(#REF!,#REF!,2,FALSE))","v":{"$error":"#REF!"}},{"$f":"IF(#REF!=\"\",0,VLOOKUP(#REF!,#REF!,2,FALSE))","v":{"$error":"#REF!"}},{"$f":"IF(#REF!=\"\",0,VLOOKUP(#REF!,#REF!,2,FALSE))","v":{"$error":"#REF!"}},"00","DPM",{"$f":"#REF!","v":{"$error":"#REF!"}},{"$f":"#REF!","v":{"$error":"#REF!"}},null,null,null,null,null,null,null,null,null,null,null,null,null,null,null,null,null,null,"-",{"$error":"#REF!"},null,18]
[{"$error":"#REF!"},{"$error":"#REF!"},1,{"$error":"#REF!"},{"$error":"#REF!"},{"$error":"#REF!"},{"$f":"IF(#REF!=\"\",0,VLOOKUP(#REF!,#REF!,2,FALSE))","v":{"$error":"#REF!"}},{"$f":"IF(#REF!=\"\",0,VLOOKUP(#REF!,#REF!,2,FALSE))","v":{"$error":"#REF!"}},{"$f":"IF(#REF!=\"\",0,VLOOKUP(#REF!,#REF!,2,FALSE))","v":{"$error":"#REF!"}},"00","DPM",{"$f":"#REF!","v":{"$error":"#REF!"}},{"$f":"#REF!","v":{"$error":"#REF!"}},null,null,null,null,null,null,null,null,null,null,null,null,null,null,null,null,null,null,"-",{"$error":"#REF!"},null,19]
[{"$error":"#REF!"},{"$error":"#REF!"},1,{"$error":"#REF!"},{"$error":"#REF!"},{"$error":"#REF!"},{"$f":"IF(#REF!=\"\",0,VLOOKUP(#REF!,#REF!,2,FALSE))","v":{"$error":"#REF!"}},{"$f":"IF(#REF!=\"\",0,VLOOKUP(#REF!,#REF!,2,FALSE))","v":{"$error":"#REF!"}},{"$f":"IF(#REF!=\"\",0,VLOOKUP(#REF!,#REF!,2,FALSE))","v":{"$error":"#REF!"}},"00","DPM",{"$f":"#REF!","v":{"$error":"#REF!"}},{"$f":"#REF!","v":{"$error":"#REF!"}},null,null,null,null,null,null,null,null,null,null,null,null,null,null,null,null,null,null,"-",{"$error":"#REF!"},null,20]
[{"$error":"#REF!"},{"$error":"#REF!"},1,{"$error":"#REF!"},{"$error":"#REF!"},{"$error":"#REF!"},{"$f":"IF(#REF!=\"\",0,VLOOKUP(#REF!,#REF!,2,FALSE))","v":{"$error":"#REF!"}},{"$f":"IF(#REF!=\"\",0,VLOOKUP(#REF!,#REF!,2,FALSE))","v":{"$error":"#REF!"}},{"$f":"IF(#REF!=\"\",0,VLOOKUP(#REF!,#REF!,2,FALSE))","v":{"$error":"#REF!"}},"00","DPM",{"$f":"#REF!","v":{"$error":"#REF!"}},{"$f":"#REF!","v":{"$error":"#REF!"}},null,null,null,null,null,null,null,null,null,null,null,null,null,null,null,null,null,null,"-",{"$error":"#REF!"},null,21]
[{"$error":"#REF!"},{"$error":"#REF!"},1,{"$error":"#REF!"},{"$error":"#REF!"},{"$error":"#REF!"},{"$f":"IF(#REF!=\"\",0,VLOOKUP(#REF!,#REF!,2,FALSE))","v":{"$error":"#REF!"}},{"$f":"IF(#REF!=\"\",0,VLOOKUP(#REF!,#REF!,2,FALSE))","v":{"$error":"#REF!"}},{"$f":"IF(#REF!=\"\",0,VLOOKUP(#REF!,#REF!,2,FALSE))","v":{"$error":"#REF!"}},"00","DPM",{"$f":"#REF!","v":{"$error":"#REF!"}},{"$f":"#REF!","v":{"$error":"#REF!"}},null,null,null,null,null,null,null,null,null,null,null,null,null,null,null,null,null,null,"-",{"$error":"#REF!"},null,22]
[{"$error":"#REF!"},{"$error":"#REF!"},1,{"$error":"#REF!"},{"$error":"#REF!"},{"$error":"#REF!"},{"$f":"IF(#REF!=\"\",0,VLOOKUP(#REF!,#REF!,2,FALSE))","v":{"$error":"#REF!"}},{"$f":"IF(#REF!=\"\",0,VLOOKUP(#REF!,#REF!,2,FALSE))","v":{"$error":"#REF!"}},{"$f":"IF(#REF!=\"\",0,VLOOKUP(#REF!,#REF!,2,FALSE))","v":{"$error":"#REF!"}},"00","DPM",{"$f":"#REF!","v":{"$error":"#REF!"}},{"$f":"#REF!","v":{"$error":"#REF!"}},null,null,null,null,null,null,null,null,null,null,null,null,null,null,null,null,null,null,"-",{"$error":"#REF!"},null,23]
[{"$error":"#REF!"},{"$error":"#REF!"},1,{"$error":"#REF!"},{"$error":"#REF!"},{"$error":"#REF!"},{"$f":"IF(#REF!=\"\",0,VLOOKUP(#REF!,#REF!,2,FALSE))","v":{"$error":"#REF!"}},{"$f":"IF(#REF!=\"\",0,VLOOKUP(#REF!,#REF!,2,FALSE))","v":{"$error":"#REF!"}},{"$f":"IF(#REF!=\"\",0,VLOOKUP(#REF!,#REF!,2,FALSE))","v":{"$error":"#REF!"}},"00","DPM",{"$f":"#REF!","v":{"$error":"#REF!"}},{"$f":"#REF!","v":{"$error":"#REF!"}},null,null,null,null,null,null,null,null,null,null,null,null,null,null,null,null,null,null,"-",{"$error":"#REF!"},null,24]
[{"$error":"#REF!"},{"$error":"#REF!"},1,{"$error":"#REF!"},{"$error":"#REF!"},{"$error":"#REF!"},{"$f":"IF(#REF!=\"\",0,VLOOKUP(#REF!,#REF!,2,FALSE))","v":{"$error":"#REF!"}},{"$f":"IF(#REF!=\"\",0,VLOOKUP(#REF!,#REF!,2,FALSE))","v":{"$error":"#REF!"}},{"$f":"IF(#REF!=\"\",0,VLOOKUP(#REF!,#REF!,2,FALSE))","v":{"$error":"#REF!"}},"00","DPM",{"$f":"#REF!","v":{"$error":"#REF!"}},{"$f":"#REF!","v":{"$error":"#REF!"}},null,null,null,null,null,null,null,null,null,null,null,null,null,null,null,null,null,null,"-",{"$error":"#REF!"},null,25]
[{"$error":"#REF!"},{"$error":"#REF!"},1,{"$error":"#REF!"},{"$error":"#REF!"},{"$error":"#REF!"},{"$f":"IF(#REF!=\"\",0,VLOOKUP(#REF!,#REF!,2,FALSE))","v":{"$error":"#REF!"}},{"$f":"IF(#REF!=\"\",0,VLOOKUP(#REF!,#REF!,2,FALSE))","v":{"$error":"#REF!"}},{"$f":"IF(#REF!=\"\",0,VLOOKUP(#REF!,#REF!,2,FALSE))","v":{"$error":"#REF!"}},"00","DPM",{"$f":"#REF!","v":{"$error":"#REF!"}},{"$f":"#REF!","v":{"$error":"#REF!"}},null,null,null,null,null,null,null,null,null,null,null,null,null,null,null,null,null,null,"-",{"$error":"#REF!"},null,26]
[{"$error":"#REF!"},{"$error":"#REF!"},1,{"$error":"#REF!"},{"$error":"#REF!"},{"$error":"#REF!"},{"$f":"IF(#REF!=\"\",0,VLOOKUP(#REF!,#REF!,2,FALSE))","v":{"$error":"#REF!"}},{"$f":"IF(#REF!=\"\",0,VLOOKUP(#REF!,#REF!,2,FALSE))","v":{"$error":"#REF!"}},{"$f":"IF(#REF!=\"\",0,VLOOKUP(#REF!,#REF!,2,FALSE))","v":{"$error":"#REF!"}},"00","DPM",{"$f":"#REF!","v":{"$error":"#REF!"}},{"$f":"#REF!","v":{"$error":"#REF!"}},null,null,null,null,null,null,null,null,null,null,null,null,null,null,null,null,null,null,"-",{"$error":"#REF!"},null,27]
[{"$error":"#REF!"},{"$error":"#REF!"},1,{"$error":"#REF!"},{"$error":"#REF!"},{"$error":"#REF!"},{"$f":"IF(#REF!=\"\",0,VLOOKUP(#REF!,#REF!,2,FALSE))","v":{"$error":"#REF!"}},{"$f":"IF(#REF!=\"\",0,VLOOKUP(#REF!,#REF!,2,FALSE))","v":{"$error":"#REF!"}},{"$f":"IF(#REF!=\"\",0,VLOOKUP(#REF!,#REF!,2,FALSE))","v":{"$error":"#REF!"}},"00","DPM",{"$f":"#REF!","v":{"$error":"#REF!"}},{"$f":"#REF!","v":{"$error":"#REF!"}},null,null,null,null,null,null,null,null,null,null,null,null,null,null,null,null,null,null,"-",{"$error":"#REF!"},null,28]
[{"$error":"#REF!"},{"$error":"#REF!"},1,{"$error":"#REF!"},{"$error":"#REF!"},{"$error":"#REF!"},{"$f":"IF(#REF!=\"\",0,VLOOKUP(#REF!,#REF!,2,FALSE))","v":{"$error":"#REF!"}},{"$f":"IF(#REF!=\"\",0,VLOOKUP(#REF!,#REF!,2,FALSE))","v":{"$error":"#REF!"}},{"$f":"IF(#REF!=\"\",0,VLOOKUP(#REF!,#REF!,2,FALSE))","v":{"$error":"#REF!"}},"00","DPM",{"$f":"#REF!","v":{"$error":"#REF!"}},{"$f":"#REF!","v":{"$error":"#REF!"}},null,null,null,null,null,null,null,null,null,null,null,null,null,null,null,null,null,null,"-",{"$error":"#REF!"},null,29]
[{"$error":"#REF!"},{"$error":"#REF!"},1,{"$error":"#REF!"},{"$error":"#REF!"},{"$error":"#REF!"},{"$f":"IF(#REF!=\"\",0,VLOOKUP(#REF!,#REF!,2,FALSE))","v":{"$error":"#REF!"}},{"$f":"IF(#REF!=\"\",0,VLOOKUP(#REF!,#REF!,2,FALSE))","v":{"$error":"#REF!"}},{"$f":"IF(#REF!=\"\",0,VLOOKUP(#REF!,#REF!,2,FALSE))","v":{"$error":"#REF!"}},"00","DPM",{"$f":"#REF!","v":{"$error":"#REF!"}},{"$f":"#REF!","v":{"$error":"#REF!"}},null,null,null,null,null,null,null,null,null,null,null,null,null,null,null,null,null,null,"-",{"$error":"#REF!"},null,30]
[{"$error":"#REF!"},{"$error":"#REF!"},1,{"$error":"#REF!"},{"$error":"#REF!"},{"$error":"#REF!"},{"$f":"IF(#REF!=\"\",0,VLOOKUP(#REF!,#REF!,2,FALSE))","v":{"$error":"#REF!"}},{"$f":"IF(#REF!=\"\",0,VLOOKUP(#REF!,#REF!,2,FALSE))","v":{"$error":"#REF!"}},{"$f":"IF(#REF!=\"\",0,VLOOKUP(#REF!,#REF!,2,FALSE))","v":{"$error":"#REF!"}},"00","DPM",{"$f":"#REF!","v":{"$error":"#REF!"}},{"$f":"#REF!","v":{"$error":"#REF!"}},null,null,null,null,null,null,null,null,null,null,null,null,null,null,null,null,null,null,"-",{"$error":"#REF!"},null,31]
[{"$error":"#REF!"},{"$error":"#REF!"},1,{"$error":"#REF!"},{"$error":"#REF!"},{"$error":"#REF!"},{"$f":"IF(#REF!=\"\",0,VLOOKUP(#REF!,#REF!,2,FALSE))","v":{"$error":"#REF!"}},{"$f":"IF(#REF!=\"\",0,VLOOKUP(#REF!,#REF!,2,FALSE))","v":{"$error":"#REF!"}},{"$f":"IF(#REF!=\"\",0,VLOOKUP(#REF!,#REF!,2,FALSE))","v":{"$error":"#REF!"}},"00","DPM",{"$f":"#REF!","v":{"$error":"#REF!"}},{"$f":"#REF!","v":{"$error":"#REF!"}},null,null,null,null,null,null,null,null,null,null,null,null,null,null,null,null,null,null,"-",{"$error":"#REF!"},null,32]
[{"$error":"#REF!"},{"$error":"#REF!"},1,{"$error":"#REF!"},{"$error":"#REF!"},{"$error":"#REF!"},{"$f":"IF(#REF!=\"\",0,VLOOKUP(#REF!,#REF!,2,FALSE))","v":{"$error":"#REF!"}},{"$f":"IF(#REF!=\"\",0,VLOOKUP(#REF!,#REF!,2,FALSE))","v":{"$error":"#REF!"}},{"$f":"IF(#REF!=\"\",0,VLOOKUP(#REF!,#REF!,2,FALSE))","v":{"$error":"#REF!"}},"00","DPM",{"$f":"#REF!","v":{"$error":"#REF!"}},{"$f":"#REF!","v":{"$error":"#REF!"}},null,null,null,null,null,null,null,null,null,null,null,null,null,null,null,null,null,null,"-",{"$error":"#REF!"},null,33]
[{"$error":"#REF!"},{"$error":"#REF!"},1,{"$error":"#REF!"},{"$error":"#REF!"},{"$error":"#REF!"},{"$f":"IF(#REF!=\"\",0,VLOOKUP(#REF!,#REF!,2,FALSE))","v":{"$error":"#REF!"}},{"$f":"IF(#REF!=\"\",0,VLOOKUP(#REF!,#REF!,2,FALSE))","v":{"$error":"#REF!"}},{"$f":"IF(#REF!=\"\",0,VLOOKUP(#REF!,#REF!,2,FALSE))","v":{"$error":"#REF!"}},"00","DPM",{"$f":"#REF!","v":{"$error":"#REF!"}},{"$f":"#REF!","v":{"$error":"#REF!"}},null,null,null,null,null,null,null,null,null,null,null,null,null,null,null,null,null,null,"-",{"$error":"#REF!"},null,34]
[{"$error":"#REF!"},{"$error":"#REF!"},1,{"$error":"#REF!"},{"$error":"#REF!"},{"$error":"#REF!"},{"$f":"IF(#REF!=\"\",0,VLOOKUP(#REF!,#REF!,2,FALSE))","v":{"$error":"#REF!"}},{"$f":"IF(#REF!=\"\",0,VLOOKUP(#REF!,#REF!,2,FALSE))","v":{"$error":"#REF!"}},{"$f":"IF(#REF!=\"\",0,VLOOKUP(#REF!,#REF!,2,FALSE))","v":{"$error":"#REF!"}},"00","DPM",{"$f":"#REF!","v":{"$error":"#REF!"}},{"$f":"#REF!","v":{"$error":"#REF!"}},null,null,null,null,null,null,null,null,null,null,null,null,null,null,null,null,null,null,"-",{"$error":"#REF!"},null,35]
[{"$error":"#REF!"},{"$error":"#REF!"},1,{"$error":"#REF!"},{"$error":"#REF!"},{"$error":"#REF!"},{"$f":"IF(#REF!=\"\",0,VLOOKUP(#REF!,#REF!,2,FALSE))","v":{"$error":"#REF!"}},{"$f":"IF(#REF!=\"\",0,VLOOKUP(#REF!,#REF!,2,FALSE))","v":{"$error":"#REF!"}},{"$f":"IF(#REF!=\"\",0,VLOOKUP(#REF!,#REF!,2,FALSE))","v":{"$error":"#REF!"}},"00","DPM",{"$f":"#REF!","v":{"$error":"#REF!"}},{"$f":"#REF!","v":{"$error":"#REF!"}},null,null,null,null,null,null,null,null,null,null,null,null,null,null,null,null,null,null,"-",{"$error":"#REF!"},null,36]
[{"$error":"#REF!"},{"$error":"#REF!"},1,{"$error":"#REF!"},{"$error":"#REF!"},{"$error":"#REF!"},{"$f":"IF(#REF!=\"\",0,VLOOKUP(#REF!,#REF!,2,FALSE))","v":{"$error":"#REF!"}},{"$f":"IF(#REF!=\"\",0,VLOOKUP(#REF!,#REF!,2,FALSE))","v":{"$error":"#REF!"}},{"$f":"IF(#REF!=\"\",0,VLOOKUP(#REF!,#REF!,2,FALSE))","v":{"$error":"#REF!"}},"00","DPM",{"$f":"#REF!","v":{"$error":"#REF!"}},{"$f":"#REF!","v":{"$error":"#REF!"}},null,null,null,null,null,null,null,null,null,null,null,null,null,null,null,null,null,null,"-",{"$error":"#REF!"},null,37]
[{"$error":"#REF!"},{"$error":"#REF!"},1,{"$error":"#REF!"},{"$error":"#REF!"},{"$error":"#REF!"},{"$f":"IF(#REF!=\"\",0,VLOOKUP(#REF!,#REF!,2,FALSE))","v":{"$error":"#REF!"}},{"$f":"IF(#REF!=\"\",0,VLOOKUP(#REF!,#REF!,2,FALSE))","v":{"$error":"#REF!"}},{"$f":"IF(#REF!=\"\",0,VLOOKUP(#REF!,#REF!,2,FALSE))","v":{"$error":"#REF!"}},"00","DPM",{"$f":"#REF!","v":{"$error":"#REF!"}},{"$f":"#REF!","v":{"$error":"#REF!"}},null,null,null,null,null,null,null,null,null,null,null,null,null,null,null,null,null,null,"-",{"$error":"#REF!"},null,38]
[{"$error":"#REF!"},{"$error":"#REF!"},1,{"$error":"#REF!"},{"$error":"#REF!"},{"$error":"#REF!"},{"$f":"IF(#REF!=\"\",0,VLOOKUP(#REF!,#REF!,2,FALSE))","v":{"$error":"#REF!"}},{"$f":"IF(#REF!=\"\",0,VLOOKUP(#REF!,#REF!,2,FALSE))","v":{"$error":"#REF!"}},{"$f":"IF(#REF!=\"\",0,VLOOKUP(#REF!,#REF!,2,FALSE))","v":{"$error":"#REF!"}},"00","DPM",{"$f":"#REF!","v":{"$error":"#REF!"}},{"$f":"#REF!","v":{"$error":"#REF!"}},null,null,null,null,null,null,null,null,null,null,null,null,null,null,null,null,null,null,"-",{"$error":"#REF!"},null,39]
[{"$error":"#REF!"},{"$error":"#REF!"},1,{"$error":"#REF!"},{"$error":"#REF!"},{"$error":"#REF!"},{"$f":"IF(#REF!=\"\",0,VLOOKUP(#REF!,#REF!,2,FALSE))","v":{"$error":"#REF!"}},{"$f":"IF(#REF!=\"\",0,VLOOKUP(#REF!,#REF!,2,FALSE))","v":{"$error":"#REF!"}},{"$f":"IF(#REF!=\"\",0,VLOOKUP(#REF!,#REF!,2,FALSE))","v":{"$error":"#REF!"}},"00","DPM",{"$f":"#REF!","v":{"$error":"#REF!"}},{"$f":"#REF!","v":{"$error":"#REF!"}},null,null,null,null,null,null,null,null,null,null,null,null,null,null,null,null,null,null,"-",{"$error":"#REF!"},null,40]
[{"$error":"#REF!"},{"$error":"#REF!"},1,{"$error":"#REF!"},{"$error":"#REF!"},{"$error":"#REF!"},{"$f":"IF(#REF!=\"\",0,VLOOKUP(#REF!,#REF!,2,FALSE))","v":{"$error":"#REF!"}},{"$f":"IF(#REF!=\"\",0,VLOOKUP(#REF!,#REF!,2,FALSE))","v":{"$error":"#REF!"}},{"$f":"IF(#REF!=\"\",0,VLOOKUP(#REF!,#REF!,2,FALSE))","v":{"$error":"#REF!"}},"00","DPM",{"$f":"#REF!","v":{"$error":"#REF!"}},{"$f":"#REF!","v":{"$error":"#REF!"}},null,null,null,null,null,null,null,null,null,null,null,null,null,null,null,null,null,null,"-",{"$error":"#REF!"},null,41]
[{"$error":"#REF!"},{"$error":"#REF!"},1,{"$error":"#REF!"},{"$error":"#REF!"},{"$error":"#REF!"},{"$f":"IF(#REF!=\"\",0,VLOOKUP(#REF!,#REF!,2,FALSE))","v":{"$error":"#REF!"}},{"$f":"IF(#REF!=\"\",0,VLOOKUP(#REF!,#REF!,2,FALSE))","v":{"$error":"#REF!"}},{"$f":"IF(#REF!=\"\",0,VLOOKUP(#REF!,#REF!,2,FALSE))","v":{"$error":"#REF!"}},"00","DPM",{"$f":"#REF!","v":{"$error":"#REF!"}},{"$f":"#REF!","v":{"$error":"#REF!"}},null,null,null,null,null,null,null,null,null,null,null,null,null,null,null,null,null,null,"-",{"$error":"#REF!"},null,42]
[{"$error":"#REF!"},{"$error":"#REF!"},1,{"$error":"#REF!"},{"$error":"#REF!"},{"$error":"#REF!"},{"$f":"IF(#REF!=\"\",0,VLOOKUP(#REF!,#REF!,2,FALSE))","v":{"$error":"#REF!"}},{"$f":"IF(#REF!=\"\",0,VLOOKUP(#REF!,#REF!,2,FALSE))","v":{"$error":"#REF!"}},{"$f":"IF(#REF!=\"\",0,VLOOKUP(#REF!,#REF!,2,FALSE))","v":{"$error":"#REF!"}},"00","DPM",{"$f":"#REF!","v":{"$error":"#REF!"}},{"$f":"#REF!","v":{"$error":"#REF!"}},null,null,null,null,null,null,null,null,null,null,null,null,null,null,null,null,null,null,"-",{"$error":"#REF!"},null,43]
[{"$error":"#REF!"},{"$error":"#REF!"},1,{"$error":"#REF!"},{"$error":"#REF!"},{"$error":"#REF!"},{"$f":"IF(#REF!=\"\",0,VLOOKUP(#REF!,#REF!,2,FALSE))","v":{"$error":"#REF!"}},{"$f":"IF(#REF!=\"\",0,VLOOKUP(#REF!,#REF!,2,FALSE))","v":{"$error":"#REF!"}},{"$f":"IF(#REF!=\"\",0,VLOOKUP(#REF!,#REF!,2,FALSE))","v":{"$error":"#REF!"}},"00","DPM",{"$f":"#REF!","v":{"$error":"#REF!"}},{"$f":"#REF!","v":{"$error":"#REF!"}},null,null,null,null,null,null,null,null,null,null,null,null,null,null,null,null,null,null,"-",{"$error":"#REF!"},null,44]
[{"$error":"#REF!"},{"$error":"#REF!"},1,{"$error":"#REF!"},{"$error":"#REF!"},{"$error":"#REF!"},{"$f":"IF(#REF!=\"\",0,VLOOKUP(#REF!,#REF!,2,FALSE))","v":{"$error":"#REF!"}},{"$f":"IF(#REF!=\"\",0,VLOOKUP(#REF!,#REF!,2,FALSE))","v":{"$error":"#REF!"}},{"$f":"IF(#REF!=\"\",0,VLOOKUP(#REF!,#REF!,2,FALSE))","v":{"$error":"#REF!"}},"00","DPM",{"$f":"#REF!","v":{"$error":"#REF!"}},{"$f":"#REF!","v":{"$error":"#REF!"}},null,null,null,null,null,null,null,null,null,null,null,null,null,null,null,null,null,null,"-",{"$error":"#REF!"},null,45]
[{"$error":"#REF!"},{"$error":"#REF!"},1,{"$error":"#REF!"},{"$error":"#REF!"},{"$error":"#REF!"},{"$f":"IF(#REF!=\"\",0,VLOOKUP(#REF!,#REF!,2,FALSE))","v":{"$error":"#REF!"}},{"$f":"IF(#REF!=\"\",0,VLOOKUP(#REF!,#REF!,2,FALSE))","v":{"$error":"#REF!"}},{"$f":"IF(#REF!=\"\",0,VLOOKUP(#REF!,#REF!,2,FALSE))","v":{"$error":"#REF!"}},"00","DPM",{"$f":"#REF!","v":{"$error":"#REF!"}},{"$f":"#REF!","v":{"$error":"#REF!"}},null,null,null,null,null,null,null,null,null,null,null,null,null,null,null,null,null,null,"-",{"$error":"#REF!"},null,46]
[{"$error":"#REF!"},{"$error":"#REF!"},1,{"$error":"#REF!"},{"$error":"#REF!"},{"$error":"#REF!"},{"$f":"IF(#REF!=\"\",0,VLOOKUP(#REF!,#REF!,2,FALSE))","v":{"$error":"#REF!"}},{"$f":"IF(#REF!=\"\",0,VLOOKUP(#REF!,#REF!,2,FALSE))","v":{"$error":"#REF!"}},{"$f":"IF(#REF!=\"\",0,VLOOKUP(#REF!,#REF!,2,FALSE))","v":{"$error":"#REF!"}},"00","DPM",{"$f":"#REF!","v":{"$error":"#REF!"}},{"$f":"#REF!","v":{"$error":"#REF!"}},null,null,null,null,null,null,null,null,null,null,null,null,null,null,null,null,null,null,"-",{"$error":"#REF!"},null,47]
[{"$error":"#REF!"},{"$error":"#REF!"},1,{"$error":"#REF!"},{"$error":"#REF!"},{"$error":"#REF!"},{"$f":"IF(#REF!=\"\",0,VLOOKUP(#REF!,#REF!,2,FALSE))","v":{"$error":"#REF!"}},{"$f":"IF(#REF!=\"\",0,VLOOKUP(#REF!,#REF!,2,FALSE))","v":{"$error":"#REF!"}},{"$f":"IF(#REF!=\"\",0,VLOOKUP(#REF!,#REF!,2,FALSE))","v":{"$error":"#REF!"}},"00","DPM",{"$f":"#REF!","v":{"$error":"#REF!"}},{"$f":"#REF!","v":{"$error":"#REF!"}},null,null,null,null,null,null,null,null,null,null,null,null,null,null,null,null,null,null,"-",{"$error":"#REF!"},null,48]
[{"$error":"#REF!"},{"$error":"#REF!"},1,{"$error":"#REF!"},{"$error":"#REF!"},{"$error":"#REF!"},{"$f":"IF(#REF!=\"\",0,VLOOKUP(#REF!,#REF!,2,FALSE))","v":{"$error":"#REF!"}},{"$f":"IF(#REF!=\"\",0,VLOOKUP(#REF!,#REF!,2,FALSE))","v":{"$error":"#REF!"}},{"$f":"IF(#REF!=\"\",0,VLOOKUP(#REF!,#REF!,2,FALSE))","v":{"$error":"#REF!"}},"00","DPM",{"$f":"#REF!","v":{"$error":"#REF!"}},{"$f":"#REF!","v":{"$error":"#REF!"}},null,null,null,null,null,null,null,null,null,null,null,null,null,null,null,null,null,null,"-",{"$error":"#REF!"},null,49]
[{"$error":"#REF!"},{"$error":"#REF!"},1,{"$error":"#REF!"},{"$error":"#REF!"},{"$error":"#REF!"},{"$f":"IF(#REF!=\"\",0,VLOOKUP(#REF!,#REF!,2,FALSE))","v":{"$error":"#REF!"}},{"$f":"IF(#REF!=\"\",0,VLOOKUP(#REF!,#REF!,2,FALSE))","v":{"$error":"#REF!"}},{"$f":"IF(#REF!=\"\",0,VLOOKUP(#REF!,#REF!,2,FALSE))","v":{"$error":"#REF!"}},"00","DPM",{"$f":"#REF!","v":{"$error":"#REF!"}},{"$f":"#REF!","v":{"$error":"#REF!"}},null,null,null,null,null,null,null,null,null,null,null,null,null,null,null,null,null,null,"-",{"$error":"#REF!"},null,50]
[{"$error":"#REF!"},{"$error":"#REF!"},1,{"$error":"#REF!"},{"$error":"#REF!"},{"$error":"#REF!"},{"$f":"IF(#REF!=\"\",0,VLOOKUP(#REF!,#REF!,2,FALSE))","v":{"$error":"#REF!"}},{"$f":"IF(#REF!=\"\",0,VLOOKUP(#REF!,#REF!,2,FALSE))","v":{"$error":"#REF!"}},{"$f":"IF(#REF!=\"\",0,VLOOKUP(#REF!,#REF!,2,FALSE))","v":{"$error":"#REF!"}},"00","DPM",{"$f":"#REF!","v":{"$error":"#REF!"}},{"$f":"#REF!","v":{"$error":"#REF!"}},null,null,null,null,null,null,null,null,null,null,null,null,null,null,null,null,null,null,"-",{"$error":"#REF!"},null,51]
[{"$error":"#REF!"},{"$error":"#REF!"},1,{"$error":"#REF!"},{"$error":"#REF!"},{"$error":"#REF!"},{"$f":"IF(#REF!=\"\",0,VLOOKUP(#REF!,#REF!,2,FALSE))","v":{"$error":"#REF!"}},{"$f":"IF(#REF!=\"\",0,VLOOKUP(#REF!,#REF!,2,FALSE))","v":{"$error":"#REF!"}},{"$f":"IF(#REF!=\"\",0,VLOOKUP(#REF!,#REF!,2,FALSE))","v":{"$error":"#REF!"}},"00","DPM",{"$f":"#REF!","v":{"$error":"#REF!"}},{"$f":"#REF!","v":{"$error":"#REF!"}},null,null,null,null,null,null,null,null,null,null,null,null,null,null,null,null,null,null,"-",{"$error":"#REF!"},null,52]
[{"$error":"#REF!"},{"$error":"#REF!"},1,{"$error":"#REF!"},{"$error":"#REF!"},{"$error":"#REF!"},{"$f":"IF(#REF!=\"\",0,VLOOKUP(#REF!,#REF!,2,FALSE))","v":{"$error":"#REF!"}},{"$f":"IF(#REF!=\"\",0,VLOOKUP(#REF!,#REF!,2,FALSE))","v":{"$error":"#REF!"}},{"$f":"IF(#REF!=\"\",0,VLOOKUP(#REF!,#REF!,2,FALSE))","v":{"$error":"#REF!"}},"00","DPM",{"$f":"#REF!","v":{"$error":"#REF!"}},{"$f":"#REF!","v":{"$error":"#REF!"}},null,null,null,null,null,null,null,null,null,null,null,null,null,null,null,null,null,null,"-",{"$error":"#REF!"},null,53]
[{"$error":"#REF!"},{"$error":"#REF!"},1,{"$error":"#REF!"},{"$error":"#REF!"},{"$error":"#REF!"},{"$f":"IF(#REF!=\"\",0,VLOOKUP(#REF!,#REF!,2,FALSE))","v":{"$error":"#REF!"}},{"$f":"IF(#REF!=\"\",0,VLOOKUP(#REF!,#REF!,2,FALSE))","v":{"$error":"#REF!"}},{"$f":"IF(#REF!=\"\",0,VLOOKUP(#REF!,#REF!,2,FALSE))","v":{"$error":"#REF!"}},"00","DPM",{"$f":"#REF!","v":{"$error":"#REF!"}},{"$f":"#REF!","v":{"$error":"#REF!"}},null,null,null,null,null,null,null,null,null,null,null,null,null,null,null,null,null,null,"-",{"$error":"#REF!"},null,54]
[{"$error":"#REF!"},{"$error":"#REF!"},1,{"$error":"#REF!"},{"$error":"#REF!"},{"$error":"#REF!"},{"$f":"IF(#REF!=\"\",0,VLOOKUP(#REF!,#REF!,2,FALSE))","v":{"$error":"#REF!"}},{"$f":"IF(#REF!=\"\",0,VLOOKUP(#REF!,#REF!,2,FALSE))","v":{"$error":"#REF!"}},{"$f":"IF(#REF!=\"\",0,VLOOKUP(#REF!,#REF!,2,FALSE))","v":{"$error":"#REF!"}},"00","DPM",{"$f":"#REF!","v":{"$error":"#REF!"}},{"$f":"#REF!","v":{"$error":"#REF!"}},null,null,null,null,null,null,null,null,null,null,null,null,null,null,null,null,null,null,"-",{"$error":"#REF!"},null,55]
[{"$error":"#REF!"},{"$error":"#REF!"},1,{"$error":"#REF!"},{"$error":"#REF!"},{"$error":"#REF!"},{"$f":"IF(#REF!=\"\",0,VLOOKUP(#REF!,#REF!,2,FALSE))","v":{"$error":"#REF!"}},{"$f":"IF(#REF!=\"\",0,VLOOKUP(#REF!,#REF!,2,FALSE))","v":{"$error":"#REF!"}},{"$f":"IF(#REF!=\"\",0,VLOOKUP(#REF!,#REF!,2,FALSE))","v":{"$error":"#REF!"}},"00","DPM",{"$f":"#REF!","v":{"$error":"#REF!"}},{"$f":"#REF!","v":{"$error":"#REF!"}},null,null,null,null,null,null,null,null,null,null,null,null,null,null,null,null,null,null,"-",{"$error":"#REF!"},null,56]
[{"$error":"#REF!"},{"$error":"#REF!"},1,{"$error":"#REF!"},{"$error":"#REF!"},{"$error":"#REF!"},{"$f":"IF(#REF!=\"\",0,VLOOKUP(#REF!,#REF!,2,FALSE))","v":{"$error":"#REF!"}},{"$f":"IF(#REF!=\"\",0,VLOOKUP(#REF!,#REF!,2,FALSE))","v":{"$error":"#REF!"}},{"$f":"IF(#REF!=\"\",0,VLOOKUP(#REF!,#REF!,2,FALSE))","v":{"$error":"#REF!"}},"00","DPM",{"$f":"#REF!","v":{"$error":"#REF!"}},{"$f":"#REF!","v":{"$error":"#REF!"}},null,null,null,null,null,null,null,null,null,null,null,null,null,null,null,null,null,null,"-",{"$error":"#REF!"},null,57]
[{"$error":"#REF!"},{"$error":"#REF!"},1,{"$error":"#REF!"},{"$error":"#REF!"},{"$error":"#REF!"},{"$f":"IF(#REF!=\"\",0,VLOOKUP(#REF!,#REF!,2,FALSE))","v":{"$error":"#REF!"}},{"$f":"IF(#REF!=\"\",0,VLOOKUP(#REF!,#REF!,2,FALSE))","v":{"$error":"#REF!"}},{"$f":"IF(#REF!=\"\",0,VLOOKUP(#REF!,#REF!,2,FALSE))","v":{"$error":"#REF!"}},"00","DPM",{"$f":"#REF!","v":{"$error":"#REF!"}},{"$f":"#REF!","v":{"$error":"#REF!"}},null,null,null,null,null,null,null,null,null,null,null,null,null,null,null,null,null,null,"-",{"$error":"#REF!"},null,58]
[{"$error":"#REF!"},{"$error":"#REF!"},1,{"$error":"#REF!"},{"$error":"#REF!"},{"$error":"#REF!"},{"$f":"IF(#REF!=\"\",0,VLOOKUP(#REF!,#REF!,2,FALSE))","v":{"$error":"#REF!"}},{"$f":"IF(#REF!=\"\",0,VLOOKUP(#REF!,#REF!,2,FALSE))","v":{"$error":"#REF!"}},{"$f":"IF(#REF!=\"\",0,VLOOKUP(#REF!,#REF!,2,FALSE))","v":{"$error":"#REF!"}},"00","DPM",{"$f":"#REF!","v":{"$error":"#REF!"}},{"$f":"#REF!","v":{"$error":"#REF!"}},null,null,null,null,null,null,null,null,null,null,null,null,null,null,null,null,null,null,"-",{"$error":"#REF!"},null,59]
[{"$error":"#REF!"},{"$error":"#REF!"},1,{"$error":"#REF!"},{"$error":"#REF!"},{"$error":"#REF!"},{"$f":"IF(#REF!=\"\",0,VLOOKUP(#REF!,#REF!,2,FALSE))","v":{"$error":"#REF!"}},{"$f":"IF(#REF!=\"\",0,VLOOKUP(#REF!,#REF!,2,FALSE))","v":{"$error":"#REF!"}},{"$f":"IF(#REF!=\"\",0,VLOOKUP(#REF!,#REF!,2,FALSE))","v":{"$error":"#REF!"}},"00","DPM",{"$f":"#REF!","v":{"$error":"#REF!"}},{"$f":"#REF!","v":{"$error":"#REF!"}},null,null,null,null,null,null,null,null,null,null,null,null,null,null,null,null,null,null,"-",{"$error":"#REF!"},null,60]
[{"$error":"#REF!"},{"$error":"#REF!"},1,{"$error":"#REF!"},{"$error":"#REF!"},{"$error":"#REF!"},{"$f":"IF(#REF!=\"\",0,VLOOKUP(#REF!,#REF!,2,FALSE))","v":{"$error":"#REF!"}},{"$f":"IF(#REF!=\"\",0,VLOOKUP(#REF!,#REF!,2,FALSE))","v":{"$error":"#REF!"}},{"$f":"IF(#REF!=\"\",0,VLOOKUP(#REF!,#REF!,2,FALSE))","v":{"$error":"#REF!"}},"00","DPM",{"$f":"#REF!","v":{"$error":"#REF!"}},{"$f":"#REF!","v":{"$error":"#REF!"}},null,null,null,null,null,null,null,null,null,null,null,null,null,null,null,null,null,null,"-",{"$error":"#REF!"},null,61]
[{"$error":"#REF!"},{"$error":"#REF!"},1,{"$error":"#REF!"},{"$error":"#REF!"},{"$error":"#REF!"},{"$f":"IF(#REF!=\"\",0,VLOOKUP(#REF!,#REF!,2,FALSE))","v":{"$error":"#REF!"}},{"$f":"IF(#REF!=\"\",0,VLOOKUP(#REF!,#REF!,2,FALSE))","v":{"$error":"#REF!"}},{"$f":"IF(#REF!=\"\",0,VLOOKUP(#REF!,#REF!,2,FALSE))","v":{"$error":"#REF!"}},"00","DPM",{"$f":"#REF!","v":{"$error":"#REF!"}},{"$f":"#REF!","v":{"$error":"#REF!"}},null,null,null,null,null,null,null,null,null,null,null,null,null,null,null,null,null,null,"-",{"$error":"#REF!"},null,62]
[{"$error":"#REF!"},{"$error":"#REF!"},1,{"$error":"#REF!"},{"$error":"#REF!"},{"$error":"#REF!"},{"$f":"IF(#REF!=\"\",0,VLOOKUP(#REF!,#REF!,2,FALSE))","v":{"$error":"#REF!"}},{"$f":"IF(#REF!=\"\",0,VLOOKUP(#REF!,#REF!,2,FALSE))","v":{"$error":"#REF!"}},{"$f":"IF(#REF!=\"\",0,VLOOKUP(#REF!,#REF!,2,FALSE))","v":{"$error":"#REF!"}},"00","DPM",{"$f":"#REF!","v":{"$error":"#REF!"}},{"$f":"#REF!","v":{"$error":"#REF!"}},null,null,null,null,null,null,null,null,null,null,null,null,null,null,null,null,null,null,"-",{"$error":"#REF!"},null,63]
[{"$error":"#REF!"},{"$error":"#REF!"},1,{"$error":"#REF!"},{"$error":"#REF!"},{"$error":"#REF!"},{"$f":"IF(#REF!=\"\",0,VLOOKUP(#REF!,#REF!,2,FALSE))","v":{"$error":"#REF!"}},{"$f":"IF(#REF!=\"\",0,VLOOKUP(#REF!,#REF!,2,FALSE))","v":{"$error":"#REF!"}},{"$f":"IF(#REF!=\"\",0,VLOOKUP(#REF!,#REF!,2,FALSE))","v":{"$error":"#REF!"}},"00","DPM",{"$f":"#REF!","v":{"$error":"#REF!"}},{"$f":"#REF!","v":{"$error":"#REF!"}},null,null,null,null,null,null,null,null,null,null,null,null,null,null,null,null,null,null,"-",{"$error":"#REF!"},null,64]
[{"$error":"#REF!"},{"$error":"#REF!"},1,{"$error":"#REF!"},{"$error":"#REF!"},{"$error":"#REF!"},{"$f":"IF(#REF!=\"\",0,VLOOKUP(#REF!,#REF!,2,FALSE))","v":{"$error":"#REF!"}},{"$f":"IF(#REF!=\"\",0,VLOOKUP(#REF!,#REF!,2,FALSE))","v":{"$error":"#REF!"}},{"$f":"IF(#REF!=\"\",0,VLOOKUP(#REF!,#REF!,2,FALSE))","v":{"$error":"#REF!"}},"00","DPM",{"$f":"#REF!","v":{"$error":"#REF!"}},{"$f":"#REF!","v":{"$error":"#REF!"}},null,null,null,null,null,null,null,null,null,null,null,null,null,null,null,null,null,null,"-",{"$error":"#REF!"},null,65]
[{"$error":"#REF!"},{"$error":"#REF!"},1,{"$error":"#REF!"},{"$error":"#REF!"},{"$error":"#REF!"},{"$f":"IF(#REF!=\"\",0,VLOOKUP(#REF!,#REF!,2,FALSE))","v":{"$error":"#REF!"}},{"$f":"IF(#REF!=\"\",0,VLOOKUP(#REF!,#REF!,2,FALSE))","v":{"$error":"#REF!"}},{"$f":"IF(#REF!=\"\",0,VLOOKUP(#REF!,#REF!,2,FALSE))","v":{"$error":"#REF!"}},"00","DPM",{"$f":"#REF!","v":{"$error":"#REF!"}},{"$f":"#REF!","v":{"$error":"#REF!"}},null,null,null,null,null,null,null,null,null,null,null,null,null,null,null,null,null,null,"-",{"$error":"#REF!"},null,66]
[{"$error":"#REF!"},{"$error":"#REF!"},1,{"$error":"#REF!"},{"$error":"#REF!"},{"$error":"#REF!"},{"$f":"IF(#REF!=\"\",0,VLOOKUP(#REF!,#REF!,2,FALSE))","v":{"$error":"#REF!"}},{"$f":"IF(#REF!=\"\",0,VLOOKUP(#REF!,#REF!,2,FALSE))","v":{"$error":"#REF!"}},{"$f":"IF(#REF!=\"\",0,VLOOKUP(#REF!,#REF!,2,FALSE))","v":{"$error":"#REF!"}},"00","DPM",{"$f":"#REF!","v":{"$error":"#REF!"}},{"$f":"#REF!","v":{"$error":"#REF!"}},null,null,null,null,null,null,null,null,null,null,null,null,null,null,null,null,null,null,"-",{"$error":"#REF!"},null,67]
[{"$error":"#REF!"},{"$error":"#REF!"},1,{"$error":"#REF!"},{"$error":"#REF!"},{"$error":"#REF!"},{"$f":"IF(#REF!=\"\",0,VLOOKUP(#REF!,#REF!,2,FALSE))","v":{"$error":"#REF!"}},{"$f":"IF(#REF!=\"\",0,VLOOKUP(#REF!,#REF!,2,FALSE))","v":{"$error":"#REF!"}},{"$f":"IF(#REF!=\"\",0,VLOOKUP(#REF!,#REF!,2,FALSE))","v":{"$error":"#REF!"}},"00","DPM",{"$f":"#REF!","v":{"$error":"#REF!"}},{"$f":"#REF!","v":{"$error":"#REF!"}},null,null,null,null,null,null,null,null,null,null,null,null,null,null,null,null,null,null,"-",{"$error":"#REF!"},null,68]
[{"$error":"#REF!"},{"$error":"#REF!"},1,{"$error":"#REF!"},{"$error":"#REF!"},{"$error":"#REF!"},{"$f":"IF(#REF!=\"\",0,VLOOKUP(#REF!,#REF!,2,FALSE))","v":{"$error":"#REF!"}},{"$f":"IF(#REF!=\"\",0,VLOOKUP(#REF!,#REF!,2,FALSE))","v":{"$error":"#REF!"}},{"$f":"IF(#REF!=\"\",0,VLOOKUP(#REF!,#REF!,2,FALSE))","v":{"$error":"#REF!"}},"00","DPM",{"$f":"#REF!","v":{"$error":"#REF!"}},{"$f":"#REF!","v":{"$error":"#REF!"}},null,null,null,null,null,null,null,null,null,null,null,null,null,null,null,null,null,null,"-",{"$error":"#REF!"},null,69]
[{"$error":"#REF!"},{"$error":"#REF!"},1,{"$error":"#REF!"},{"$error":"#REF!"},{"$error":"#REF!"},{"$f":"IF(#REF!=\"\",0,VLOOKUP(#REF!,#REF!,2,FALSE))","v":{"$error":"#REF!"}},{"$f":"IF(#REF!=\"\",0,VLOOKUP(#REF!,#REF!,2,FALSE))","v":{"$error":"#REF!"}},{"$f":"IF(#REF!=\"\",0,VLOOKUP(#REF!,#REF!,2,FALSE))","v":{"$error":"#REF!"}},"00","DPM",{"$f":"#REF!","v":{"$error":"#REF!"}},{"$f":"#REF!","v":{"$error":"#REF!"}},null,null,null,null,null,null,null,null,null,null,null,null,null,null,null,null,null,null,"-",{"$error":"#REF!"},null,70]
[{"$error":"#REF!"},{"$error":"#REF!"},1,{"$error":"#REF!"},{"$error":"#REF!"},{"$error":"#REF!"},{"$f":"IF(#REF!=\"\",0,VLOOKUP(#REF!,#REF!,2,FALSE))","v":{"$error":"#REF!"}},{"$f":"IF(#REF!=\"\",0,VLOOKUP(#REF!,#REF!,2,FALSE))","v":{"$error":"#REF!"}},{"$f":"IF(#REF!=\"\",0,VLOOKUP(#REF!,#REF!,2,FALSE))","v":{"$error":"#REF!"}},"00","DPM",{"$f":"#REF!","v":{"$error":"#REF!"}},{"$f":"#REF!","v":{"$error":"#REF!"}},null,null,null,null,null,null,null,null,null,null,null,null,null,null,null,null,null,null,"-",{"$error":"#REF!"},null,71]
[{"$error":"#REF!"},{"$error":"#REF!"},1,{"$error":"#REF!"},{"$error":"#REF!"},{"$error":"#REF!"},{"$f":"IF(#REF!=\"\",0,VLOOKUP(#REF!,#REF!,2,FALSE))","v":{"$error":"#REF!"}},{"$f":"IF(#REF!=\"\",0,VLOOKUP(#REF!,#REF!,2,FALSE))","v":{"$error":"#REF!"}},{"$f":"IF(#REF!=\"\",0,VLOOKUP(#REF!,#REF!,2,FALSE))","v":{"$error":"#REF!"}},"00","DPM",{"$f":"#REF!","v":{"$error":"#REF!"}},{"$f":"#REF!","v":{"$error":"#REF!"}},null,null,null,null,null,null,null,null,null,null,null,null,null,null,null,null,null,null,"-",{"$error":"#REF!"},null,72]
[{"$error":"#REF!"},{"$error":"#REF!"},1,{"$error":"#REF!"},{"$error":"#REF!"},{"$error":"#REF!"},{"$f":"IF(#REF!=\"\",0,VLOOKUP(#REF!,#REF!,2,FALSE))","v":{"$error":"#REF!"}},{"$f":"IF(#REF!=\"\",0,VLOOKUP(#REF!,#REF!,2,FALSE))","v":{"$error":"#REF!"}},{"$f":"IF(#REF!=\"\",0,VLOOKUP(#REF!,#REF!,2,FALSE))","v":{"$error":"#REF!"}},"00","DPM",{"$f":"#REF!","v":{"$error":"#REF!"}},{"$f":"#REF!","v":{"$error":"#REF!"}},null,null,null,null,null,null,null,null,null,null,null,null,null,null,null,null,null,null,"-",{"$error":"#REF!"},null,73]
[{"$error":"#REF!"},{"$error":"#REF!"},1,{"$error":"#REF!"},{"$error":"#REF!"},{"$error":"#REF!"},{"$f":"IF(#REF!=\"\",0,VLOOKUP(#REF!,#REF!,2,FALSE))","v":{"$error":"#REF!"}},{"$f":"IF(#REF!=\"\",0,VLOOKUP(#REF!,#REF!,2,FALSE))","v":{"$error":"#REF!"}},{"$f":"IF(#REF!=\"\",0,VLOOKUP(#REF!,#REF!,2,FALSE))","v":{"$error":"#REF!"}},"00","DPM",{"$f":"#REF!","v":{"$error":"#REF!"}},{"$f":"#REF!","v":{"$error":"#REF!"}},null,null,null,null,null,null,null,null,null,null,null,null,null,null,null,null,null,null,"-",{"$error":"#REF!"},null,74]
[{"$error":"#REF!"},{"$error":"#REF!"},1,{"$error":"#REF!"},{"$error":"#REF!"},{"$error":"#REF!"},{"$f":"IF(#REF!<>\"\",9990,0)","v":{"$error":"#REF!"}},{"$f":"IF(#REF!=\"\",0,VLOOKUP(#REF!,#REF!,2,FALSE))","v":{"$error":"#REF!"}},"#LK","00","DPM",{"$f":"#REF!","v":{"$error":"#REF!"}},{"$f":"#REF!","v":{"$error":"#REF!"}},null,null,null,null,null,null,null,null,null,null,null,null,null,null,null,null,null,null,{"$f":"IF(#REF!<>\"\",#REF!,\"-\")","v":{"$error":"#REF!"}},{"$error":"#REF!"},null,81]
[{"$error":"#REF!"},{"$error":"#REF!"},1,{"$error":"#REF!"},{"$error":"#REF!"},{"$error":"#REF!"},{"$f":"IF(#REF!<>\"\",9990,0)","v":{"$error":"#REF!"}},{"$f":"IF(#REF!=\"\",0,VLOOKUP(#REF!,#REF!,2,FALSE))","v":{"$error":"#REF!"}},"#LK","00","DPM",{"$f":"#REF!","v":{"$error":"#REF!"}},{"$f":"#REF!","v":{"$error":"#REF!"}},null,null,null,null,null,null,null,null,null,null,null,null,null,null,null,null,null,null,{"$f":"IF(#REF!<>\"\",#REF!,\"-\")","v":{"$error":"#REF!"}},{"$error":"#REF!"},null,82]
[{"$error":"#REF!"},{"$error":"#REF!"},1,{"$error":"#REF!"},{"$error":"#REF!"},{"$error":"#REF!"},{"$f":"IF(#REF!<>\"\",9990,0)","v":{"$error":"#REF!"}},{"$f":"IF(#REF!=\"\",0,VLOOKUP(#REF!,#REF!,2,FALSE))","v":{"$error":"#REF!"}},"#LK","00","DPM",{"$f":"#REF!","v":{"$error":"#REF!"}},{"$f":"#REF!","v":{"$error":"#REF!"}},null,null,null,null,null,null,null,null,null,null,null,null,null,null,null,null,null,null,{"$f":"IF(#REF!<>\"\",#REF!,\"-\")","v":{"$error":"#REF!"}},{"$error":"#REF!"},null,83]
[{"$error":"#REF!"},{"$error":"#REF!"},1,{"$error":"#REF!"},{"$error":"#REF!"},{"$error":"#REF!"},{"$f":"IF(#REF!<>\"\",9990,0)","v":{"$error":"#REF!"}},{"$f":"IF(#REF!=\"\",0,VLOOKUP(#REF!,#REF!,2,FALSE))","v":{"$error":"#REF!"}},"#LK","00","DPM",{"$f":"#REF!","v":{"$error":"#REF!"}},{"$f":"#REF!","v":{"$error":"#REF!"}},null,null,null,null,null,null,null,null,null,null,null,null,null,null,null,null,null,null,{"$f":"IF(#REF!<>\"\",#REF!,\"-\")","v":{"$error":"#REF!"}},{"$error":"#REF!"},null,84]
[{"$error":"#REF!"},{"$error":"#REF!"},1,{"$error":"#REF!"},{"$error":"#REF!"},{"$error":"#REF!"},{"$f":"IF(#REF!<>\"\",9990,0)","v":{"$error":"#REF!"}},{"$f":"IF(#REF!=\"\",0,VLOOKUP(#REF!,#REF!,2,FALSE))","v":{"$error":"#REF!"}},"#LK","00","DPM",{"$f":"#REF!","v":{"$error":"#REF!"}},{"$f":"#REF!","v":{"$error":"#REF!"}},null,null,null,null,null,null,null,null,null,null,null,null,null,null,null,null,null,null,{"$f":"IF(#REF!<>\"\",#REF!,\"-\")","v":{"$error":"#REF!"}},{"$f":"IF(OR(ABS(L66)>=0.55,ABS(M66)>=0.55,ABS(N66)>=0.55,ABS(O66)>=0.55,ABS(P66)>=0.55,ABS(Q66)>=0.55,ABS(R66)>=0.55,ABS(S66)>=0.55,ABS(T66)>=0.55,ABS(U66)>=0.55,ABS(V66)>=0.55,ABS(W66)>=0.55,ABS(X66)>=0.55,ABS(Y66)>=0.55,ABS(Z66)>=0.55,ABS(AA66)>=0.55,ABS(AB66)>=0.55,ABS(AC66)>=0.55,ABS(AD66)>=0.55,ABS(AE66)>=0.55),0,1)","v":{"$error":"#REF!"}},null,85]
[{"$f":"$A$2","v":{"$error":"#REF!"}},{"$f":"$B$2","v":{"$error":"#REF!"}},1,{"$f":"$D$2","v":{"$error":"#REF!"}},{"$f":"$E$2","v":{"$error":"#REF!"}},{"$f":"$F$2","v":{"$error":"#REF!"}},{"$f":"IF(#REF!<>\"\",9990,0)","v":{"$error":"#REF!"}},{"$f":"IF(#REF!=\"\",0,VLOOKUP(#REF!,#REF!,2,FALSE))","v":{"$error":"#REF!"}},"#LK","00","DPM",{"$f":"#REF!","v":{"$error":"#REF!"}},{"$f":"#REF!","v":{"$error":"#REF!"}},null,null,null,null,null,null,null,null,null,null,null,null,null,null,null,null,null,null,{"$f":"IF(#REF!<>\"\",#REF!,\"-\")","v":{"$error":"#REF!"}},{"$error":"#REF!"},null,86]
[{"$error":"#REF!"},{"$error":"#REF!"},1,{"$error":"#REF!"},{"$error":"#REF!"},{"$error":"#REF!"},{"$f":"IF(#REF!<>\"\",9990,0)","v":{"$error":"#REF!"}},{"$f":"IF(#REF!=\"\",0,VLOOKUP(#REF!,#REF!,2,FALSE))","v":{"$error":"#REF!"}},"#LK","00","DPM",{"$f":"#REF!","v":{"$error":"#REF!"}},{"$f":"#REF!","v":{"$error":"#REF!"}},null,null,null,null,null,null,null,null,null,null,null,null,null,null,null,null,null,null,{"$f":"IF(#REF!<>\"\",#REF!,\"-\")","v":{"$error":"#REF!"}},{"$error":"#REF!"},null,87]
[{"$error":"#REF!"},{"$error":"#REF!"},1,{"$error":"#REF!"},{"$error":"#REF!"},{"$error":"#REF!"},{"$f":"IF(#REF!<>\"\",9990,0)","v":{"$error":"#REF!"}},{"$f":"IF(#REF!=\"\",0,VLOOKUP(#REF!,#REF!,2,FALSE))","v":{"$error":"#REF!"}},"#LK","00","DPM",{"$f":"#REF!","v":{"$error":"#REF!"}},{"$f":"#REF!","v":{"$error":"#REF!"}},null,null,null,null,null,null,null,null,null,null,null,null,null,null,null,null,null,null,{"$f":"IF(#REF!<>\"\",#REF!,\"-\")","v":{"$error":"#REF!"}},{"$error":"#REF!"},null,88]
[{"$error":"#REF!"},{"$error":"#REF!"},1,{"$error":"#REF!"},{"$error":"#REF!"},{"$error":"#REF!"},{"$f":"IF(#REF!<>\"\",9990,0)","v":{"$error":"#REF!"}},{"$f":"IF(#REF!=\"\",0,VLOOKUP(#REF!,#REF!,2,FALSE))","v":{"$error":"#REF!"}},"#LK","00","DPM",{"$f":"#REF!","v":{"$error":"#REF!"}},{"$f":"#REF!","v":{"$error":"#REF!"}},null,null,null,null,null,null,null,null,null,null,null,null,null,null,null,null,null,null,{"$f":"IF(#REF!<>\"\",#REF!,\"-\")","v":{"$error":"#REF!"}},{"$error":"#REF!"},null,89]
[{"$error":"#REF!"},{"$error":"#REF!"},1,{"$error":"#REF!"},{"$error":"#REF!"},{"$error":"#REF!"},{"$f":"IF(#REF!<>\"\",9990,0)","v":{"$error":"#REF!"}},{"$f":"IF(#REF!=\"\",0,VLOOKUP(#REF!,#REF!,2,FALSE))","v":{"$error":"#REF!"}},"#LK","00","DPM",{"$f":"#REF!","v":{"$error":"#REF!"}},{"$f":"#REF!","v":{"$error":"#REF!"}},null,null,null,null,null,null,null,null,null,null,null,null,null,null,null,null,null,null,{"$f":"IF(#REF!<>\"\",#REF!,\"-\")","v":{"$error":"#REF!"}},{"$error":"#REF!"},null,90]
[{"$error":"#REF!"},{"$error":"#REF!"},2,{"$error":"#REF!"},{"$error":"#REF!"},{"$error":"#REF!"},{"$f":"IF(#REF!=\"\",0,VLOOKUP(#REF!,#REF!,2,FALSE))","v":{"$error":"#REF!"}},{"$f":"IF(#REF!=\"\",0,VLOOKUP(#REF!,#REF!,2,FALSE))","v":{"$error":"#REF!"}},{"$f":"IF(#REF!=\"\",0,VLOOKUP(#REF!,#REF!,2,FALSE))","v":{"$error":"#REF!"}},"00","DPM",{"$f":"#REF!","v":{"$error":"#REF!"}},{"$f":"#REF!","v":{"$error":"#REF!"}},null,null,null,null,null,null,null,null,null,null,null,null,null,null,null,null,null,null,"-",{"$error":"#REF!"},"Sheet 21 Non Nominee'!H15 / I15",15]
[{"$error":"#REF!"},{"$error":"#REF!"},2,{"$error":"#REF!"},{"$error":"#REF!"},{"$error":"#REF!"},{"$f":"IF(#REF!=\"\",0,VLOOKUP(#REF!,#REF!,2,FALSE))","v":{"$error":"#REF!"}},{"$f":"IF(#REF!=\"\",0,VLOOKUP(#REF!,#REF!,2,FALSE))","v":{"$error":"#REF!"}},{"$f":"IF(#REF!=\"\",0,VLOOKUP(#REF!,#REF!,2,FALSE))","v":{"$error":"#REF!"}},"00","DPM",{"$f":"#REF!","v":{"$error":"#REF!"}},{"$f":"#REF!","v":{"$error":"#REF!"}},null,null,null,null,null,null,null,null,null,null,null,null,null,null,null,null,null,null,"-",{"$error":"#REF!"},null,16]
[{"$error":"#REF!"},{"$error":"#REF!"},2,{"$error":"#REF!"},{"$error":"#REF!"},{"$error":"#REF!"},{"$f":"IF(#REF!=\"\",0,VLOOKUP(#REF!,#REF!,2,FALSE))","v":{"$error":"#REF!"}},{"$f":"IF(#REF!=\"\",0,VLOOKUP(#REF!,#REF!,2,FALSE))","v":{"$error":"#REF!"}},{"$f":"IF(#REF!=\"\",0,VLOOKUP(#REF!,#REF!,2,FALSE))","v":{"$error":"#REF!"}},"00","DPM",{"$f":"#REF!","v":{"$error":"#REF!"}},{"$f":"#REF!","v":{"$error":"#REF!"}},null,null,null,null,null,null,null,null,null,null,null,null,null,null,null,null,null,null,"-",{"$error":"#REF!"},null,17]
[{"$error":"#REF!"},{"$error":"#REF!"},2,{"$error":"#REF!"},{"$error":"#REF!"},{"$error":"#REF!"},{"$f":"IF(#REF!=\"\",0,VLOOKUP(#REF!,#REF!,2,FALSE))","v":{"$error":"#REF!"}},{"$f":"IF(#REF!=\"\",0,VLOOKUP(#REF!,#REF!,2,FALSE))","v":{"$error":"#REF!"}},{"$f":"IF(#REF!=\"\",0,VLOOKUP(#REF!,#REF!,2,FALSE))","v":{"$error":"#REF!"}},"00","DPM",{"$f":"#REF!","v":{"$error":"#REF!"}},{"$f":"#REF!","v":{"$error":"#REF!"}},null,null,null,null,null,null,null,null,null,null,null,null,null,null,null,null,null,null,"-",{"$error":"#REF!"},null,18]
[{"$error":"#REF!"},{"$error":"#REF!"},2,{"$error":"#REF!"},{"$error":"#REF!"},{"$error":"#REF!"},{"$f":"IF(#REF!=\"\",0,VLOOKUP(#REF!,#REF!,2,FALSE))","v":{"$error":"#REF!"}},{"$f":"IF(#REF!=\"\",0,VLOOKUP(#REF!,#REF!,2,FALSE))","v":{"$error":"#REF!"}},{"$f":"IF(#REF!=\"\",0,VLOOKUP(#REF!,#REF!,2,FALSE))","v":{"$error":"#REF!"}},"00","DPM",{"$f":"#REF!","v":{"$error":"#REF!"}},{"$f":"#REF!","v":{"$error":"#REF!"}},null,null,null,null,null,null,null,null,null,null,null,null,null,null,null,null,null,null,"-",{"$error":"#REF!"},null,19]
[{"$error":"#REF!"},{"$error":"#REF!"},2,{"$error":"#REF!"},{"$error":"#REF!"},{"$error":"#REF!"},{"$f":"IF(#REF!=\"\",0,VLOOKUP(#REF!,#REF!,2,FALSE))","v":{"$error":"#REF!"}},{"$f":"IF(#REF!=\"\",0,VLOOKUP(#REF!,#REF!,2,FALSE))","v":{"$error":"#REF!"}},{"$f":"IF(#REF!=\"\",0,VLOOKUP(#REF!,#REF!,2,FALSE))","v":{"$error":"#REF!"}},"00","DPM",{"$f":"#REF!","v":{"$error":"#REF!"}},{"$f":"#REF!","v":{"$error":"#REF!"}},null,null,null,null,null,null,null,null,null,null,null,null,null,null,null,null,null,null,"-",{"$error":"#REF!"},null,20]
[{"$error":"#REF!"},{"$error":"#REF!"},2,{"$error":"#REF!"},{"$error":"#REF!"},{"$error":"#REF!"},{"$f":"IF(#REF!=\"\",0,VLOOKUP(#REF!,#REF!,2,FALSE))","v":{"$error":"#REF!"}},{"$f":"IF(#REF!=\"\",0,VLOOKUP(#REF!,#REF!,2,FALSE))","v":{"$error":"#REF!"}},{"$f":"IF(#REF!=\"\",0,VLOOKUP(#REF!,#REF!,2,FALSE))","v":{"$error":"#REF!"}},"00","DPM",{"$f":"#REF!","v":{"$error":"#REF!"}},{"$f":"#REF!","v":{"$error":"#REF!"}},null,null,null,null,null,null,null,null,null,null,null,null,null,null,null,null,null,null,"-",{"$error":"#REF!"},null,21]
[{"$error":"#REF!"},{"$error":"#REF!"},2,{"$error":"#REF!"},{"$error":"#REF!"},{"$error":"#REF!"},{"$f":"IF(#REF!=\"\",0,VLOOKUP(#REF!,#REF!,2,FALSE))","v":{"$error":"#REF!"}},{"$f":"IF(#REF!=\"\",0,VLOOKUP(#REF!,#REF!,2,FALSE))","v":{"$error":"#REF!"}},{"$f":"IF(#REF!=\"\",0,VLOOKUP(#REF!,#REF!,2,FALSE))","v":{"$error":"#REF!"}},"00","DPM",{"$f":"#REF!","v":{"$error":"#REF!"}},{"$f":"#REF!","v":{"$error":"#REF!"}},null,null,null,null,null,null,null,null,null,null,null,null,null,null,null,null,null,null,"-",{"$error":"#REF!"},null,22]
[{"$error":"#REF!"},{"$error":"#REF!"},2,{"$error":"#REF!"},{"$error":"#REF!"},{"$error":"#REF!"},{"$f":"IF(#REF!=\"\",0,VLOOKUP(#REF!,#REF!,2,FALSE))","v":{"$error":"#REF!"}},{"$f":"IF(#REF!=\"\",0,VLOOKUP(#REF!,#REF!,2,FALSE))","v":{"$error":"#REF!"}},{"$f":"IF(#REF!=\"\",0,VLOOKUP(#REF!,#REF!,2,FALSE))","v":{"$error":"#REF!"}},"00","DPM",{"$f":"#REF!","v":{"$error":"#REF!"}},{"$f":"#REF!","v":{"$error":"#REF!"}},null,null,null,null,null,null,null,null,null,null,null,null,null,null,null,null,null,null,"-",{"$error":"#REF!"},null,23]
[{"$error":"#REF!"},{"$error":"#REF!"},2,{"$error":"#REF!"},{"$error":"#REF!"},{"$error":"#REF!"},{"$f":"IF(#REF!=\"\",0,VLOOKUP(#REF!,#REF!,2,FALSE))","v":{"$error":"#REF!"}},{"$f":"IF(#REF!=\"\",0,VLOOKUP(#REF!,#REF!,2,FALSE))","v":{"$error":"#REF!"}},{"$f":"IF(#REF!=\"\",0,VLOOKUP(#REF!,#REF!,2,FALSE))","v":{"$error":"#REF!"}},"00","DPM",{"$f":"#REF!","v":{"$error":"#REF!"}},{"$f":"#REF!","v":{"$error":"#REF!"}},null,null,null,null,null,null,null,null,null,null,null,null,null,null,null,null,null,null,"-",{"$error":"#REF!"},null,24]
[{"$error":"#REF!"},{"$error":"#REF!"},2,{"$error":"#REF!"},{"$error":"#REF!"},{"$error":"#REF!"},{"$f":"IF(#REF!=\"\",0,VLOOKUP(#REF!,#REF!,2,FALSE))","v":{"$error":"#REF!"}},{"$f":"IF(#REF!=\"\",0,VLOOKUP(#REF!,#REF!,2,FALSE))","v":{"$error":"#REF!"}},{"$f":"IF(#REF!=\"\",0,VLOOKUP(#REF!,#REF!,2,FALSE))","v":{"$error":"#REF!"}},"00","DPM",{"$f":"#REF!","v":{"$error":"#REF!"}},{"$f":"#REF!","v":{"$error":"#REF!"}},null,null,null,null,null,null,null,null,null,null,null,null,null,null,null,null,null,null,"-",{"$error":"#REF!"},null,25]
[{"$error":"#REF!"},{"$error":"#REF!"},2,{"$error":"#REF!"},{"$error":"#REF!"},{"$error":"#REF!"},{"$f":"IF(#REF!=\"\",0,VLOOKUP(#REF!,#REF!,2,FALSE))","v":{"$error":"#REF!"}},{"$f":"IF(#REF!=\"\",0,VLOOKUP(#REF!,#REF!,2,FALSE))","v":{"$error":"#REF!"}},{"$f":"IF(#REF!=\"\",0,VLOOKUP(#REF!,#REF!,2,FALSE))","v":{"$error":"#REF!"}},"00","DPM",{"$f":"#REF!","v":{"$error":"#REF!"}},{"$f":"#REF!","v":{"$error":"#REF!"}},null,null,null,null,null,null,null,null,null,null,null,null,null,null,null,null,null,null,"-",{"$error":"#REF!"},null,26]
[{"$error":"#REF!"},{"$error":"#REF!"},2,{"$error":"#REF!"},{"$error":"#REF!"},{"$error":"#REF!"},{"$f":"IF(#REF!=\"\",0,VLOOKUP(#REF!,#REF!,2,FALSE))","v":{"$error":"#REF!"}},{"$f":"IF(#REF!=\"\",0,VLOOKUP(#REF!,#REF!,2,FALSE))","v":{"$error":"#REF!"}},{"$f":"IF(#REF!=\"\",0,VLOOKUP(#REF!,#REF!,2,FALSE))","v":{"$error":"#REF!"}},"00","DPM",{"$f":"#REF!","v":{"$error":"#REF!"}},{"$f":"#REF!","v":{"$error":"#REF!"}},null,null,null,null,null,null,null,null,null,null,null,null,null,null,null,null,null,null,"-",{"$error":"#REF!"},null,27]
[{"$error":"#REF!"},{"$error":"#REF!"},2,{"$error":"#REF!"},{"$error":"#REF!"},{"$error":"#REF!"},{"$f":"IF(#REF!=\"\",0,VLOOKUP(#REF!,#REF!,2,FALSE))","v":{"$error":"#REF!"}},{"$f":"IF(#REF!=\"\",0,VLOOKUP(#REF!,#REF!,2,FALSE))","v":{"$error":"#REF!"}},{"$f":"IF(#REF!=\"\",0,VLOOKUP(#REF!,#REF!,2,FALSE))","v":{"$error":"#REF!"}},"00","DPM",{"$f":"#REF!","v":{"$error":"#REF!"}},{"$f":"#REF!","v":{"$error":"#REF!"}},null,null,null,null,null,null,null,null,null,null,null,null,null,null,null,null,null,null,"-",{"$error":"#REF!"},null,28]
[{"$error":"#REF!"},{"$error":"#REF!"},2,{"$error":"#REF!"},{"$error":"#REF!"},{"$error":"#REF!"},{"$f":"IF(#REF!=\"\",0,VLOOKUP(#REF!,#REF!,2,FALSE))","v":{"$error":"#REF!"}},{"$f":"IF(#REF!=\"\",0,VLOOKUP(#REF!,#REF!,2,FALSE))","v":{"$error":"#REF!"}},{"$f":"IF(#REF!=\"\",0,VLOOKUP(#REF!,#REF!,2,FALSE))","v":{"$error":"#REF!"}},"00","DPM",{"$f":"#REF!","v":{"$error":"#REF!"}},{"$f":"#REF!","v":{"$error":"#REF!"}},null,null,null,null,null,null,null,null,null,null,null,null,null,null,null,null,null,null,"-",{"$error":"#REF!"},null,29]
[{"$error":"#REF!"},{"$error":"#REF!"},2,{"$error":"#REF!"},{"$error":"#REF!"},{"$error":"#REF!"},{"$f":"IF(#REF!=\"\",0,VLOOKUP(#REF!,#REF!,2,FALSE))","v":{"$error":"#REF!"}},{"$f":"IF(#REF!=\"\",0,VLOOKUP(#REF!,#REF!,2,FALSE))","v":{"$error":"#REF!"}},{"$f":"IF(#REF!=\"\",0,VLOOKUP(#REF!,#REF!,2,FALSE))","v":{"$error":"#REF!"}},"00","DPM",{"$f":"#REF!","v":{"$error":"#REF!"}},{"$f":"#REF!","v":{"$error":"#REF!"}},null,null,null,null,null,null,null,null,null,null,null,null,null,null,null,null,null,null,"-",{"$error":"#REF!"},null,30]
[{"$error":"#REF!"},{"$error":"#REF!"},2,{"$error":"#REF!"},{"$error":"#REF!"},{"$error":"#REF!"},{"$f":"IF(#REF!=\"\",0,VLOOKUP(#REF!,#REF!,2,FALSE))","v":{"$error":"#REF!"}},{"$f":"IF(#REF!=\"\",0,VLOOKUP(#REF!,#REF!,2,FALSE))","v":{"$error":"#REF!"}},{"$f":"IF(#REF!=\"\",0,VLOOKUP(#REF!,#REF!,2,FALSE))","v":{"$error":"#REF!"}},"00","DPM",{"$f":"#REF!","v":{"$error":"#REF!"}},{"$f":"#REF!","v":{"$error":"#REF!"}},null,null,null,null,null,null,null,null,null,null,null,null,null,null,null,null,null,null,"-",{"$error":"#REF!"},null,31]
[{"$error":"#REF!"},{"$error":"#REF!"},2,{"$error":"#REF!"},{"$error":"#REF!"},{"$error":"#REF!"},{"$f":"IF(#REF!=\"\",0,VLOOKUP(#REF!,#REF!,2,FALSE))","v":{"$error":"#REF!"}},{"$f":"IF(#REF!=\"\",0,VLOOKUP(#REF!,#REF!,2,FALSE))","v":{"$error":"#REF!"}},{"$f":"IF(#REF!=\"\",0,VLOOKUP(#REF!,#REF!,2,FALSE))","v":{"$error":"#REF!"}},"00","DPM",{"$f":"#REF!","v":{"$error":"#REF!"}},{"$f":"#REF!","v":{"$error":"#REF!"}},null,null,null,null,null,null,null,null,null,null,null,null,null,null,null,null,null,null,"-",{"$error":"#REF!"},null,32]
[{"$error":"#REF!"},{"$error":"#REF!"},2,{"$error":"#REF!"},{"$error":"#REF!"},{"$error":"#REF!"},{"$f":"IF(#REF!=\"\",0,VLOOKUP(#REF!,#REF!,2,FALSE))","v":{"$error":"#REF!"}},{"$f":"IF(#REF!=\"\",0,VLOOKUP(#REF!,#REF!,2,FALSE))","v":{"$error":"#REF!"}},{"$f":"IF(#REF!=\"\",0,VLOOKUP(#REF!,#REF!,2,FALSE))","v":{"$error":"#REF!"}},"00","DPM",{"$f":"#REF!","v":{"$error":"#REF!"}},{"$f":"#REF!","v":{"$error":"#REF!"}},null,null,null,null,null,null,null,null,null,null,null,null,null,null,null,null,null,null,"-",{"$error":"#REF!"},null,33]
[{"$error":"#REF!"},{"$error":"#REF!"},2,{"$error":"#REF!"},{"$error":"#REF!"},{"$error":"#REF!"},{"$f":"IF(#REF!=\"\",0,VLOOKUP(#REF!,#REF!,2,FALSE))","v":{"$error":"#REF!"}},{"$f":"IF(#REF!=\"\",0,VLOOKUP(#REF!,#REF!,2,FALSE))","v":{"$error":"#REF!"}},{"$f":"IF(#REF!=\"\",0,VLOOKUP(#REF!,#REF!,2,FALSE))","v":{"$error":"#REF!"}},"00","DPM",{"$f":"#REF!","v":{"$error":"#REF!"}},{"$f":"#REF!","v":{"$error":"#REF!"}},null,null,null,null,null,null,null,null,null,null,null,null,null,null,null,null,null,null,"-",{"$error":"#REF!"},null,34]
[{"$error":"#REF!"},{"$error":"#REF!"},2,{"$error":"#REF!"},{"$error":"#REF!"},{"$error":"#REF!"},{"$f":"IF(#REF!=\"\",0,VLOOKUP(#REF!,#REF!,2,FALSE))","v":{"$error":"#REF!"}},{"$f":"IF(#REF!=\"\",0,VLOOKUP(#REF!,#REF!,2,FALSE))","v":{"$error":"#REF!"}},{"$f":"IF(#REF!=\"\",0,VLOOKUP(#REF!,#REF!,2,FALSE))","v":{"$error":"#REF!"}},"00","DPM",{"$f":"#REF!","v":{"$error":"#REF!"}},{"$f":"#REF!","v":{"$error":"#REF!"}},null,null,null,null,null,null,null,null,null,null,null,null,null,null,null,null,null,null,"-",{"$error":"#REF!"},null,35]
[{"$error":"#REF!"},{"$error":"#REF!"},2,{"$error":"#REF!"},{"$error":"#REF!"},{"$error":"#REF!"},{"$f":"IF(#REF!=\"\",0,VLOOKUP(#REF!,#REF!,2,FALSE))","v":{"$error":"#REF!"}},{"$f":"IF(#REF!=\"\",0,VLOOKUP(#REF!,#REF!,2,FALSE))","v":{"$error":"#REF!"}},{"$f":"IF(#REF!=\"\",0,VLOOKUP(#REF!,#REF!,2,FALSE))","v":{"$error":"#REF!"}},"00","DPM",{"$f":"#REF!","v":{"$error":"#REF!"}},{"$f":"#REF!","v":{"$error":"#REF!"}},null,null,null,null,null,null,null,null,null,null,null,null,null,null,null,null,null,null,"-",{"$error":"#REF!"},null,36]
[{"$error":"#REF!"},{"$error":"#REF!"},2,{"$error":"#REF!"},{"$error":"#REF!"},{"$error":"#REF!"},{"$f":"IF(#REF!=\"\",0,VLOOKUP(#REF!,#REF!,2,FALSE))","v":{"$error":"#REF!"}},{"$f":"IF(#REF!=\"\",0,VLOOKUP(#REF!,#REF!,2,FALSE))","v":{"$error":"#REF!"}},{"$f":"IF(#REF!=\"\",0,VLOOKUP(#REF!,#REF!,2,FALSE))","v":{"$error":"#REF!"}},"00","DPM",{"$f":"#REF!","v":{"$error":"#REF!"}},{"$f":"#REF!","v":{"$error":"#REF!"}},null,null,null,null,null,null,null,null,null,null,null,null,null,null,null,null,null,null,"-",{"$error":"#REF!"},null,37]
[{"$error":"#REF!"},{"$error":"#REF!"},2,{"$error":"#REF!"},{"$error":"#REF!"},{"$error":"#REF!"},{"$f":"IF(#REF!=\"\",0,VLOOKUP(#REF!,#REF!,2,FALSE))","v":{"$error":"#REF!"}},{"$f":"IF(#REF!=\"\",0,VLOOKUP(#REF!,#REF!,2,FALSE))","v":{"$error":"#REF!"}},{"$f":"IF(#REF!=\"\",0,VLOOKUP(#REF!,#REF!,2,FALSE))","v":{"$error":"#REF!"}},"00","DPM",{"$f":"#REF!","v":{"$error":"#REF!"}},{"$f":"#REF!","v":{"$error":"#REF!"}},null,null,null,null,null,null,null,null,null,null,null,null,null,null,null,null,null,null,"-",{"$error":"#REF!"},null,38]
[{"$error":"#REF!"},{"$error":"#REF!"},2,{"$error":"#REF!"},{"$error":"#REF!"},{"$error":"#REF!"},{"$f":"IF(#REF!=\"\",0,VLOOKUP(#REF!,#REF!,2,FALSE))","v":{"$error":"#REF!"}},{"$f":"IF(#REF!=\"\",0,VLOOKUP(#REF!,#REF!,2,FALSE))","v":{"$error":"#REF!"}},{"$f":"IF(#REF!=\"\",0,VLOOKUP(#REF!,#REF!,2,FALSE))","v":{"$error":"#REF!"}},"00","DPM",{"$f":"#REF!","v":{"$error":"#REF!"}},{"$f":"#REF!","v":{"$error":"#REF!"}},null,null,null,null,null,null,null,null,null,null,null,null,null,null,null,null,null,null,"-",{"$error":"#REF!"},null,39]
[{"$error":"#REF!"},{"$error":"#REF!"},2,{"$error":"#REF!"},{"$error":"#REF!"},{"$error":"#REF!"},{"$f":"IF(#REF!=\"\",0,VLOOKUP(#REF!,#REF!,2,FALSE))","v":{"$error":"#REF!"}},{"$f":"IF(#REF!=\"\",0,VLOOKUP(#REF!,#REF!,2,FALSE))","v":{"$error":"#REF!"}},{"$f":"IF(#REF!=\"\",0,VLOOKUP(#REF!,#REF!,2,FALSE))","v":{"$error":"#REF!"}},"00","DPM",{"$f":"#REF!","v":{"$error":"#REF!"}},{"$f":"#REF!","v":{"$error":"#REF!"}},null,null,null,null,null,null,null,null,null,null,null,null,null,null,null,null,null,null,"-",{"$error":"#REF!"},null,40]
[{"$error":"#REF!"},{"$error":"#REF!"},2,{"$error":"#REF!"},{"$error":"#REF!"},{"$error":"#REF!"},{"$f":"IF(#REF!=\"\",0,VLOOKUP(#REF!,#REF!,2,FALSE))","v":{"$error":"#REF!"}},{"$f":"IF(#REF!=\"\",0,VLOOKUP(#REF!,#REF!,2,FALSE))","v":{"$error":"#REF!"}},{"$f":"IF(#REF!=\"\",0,VLOOKUP(#REF!,#REF!,2,FALSE))","v":{"$error":"#REF!"}},"00","DPM",{"$f":"#REF!","v":{"$error":"#REF!"}},{"$f":"#REF!","v":{"$error":"#REF!"}},null,null,null,null,null,null,null,null,null,null,null,null,null,null,null,null,null,null,"-",{"$error":"#REF!"},null,41]
[{"$error":"#REF!"},{"$error":"#REF!"},2,{"$error":"#REF!"},{"$error":"#REF!"},{"$error":"#REF!"},{"$f":"IF(#REF!=\"\",0,VLOOKUP(#REF!,#REF!,2,FALSE))","v":{"$error":"#REF!"}},{"$f":"IF(#REF!=\"\",0,VLOOKUP(#REF!,#REF!,2,FALSE))","v":{"$error":"#REF!"}},{"$f":"IF(#REF!=\"\",0,VLOOKUP(#REF!,#REF!,2,FALSE))","v":{"$error":"#REF!"}},"00","DPM",{"$f":"#REF!","v":{"$error":"#REF!"}},{"$f":"#REF!","v":{"$error":"#REF!"}},null,null,null,null,null,null,null,null,null,null,null,null,null,null,null,null,null,null,"-",{"$error":"#REF!"},null,42]
[{"$error":"#REF!"},{"$error":"#REF!"},2,{"$error":"#REF!"},{"$error":"#REF!"},{"$error":"#REF!"},{"$f":"IF(#REF!=\"\",0,VLOOKUP(#REF!,#REF!,2,FALSE))","v":{"$error":"#REF!"}},{"$f":"IF(#REF!=\"\",0,VLOOKUP(#REF!,#REF!,2,FALSE))","v":{"$error":"#REF!"}},{"$f":"IF(#REF!=\"\",0,VLOOKUP(#REF!,#REF!,2,FALSE))","v":{"$error":"#REF!"}},"00","DPM",{"$f":"#REF!","v":{"$error":"#REF!"}},{"$f":"#REF!","v":{"$error":"#REF!"}},null,null,null,null,null,null,null,null,null,null,null,null,null,null,null,null,null,null,"-",{"$error":"#REF!"},null,43]
[{"$error":"#REF!"},{"$error":"#REF!"},2,{"$error":"#REF!"},{"$error":"#REF!"},{"$error":"#REF!"},{"$f":"IF(#REF!=\"\",0,VLOOKUP(#REF!,#REF!,2,FALSE))","v":{"$error":"#REF!"}},{"$f":"IF(#REF!=\"\",0,VLOOKUP(#REF!,#REF!,2,FALSE))","v":{"$error":"#REF!"}},{"$f":"IF(#REF!=\"\",0,VLOOKUP(#REF!,#REF!,2,FALSE))","v":{"$error":"#REF!"}},"00","DPM",{"$f":"#REF!","v":{"$error":"#REF!"}},{"$f":"#REF!","v":{"$error":"#REF!"}},null,null,null,null,null,null,null,null,null,null,null,null,null,null,null,null,null,null,"-",{"$error":"#REF!"},null,44]
[{"$error":"#REF!"},{"$error":"#REF!"},2,{"$error":"#REF!"},{"$error":"#REF!"},{"$error":"#REF!"},{"$f":"IF(#REF!=\"\",0,VLOOKUP(#REF!,#REF!,2,FALSE))","v":{"$error":"#REF!"}},{"$f":"IF(#REF!=\"\",0,VLOOKUP(#REF!,#REF!,2,FALSE))","v":{"$error":"#REF!"}},{"$f":"IF(#REF!=\"\",0,VLOOKUP(#REF!,#REF!,2,FALSE))","v":{"$error":"#REF!"}},"00","DPM",{"$f":"#REF!","v":{"$error":"#REF!"}},{"$f":"#REF!","v":{"$error":"#REF!"}},null,null,null,null,null,null,null,null,null,null,null,null,null,null,null,null,null,null,"-",{"$error":"#REF!"},null,45]
[{"$error":"#REF!"},{"$error":"#REF!"},2,{"$error":"#REF!"},{"$error":"#REF!"},{"$error":"#REF!"},{"$f":"IF(#REF!=\"\",0,VLOOKUP(#REF!,#REF!,2,FALSE))","v":{"$error":"#REF!"}},{"$f":"IF(#REF!=\"\",0,VLOOKUP(#REF!,#REF!,2,FALSE))","v":{"$error":"#REF!"}},{"$f":"IF(#REF!=\"\",0,VLOOKUP(#REF!,#REF!,2,FALSE))","v":{"$error":"#REF!"}},"00","DPM",{"$f":"#REF!","v":{"$error":"#REF!"}},{"$f":"#REF!","v":{"$error":"#REF!"}},null,null,null,null,null,null,null,null,null,null,null,null,null,null,null,null,null,null,"-",{"$error":"#REF!"},null,46]
[{"$error":"#REF!"},{"$error":"#REF!"},2,{"$error":"#REF!"},{"$error":"#REF!"},{"$error":"#REF!"},{"$f":"IF(#REF!=\"\",0,VLOOKUP(#REF!,#REF!,2,FALSE))","v":{"$error":"#REF!"}},{"$f":"IF(#REF!=\"\",0,VLOOKUP(#REF!,#REF!,2,FALSE))","v":{"$error":"#REF!"}},{"$f":"IF(#REF!=\"\",0,VLOOKUP(#REF!,#REF!,2,FALSE))","v":{"$error":"#REF!"}},"00","DPM",{"$f":"#REF!","v":{"$error":"#REF!"}},{"$f":"#REF!","v":{"$error":"#REF!"}},null,null,null,null,null,null,null,null,null,null,null,null,null,null,null,null,null,null,"-",{"$error":"#REF!"},null,47]
[{"$error":"#REF!"},{"$error":"#REF!"},2,{"$error":"#REF!"},{"$error":"#REF!"},{"$error":"#REF!"},{"$f":"IF(#REF!=\"\",0,VLOOKUP(#REF!,#REF!,2,FALSE))","v":{"$error":"#REF!"}},{"$f":"IF(#REF!=\"\",0,VLOOKUP(#REF!,#REF!,2,FALSE))","v":{"$error":"#REF!"}},{"$f":"IF(#REF!=\"\",0,VLOOKUP(#REF!,#REF!,2,FALSE))","v":{"$error":"#REF!"}},"00","DPM",{"$f":"#REF!","v":{"$error":"#REF!"}},{"$f":"#REF!","v":{"$error":"#REF!"}},null,null,null,null,null,null,null,null,null,null,null,null,null,null,null,null,null,null,"-",{"$error":"#REF!"},null,48]
[{"$error":"#REF!"},{"$error":"#REF!"},2,{"$error":"#REF!"},{"$error":"#REF!"},{"$error":"#REF!"},{"$f":"IF(#REF!=\"\",0,VLOOKUP(#REF!,#REF!,2,FALSE))","v":{"$error":"#REF!"}},{"$f":"IF(#REF!=\"\",0,VLOOKUP(#REF!,#REF!,2,FALSE))","v":{"$error":"#REF!"}},{"$f":"IF(#REF!=\"\",0,VLOOKUP(#REF!,#REF!,2,FALSE))","v":{"$error":"#REF!"}},"00","DPM",{"$f":"#REF!","v":{"$error":"#REF!"}},{"$f":"#REF!","v":{"$error":"#REF!"}},null,null,null,null,null,null,null,null,null,null,null,null,null,null,null,null,null,null,"-",{"$error":"#REF!"},null,49]
[{"$error":"#REF!"},{"$error":"#REF!"},2,{"$error":"#REF!"},{"$error":"#REF!"},{"$error":"#REF!"},{"$f":"IF(#REF!=\"\",0,VLOOKUP(#REF!,#REF!,2,FALSE))","v":{"$error":"#REF!"}},{"$f":"IF(#REF!=\"\",0,VLOOKUP(#REF!,#REF!,2,FALSE))","v":{"$error":"#REF!"}},{"$f":"IF(#REF!=\"\",0,VLOOKUP(#REF!,#REF!,2,FALSE))","v":{"$error":"#REF!"}},"00","DPM",{"$f":"#REF!","v":{"$error":"#REF!"}},{"$f":"#REF!","v":{"$error":"#REF!"}},null,null,null,null,null,null,null,null,null,null,null,null,null,null,null,null,null,null,"-",{"$error":"#REF!"},null,50]
[{"$error":"#REF!"},{"$error":"#REF!"},2,{"$error":"#REF!"},{"$error":"#REF!"},{"$error":"#REF!"},{"$f":"IF(#REF!=\"\",0,VLOOKUP(#REF!,#REF!,2,FALSE))","v":{"$error":"#REF!"}},{"$f":"IF(#REF!=\"\",0,VLOOKUP(#REF!,#REF!,2,FALSE))","v":{"$error":"#REF!"}},{"$f":"IF(#REF!=\"\",0,VLOOKUP(#REF!,#REF!,2,FALSE))","v":{"$error":"#REF!"}},"00","DPM",{"$f":"#REF!","v":{"$error":"#REF!"}},{"$f":"#REF!","v":{"$error":"#REF!"}},null,null,null,null,null,null,null,null,null,null,null,null,null,null,null,null,null,null,"-",{"$error":"#REF!"},null,51]
[{"$error":"#REF!"},{"$error":"#REF!"},2,{"$error":"#REF!"},{"$error":"#REF!"},{"$error":"#REF!"},{"$f":"IF(#REF!=\"\",0,VLOOKUP(#REF!,#REF!,2,FALSE))","v":{"$error":"#REF!"}},{"$f":"IF(#REF!=\"\",0,VLOOKUP(#REF!,#REF!,2,FALSE))","v":{"$error":"#REF!"}},{"$f":"IF(#REF!=\"\",0,VLOOKUP(#REF!,#REF!,2,FALSE))","v":{"$error":"#REF!"}},"00","DPM",{"$f":"#REF!","v":{"$error":"#REF!"}},{"$f":"#REF!","v":{"$error":"#REF!"}},null,null,null,null,null,null,null,null,null,null,null,null,null,null,null,null,null,null,"-",{"$error":"#REF!"},null,52]
[{"$error":"#REF!"},{"$error":"#REF!"},2,{"$error":"#REF!"},{"$error":"#REF!"},{"$error":"#REF!"},{"$f":"IF(#REF!=\"\",0,VLOOKUP(#REF!,#REF!,2,FALSE))","v":{"$error":"#REF!"}},{"$f":"IF(#REF!=\"\",0,VLOOKUP(#REF!,#REF!,2,FALSE))","v":{"$error":"#REF!"}},{"$f":"IF(#REF!=\"\",0,VLOOKUP(#REF!,#REF!,2,FALSE))","v":{"$error":"#REF!"}},"00","DPM",{"$f":"#REF!","v":{"$error":"#REF!"}},{"$f":"#REF!","v":{"$error":"#REF!"}},null,null,null,null,null,null,null,null,null,null,null,null,null,null,null,null,null,null,"-",{"$error":"#REF!"},null,53]
[{"$error":"#REF!"},{"$error":"#REF!"},2,{"$error":"#REF!"},{"$error":"#REF!"},{"$error":"#REF!"},{"$f":"IF(#REF!=\"\",0,VLOOKUP(#REF!,#REF!,2,FALSE))","v":{"$error":"#REF!"}},{"$f":"IF(#REF!=\"\",0,VLOOKUP(#REF!,#REF!,2,FALSE))","v":{"$error":"#REF!"}},{"$f":"IF(#REF!=\"\",0,VLOOKUP(#REF!,#REF!,2,FALSE))","v":{"$error":"#REF!"}},"00","DPM",{"$f":"#REF!","v":{"$error":"#REF!"}},{"$f":"#REF!","v":{"$error":"#REF!"}},null,null,null,null,null,null,null,null,null,null,null,null,null,null,null,null,null,null,"-",{"$error":"#REF!"},null,54]
[{"$error":"#REF!"},{"$error":"#REF!"},2,{"$error":"#REF!"},{"$error":"#REF!"},{"$error":"#REF!"},{"$f":"IF(#REF!=\"\",0,VLOOKUP(#REF!,#REF!,2,FALSE))","v":{"$error":"#REF!"}},{"$f":"IF(#REF!=\"\",0,VLOOKUP(#REF!,#REF!,2,FALSE))","v":{"$error":"#REF!"}},{"$f":"IF(#REF!=\"\",0,VLOOKUP(#REF!,#REF!,2,FALSE))","v":{"$error":"#REF!"}},"00","DPM",{"$f":"#REF!","v":{"$error":"#REF!"}},{"$f":"#REF!","v":{"$error":"#REF!"}},null,null,null,null,null,null,null,null,null,null,null,null,null,null,null,null,null,null,"-",{"$error":"#REF!"},null,55]
[{"$error":"#REF!"},{"$error":"#REF!"},2,{"$error":"#REF!"},{"$error":"#REF!"},{"$error":"#REF!"},{"$f":"IF(#REF!=\"\",0,VLOOKUP(#REF!,#REF!,2,FALSE))","v":{"$error":"#REF!"}},{"$f":"IF(#REF!=\"\",0,VLOOKUP(#REF!,#REF!,2,FALSE))","v":{"$error":"#REF!"}},{"$f":"IF(#REF!=\"\",0,VLOOKUP(#REF!,#REF!,2,FALSE))","v":{"$error":"#REF!"}},"00","DPM",{"$f":"#REF!","v":{"$error":"#REF!"}},{"$f":"#REF!","v":{"$error":"#REF!"}},null,null,null,null,null,null,null,null,null,null,null,null,null,null,null,null,null,null,"-",{"$error":"#REF!"},null,56]
[{"$error":"#REF!"},{"$error":"#REF!"},2,{"$error":"#REF!"},{"$error":"#REF!"},{"$error":"#REF!"},{"$f":"IF(#REF!=\"\",0,VLOOKUP(#REF!,#REF!,2,FALSE))","v":{"$error":"#REF!"}},{"$f":"IF(#REF!=\"\",0,VLOOKUP(#REF!,#REF!,2,FALSE))","v":{"$error":"#REF!"}},{"$f":"IF(#REF!=\"\",0,VLOOKUP(#REF!,#REF!,2,FALSE))","v":{"$error":"#REF!"}},"00","DPM",{"$f":"#REF!","v":{"$error":"#REF!"}},{"$f":"#REF!","v":{"$error":"#REF!"}},null,null,null,null,null,null,null,null,null,null,null,null,null,null,null,null,null,null,"-",{"$error":"#REF!"},null,57]
[{"$error":"#REF!"},{"$error":"#REF!"},2,{"$error":"#REF!"},{"$error":"#REF!"},{"$error":"#REF!"},{"$f":"IF(#REF!=\"\",0,VLOOKUP(#REF!,#REF!,2,FALSE))","v":{"$error":"#REF!"}},{"$f":"IF(#REF!=\"\",0,VLOOKUP(#REF!,#REF!,2,FALSE))","v":{"$error":"#REF!"}},{"$f":"IF(#REF!=\"\",0,VLOOKUP(#REF!,#REF!,2,FALSE))","v":{"$error":"#REF!"}},"00","DPM",{"$f":"#REF!","v":{"$error":"#REF!"}},{"$f":"#REF!","v":{"$error":"#REF!"}},null,null,null,null,null,null,null,null,null,null,null,null,null,null,null,null,null,null,"-",{"$error":"#REF!"},null,58]
[{"$error":"#REF!"},{"$error":"#REF!"},2,{"$error":"#REF!"},{"$error":"#REF!"},{"$error":"#REF!"},{"$f":"IF(#REF!=\"\",0,VLOOKUP(#REF!,#REF!,2,FALSE))","v":{"$error":"#REF!"}},{"$f":"IF(#REF!=\"\",0,VLOOKUP(#REF!,#REF!,2,FALSE))","v":{"$error":"#REF!"}},{"$f":"IF(#REF!=\"\",0,VLOOKUP(#REF!,#REF!,2,FALSE))","v":{"$error":"#REF!"}},"00","DPM",{"$f":"#REF!","v":{"$error":"#REF!"}},{"$f":"#REF!","v":{"$error":"#REF!"}},null,null,null,null,null,null,null,null,null,null,null,null,null,null,null,null,null,null,"-",{"$error":"#REF!"},null,59]
[{"$error":"#REF!"},{"$error":"#REF!"},2,{"$error":"#REF!"},{"$error":"#REF!"},{"$error":"#REF!"},{"$f":"IF(#REF!=\"\",0,VLOOKUP(#REF!,#REF!,2,FALSE))","v":{"$error":"#REF!"}},{"$f":"IF(#REF!=\"\",0,VLOOKUP(#REF!,#REF!,2,FALSE))","v":{"$error":"#REF!"}},{"$f":"IF(#REF!=\"\",0,VLOOKUP(#REF!,#REF!,2,FALSE))","v":{"$error":"#REF!"}},"00","DPM",{"$f":"#REF!","v":{"$error":"#REF!"}},{"$f":"#REF!","v":{"$error":"#REF!"}},null,null,null,null,null,null,null,null,null,null,null,null,null,null,null,null,null,null,"-",{"$error":"#REF!"},null,60]
[{"$error":"#REF!"},{"$error":"#REF!"},2,{"$error":"#REF!"},{"$error":"#REF!"},{"$error":"#REF!"},{"$f":"IF(#REF!=\"\",0,VLOOKUP(#REF!,#REF!,2,FALSE))","v":{"$error":"#REF!"}},{"$f":"IF(#REF!=\"\",0,VLOOKUP(#REF!,#REF!,2,FALSE))","v":{"$error":"#REF!"}},{"$f":"IF(#REF!=\"\",0,VLOOKUP(#REF!,#REF!,2,FALSE))","v":{"$error":"#REF!"}},"00","DPM",{"$f":"#REF!","v":{"$error":"#REF!"}},{"$f":"#REF!","v":{"$error":"#REF!"}},null,null,null,null,null,null,null,null,null,null,null,null,null,null,null,null,null,null,"-",{"$error":"#REF!"},null,61]
[{"$error":"#REF!"},{"$error":"#REF!"},2,{"$error":"#REF!"},{"$error":"#REF!"},{"$error":"#REF!"},{"$f":"IF(#REF!=\"\",0,VLOOKUP(#REF!,#REF!,2,FALSE))","v":{"$error":"#REF!"}},{"$f":"IF(#REF!=\"\",0,VLOOKUP(#REF!,#REF!,2,FALSE))","v":{"$error":"#REF!"}},{"$f":"IF(#REF!=\"\",0,VLOOKUP(#REF!,#REF!,2,FALSE))","v":{"$error":"#REF!"}},"00","DPM",{"$f":"#REF!","v":{"$error":"#REF!"}},{"$f":"#REF!","v":{"$error":"#REF!"}},null,null,null,null,null,null,null,null,null,null,null,null,null,null,null,null,null,null,"-",{"$error":"#REF!"},null,62]
[{"$error":"#REF!"},{"$error":"#REF!"},2,{"$error":"#REF!"},{"$error":"#REF!"},{"$error":"#REF!"},{"$f":"IF(#REF!=\"\",0,VLOOKUP(#REF!,#REF!,2,FALSE))","v":{"$error":"#REF!"}},{"$f":"IF(#REF!=\"\",0,VLOOKUP(#REF!,#REF!,2,FALSE))","v":{"$error":"#REF!"}},{"$f":"IF(#REF!=\"\",0,VLOOKUP(#REF!,#REF!,2,FALSE))","v":{"$error":"#REF!"}},"00","DPM",{"$f":"#REF!","v":{"$error":"#REF!"}},{"$f":"#REF!","v":{"$error":"#REF!"}},null,null,null,null,null,null,null,null,null,null,null,null,null,null,null,null,null,null,"-",{"$error":"#REF!"},null,63]
[{"$error":"#REF!"},{"$error":"#REF!"},2,{"$error":"#REF!"},{"$error":"#REF!"},{"$error":"#REF!"},{"$f":"IF(#REF!=\"\",0,VLOOKUP(#REF!,#REF!,2,FALSE))","v":{"$error":"#REF!"}},{"$f":"IF(#REF!=\"\",0,VLOOKUP(#REF!,#REF!,2,FALSE))","v":{"$error":"#REF!"}},{"$f":"IF(#REF!=\"\",0,VLOOKUP(#REF!,#REF!,2,FALSE))","v":{"$error":"#REF!"}},"00","DPM",{"$f":"#REF!","v":{"$error":"#REF!"}},{"$f":"#REF!","v":{"$error":"#REF!"}},null,null,null,null,null,null,null,null,null,null,null,null,null,null,null,null,null,null,"-",{"$error":"#REF!"},null,64]
[{"$error":"#REF!"},{"$error":"#REF!"},2,{"$error":"#REF!"},{"$error":"#REF!"},{"$error":"#REF!"},{"$f":"IF(#REF!=\"\",0,VLOOKUP(#REF!,#REF!,2,FALSE))","v":{"$error":"#REF!"}},{"$f":"IF(#REF!=\"\",0,VLOOKUP(#REF!,#REF!,2,FALSE))","v":{"$error":"#REF!"}},{"$f":"IF(#REF!=\"\",0,VLOOKUP(#REF!,#REF!,2,FALSE))","v":{"$error":"#REF!"}},"00","DPM",{"$f":"#REF!","v":{"$error":"#REF!"}},{"$f":"#REF!","v":{"$error":"#REF!"}},null,null,null,null,null,null,null,null,null,null,null,null,null,null,null,null,null,null,"-",{"$error":"#REF!"},null,65]
[{"$error":"#REF!"},{"$error":"#REF!"},2,{"$error":"#REF!"},{"$error":"#REF!"},{"$error":"#REF!"},{"$f":"IF(#REF!=\"\",0,VLOOKUP(#REF!,#REF!,2,FALSE))","v":{"$error":"#REF!"}},{"$f":"IF(#REF!=\"\",0,VLOOKUP(#REF!,#REF!,2,FALSE))","v":{"$error":"#REF!"}},{"$f":"IF(#REF!=\"\",0,VLOOKUP(#REF!,#REF!,2,FALSE))","v":{"$error":"#REF!"}},"00","DPM",{"$f":"#REF!","v":{"$error":"#REF!"}},{"$f":"#REF!","v":{"$error":"#REF!"}},null,null,null,null,null,null,null,null,null,null,null,null,null,null,null,null,null,null,"-",{"$error":"#REF!"},null,66]
[{"$error":"#REF!"},{"$error":"#REF!"},2,{"$error":"#REF!"},{"$error":"#REF!"},{"$error":"#REF!"},{"$f":"IF(#REF!=\"\",0,VLOOKUP(#REF!,#REF!,2,FALSE))","v":{"$error":"#REF!"}},{"$f":"IF(#REF!=\"\",0,VLOOKUP(#REF!,#REF!,2,FALSE))","v":{"$error":"#REF!"}},{"$f":"IF(#REF!=\"\",0,VLOOKUP(#REF!,#REF!,2,FALSE))","v":{"$error":"#REF!"}},"00","DPM",{"$f":"#REF!","v":{"$error":"#REF!"}},{"$f":"#REF!","v":{"$error":"#REF!"}},null,null,null,null,null,null,null,null,null,null,null,null,null,null,null,null,null,null,"-",{"$error":"#REF!"},null,67]
[{"$error":"#REF!"},{"$error":"#REF!"},2,{"$error":"#REF!"},{"$error":"#REF!"},{"$error":"#REF!"},{"$f":"IF(#REF!=\"\",0,VLOOKUP(#REF!,#REF!,2,FALSE))","v":{"$error":"#REF!"}},{"$f":"IF(#REF!=\"\",0,VLOOKUP(#REF!,#REF!,2,FALSE))","v":{"$error":"#REF!"}},{"$f":"IF(#REF!=\"\",0,VLOOKUP(#REF!,#REF!,2,FALSE))","v":{"$error":"#REF!"}},"00","DPM",{"$f":"#REF!","v":{"$error":"#REF!"}},{"$f":"#REF!","v":{"$error":"#REF!"}},null,null,null,null,null,null,null,null,null,null,null,null,null,null,null,null,null,null,"-",{"$error":"#REF!"},null,68]
[{"$error":"#REF!"},{"$error":"#REF!"},2,{"$error":"#REF!"},{"$error":"#REF!"},{"$error":"#REF!"},{"$f":"IF(#REF!=\"\",0,VLOOKUP(#REF!,#REF!,2,FALSE))","v":{"$error":"#REF!"}},{"$f":"IF(#REF!=\"\",0,VLOOKUP(#REF!,#REF!,2,FALSE))","v":{"$error":"#REF!"}},{"$f":"IF(#REF!=\"\",0,VLOOKUP(#REF!,#REF!,2,FALSE))","v":{"$error":"#REF!"}},"00","DPM",{"$f":"#REF!","v":{"$error":"#REF!"}},{"$f":"#REF!","v":{"$error":"#REF!"}},null,null,null,null,null,null,null,null,null,null,null,null,null,null,null,null,null,null,"-",{"$error":"#REF!"},null,69]
[{"$error":"#REF!"},{"$error":"#REF!"},2,{"$error":"#REF!"},{"$error":"#REF!"},{"$error":"#REF!"},{"$f":"IF(#REF!=\"\",0,VLOOKUP(#REF!,#REF!,2,FALSE))","v":{"$error":"#REF!"}},{"$f":"IF(#REF!=\"\",0,VLOOKUP(#REF!,#REF!,2,FALSE))","v":{"$error":"#REF!"}},{"$f":"IF(#REF!=\"\",0,VLOOKUP(#REF!,#REF!,2,FALSE))","v":{"$error":"#REF!"}},"00","DPM",{"$f":"#REF!","v":{"$error":"#REF!"}},{"$f":"#REF!","v":{"$error":"#REF!"}},null,null,null,null,null,null,null,null,null,null,null,null,null,null,null,null,null,null,"-",{"$error":"#REF!"},null,70]
[{"$error":"#REF!"},{"$error":"#REF!"},2,{"$error":"#REF!"},{"$error":"#REF!"},{"$error":"#REF!"},{"$f":"IF(#REF!=\"\",0,VLOOKUP(#REF!,#REF!,2,FALSE))","v":{"$error":"#REF!"}},{"$f":"IF(#REF!=\"\",0,VLOOKUP(#REF!,#REF!,2,FALSE))","v":{"$error":"#REF!"}},{"$f":"IF(#REF!=\"\",0,VLOOKUP(#REF!,#REF!,2,FALSE))","v":{"$error":"#REF!"}},"00","DPM",{"$f":"#REF!","v":{"$error":"#REF!"}},{"$f":"#REF!","v":{"$error":"#REF!"}},null,null,null,null,null,null,null,null,null,null,null,null,null,null,null,null,null,null,"-",{"$error":"#REF!"},null,71]
[{"$error":"#REF!"},{"$error":"#REF!"},2,{"$error":"#REF!"},{"$error":"#REF!"},{"$error":"#REF!"},{"$f":"IF(#REF!=\"\",0,VLOOKUP(#REF!,#REF!,2,FALSE))","v":{"$error":"#REF!"}},{"$f":"IF(#REF!=\"\",0,VLOOKUP(#REF!,#REF!,2,FALSE))","v":{"$error":"#REF!"}},{"$f":"IF(#REF!=\"\",0,VLOOKUP(#REF!,#REF!,2,FALSE))","v":{"$error":"#REF!"}},"00","DPM",{"$f":"#REF!","v":{"$error":"#REF!"}},{"$f":"#REF!","v":{"$error":"#REF!"}},null,null,null,null,null,null,null,null,null,null,null,null,null,null,null,null,null,null,"-",{"$error":"#REF!"},null,72]
[{"$error":"#REF!"},{"$error":"#REF!"},2,{"$error":"#REF!"},{"$error":"#REF!"},{"$error":"#REF!"},{"$f":"IF(#REF!=\"\",0,VLOOKUP(#REF!,#REF!,2,FALSE))","v":{"$error":"#REF!"}},{"$f":"IF(#REF!=\"\",0,VLOOKUP(#REF!,#REF!,2,FALSE))","v":{"$error":"#REF!"}},{"$f":"IF(#REF!=\"\",0,VLOOKUP(#REF!,#REF!,2,FALSE))","v":{"$error":"#REF!"}},"00","DPM",{"$f":"#REF!","v":{"$error":"#REF!"}},{"$f":"#REF!","v":{"$error":"#REF!"}},null,null,null,null,null,null,null,null,null,null,null,null,null,null,null,null,null,null,"-",{"$f":"IF(OR(ABS(L130)>=0.55,ABS(M130)>=0.55,ABS(N130)>=0.55,ABS(O130)>=0.55,ABS(P130)>=0.55,ABS(Q130)>=0.55,ABS(R130)>=0.55,ABS(S130)>=0.55,ABS(T130)>=0.55,ABS(U130)>=0.55,ABS(V130)>=0.55,ABS(W130)>=0.55,ABS(X130)>=0.55,ABS(Y130)>=0.55,ABS(Z130)>=0.55,ABS(AA130)>=0.55,ABS(AB130)>=0.55,ABS(AC130)>=0.55,ABS(AD130)>=0.55,ABS(AE130)>=0.55),0,1)","v":{"$error":"#REF!"}},null,73]
[{"$f":"$A$2","v":{"$error":"#REF!"}},{"$f":"$B$2","v":{"$error":"#REF!"}},2,{"$f":"$D$2","v":{"$error":"#REF!"}},{"$f":"$E$2","v":{"$error":"#REF!"}},{"$f":"$F$2","v":{"$error":"#REF!"}},{"$f":"IF(#REF!=\"\",0,VLOOKUP(#REF!,#REF!,2,FALSE))","v":{"$error":"#REF!"}},{"$f":"IF(#REF!=\"\",0,VLOOKUP(#REF!,#REF!,2,FALSE))","v":{"$error":"#REF!"}},{"$f":"IF(#REF!=\"\",0,VLOOKUP(#REF!,#REF!,2,FALSE))","v":{"$error":"#REF!"}},"00","DPM",{"$f":"#REF!","v":{"$error":"#REF!"}},{"$f":"#REF!","v":{"$error":"#REF!"}},null,null,null,null,null,null,null,null,null,null,null,null,null,null,null,null,null,null,"-",{"$error":"#REF!"},null,74]
[{"$error":"#REF!"},{"$error":"#REF!"},2,{"$error":"#REF!"},{"$error":"#REF!"},{"$error":"#REF!"},{"$f":"IF(#REF!<>\"\",9990,0)","v":{"$error":"#REF!"}},{"$f":"IF(#REF!=\"\",0,VLOOKUP(#REF!,#REF!,2,FALSE))","v":{"$error":"#REF!"}},"#LK","00","DPM",{"$f":"#REF!","v":{"$error":"#REF!"}},{"$f":"#REF!","v":{"$error":"#REF!"}},null,null,null,null,null,null,null,null,null,null,null,null,null,null,null,null,null,null,{"$f":"IF(#REF!<>\"\",#REF!,\"-\")","v":{"$error":"#REF!"}},{"$error":"#REF!"},null,81]
[{"$error":"#REF!"},{"$error":"#REF!"},2,{"$error":"#REF!"},{"$error":"#REF!"},{"$error":"#REF!"},{"$f":"IF(#REF!<>\"\",9990,0)","v":{"$error":"#REF!"}},{"$f":"IF(#REF!=\"\",0,VLOOKUP(#REF!,#REF!,2,FALSE))","v":{"$error":"#REF!"}},"#LK","00","DPM",{"$f":"#REF!","v":{"$error":"#REF!"}},{"$f":"#REF!","v":{"$error":"#REF!"}},null,null,null,null,null,null,null,null,null,null,null,null,null,null,null,null,null,null,{"$f":"IF(#REF!<>\"\",#REF!,\"-\")","v":{"$error":"#REF!"}},{"$error":"#REF!"},null,82]
[{"$error":"#REF!"},{"$error":"#REF!"},2,{"$error":"#REF!"},{"$error":"#REF!"},{"$error":"#REF!"},{"$f":"IF(#REF!<>\"\",9990,0)","v":{"$error":"#REF!"}},{"$f":"IF(#REF!=\"\",0,VLOOKUP(#REF!,#REF!,2,FALSE))","v":{"$error":"#REF!"}},"#LK","00","DPM",{"$f":"#REF!","v":{"$error":"#REF!"}},{"$f":"#REF!","v":{"$error":"#REF!"}},null,null,null,null,null,null,null,null,null,null,null,null,null,null,null,null,null,null,{"$f":"IF(#REF!<>\"\",#REF!,\"-\")","v":{"$error":"#REF!"}},{"$error":"#REF!"},null,83]
[{"$error":"#REF!"},{"$error":"#REF!"},2,{"$error":"#REF!"},{"$error":"#REF!"},{"$error":"#REF!"},{"$f":"IF(#REF!<>\"\",9990,0)","v":{"$error":"#REF!"}},{"$f":"IF(#REF!=\"\",0,VLOOKUP(#REF!,#REF!,2,FALSE))","v":{"$error":"#REF!"}},"#LK","00","DPM",{"$f":"#REF!","v":{"$error":"#REF!"}},{"$f":"#REF!","v":{"$error":"#REF!"}},null,null,null,null,null,null,null,null,null,null,null,null,null,null,null,null,null,null,{"$f":"IF(#REF!<>\"\",#REF!,\"-\")","v":{"$error":"#REF!"}},{"$error":"#REF!"},null,84]
[{"$error":"#REF!"},{"$error":"#REF!"},2,{"$error":"#REF!"},{"$error":"#REF!"},{"$error":"#REF!"},{"$f":"IF(#REF!<>\"\",9990,0)","v":{"$error":"#REF!"}},{"$f":"IF(#REF!=\"\",0,VLOOKUP(#REF!,#REF!,2,FALSE))","v":{"$error":"#REF!"}},"#LK","00","DPM",{"$f":"#REF!","v":{"$error":"#REF!"}},{"$f":"#REF!","v":{"$error":"#REF!"}},null,null,null,null,null,null,null,null,null,null,null,null,null,null,null,null,null,null,{"$f":"IF(#REF!<>\"\",#REF!,\"-\")","v":{"$error":"#REF!"}},{"$error":"#REF!"},null,85]
[{"$error":"#REF!"},{"$error":"#REF!"},2,{"$error":"#REF!"},{"$error":"#REF!"},{"$error":"#REF!"},{"$f":"IF(#REF!<>\"\",9990,0)","v":{"$error":"#REF!"}},{"$f":"IF(#REF!=\"\",0,VLOOKUP(#REF!,#REF!,2,FALSE))","v":{"$error":"#REF!"}},"#LK","00","DPM",{"$f":"#REF!","v":{"$error":"#REF!"}},{"$f":"#REF!","v":{"$error":"#REF!"}},null,null,null,null,null,null,null,null,null,null,null,null,null,null,null,null,null,null,{"$f":"IF(#REF!<>\"\",#REF!,\"-\")","v":{"$error":"#REF!"}},{"$error":"#REF!"},null,86]
[{"$error":"#REF!"},{"$error":"#REF!"},2,{"$error":"#REF!"},{"$error":"#REF!"},{"$error":"#REF!"},{"$f":"IF(#REF!<>\"\",9990,0)","v":{"$error":"#REF!"}},{"$f":"IF(#REF!=\"\",0,VLOOKUP(#REF!,#REF!,2,FALSE))","v":{"$error":"#REF!"}},"#LK","00","DPM",{"$f":"#REF!","v":{"$error":"#REF!"}},{"$f":"#REF!","v":{"$error":"#REF!"}},null,null,null,null,null,null,null,null,null,null,null,null,null,null,null,null,null,null,{"$f":"IF(#REF!<>\"\",#REF!,\"-\")","v":{"$error":"#REF!"}},{"$error":"#REF!"},null,87]
[{"$error":"#REF!"},{"$error":"#REF!"},2,{"$error":"#REF!"},{"$error":"#REF!"},{"$error":"#REF!"},{"$f":"IF(#REF!<>\"\",9990,0)","v":{"$error":"#REF!"}},{"$f":"IF(#REF!=\"\",0,VLOOKUP(#REF!,#REF!,2,FALSE))","v":{"$error":"#REF!"}},"#LK","00","DPM",{"$f":"#REF!","v":{"$error":"#REF!"}},{"$f":"#REF!","v":{"$error":"#REF!"}},null,null,null,null,null,null,null,null,null,null,null,null,null,null,null,null,null,null,{"$f":"IF(#REF!<>\"\",#REF!,\"-\")","v":{"$error":"#REF!"}},{"$error":"#REF!"},null,88]
[{"$error":"#REF!"},{"$error":"#REF!"},2,{"$error":"#REF!"},{"$error":"#REF!"},{"$error":"#REF!"},{"$f":"IF(#REF!<>\"\",9990,0)","v":{"$error":"#REF!"}},{"$f":"IF(#REF!=\"\",0,VLOOKUP(#REF!,#REF!,2,FALSE))","v":{"$error":"#REF!"}},"#LK","00","DPM",{"$f":"#REF!","v":{"$error":"#REF!"}},{"$f":"#REF!","v":{"$error":"#REF!"}},null,null,null,null,null,null,null,null,null,null,null,null,null,null,null,null,null,null,{"$f":"IF(#REF!<>\"\",#REF!,\"-\")","v":{"$error":"#REF!"}},{"$error":"#REF!"},null,89]
[{"$error":"#REF!"},{"$error":"#REF!"},2,{"$error":"#REF!"},{"$error":"#REF!"},{"$error":"#REF!"},{"$f":"IF(#REF!<>\"\",9990,0)","v":{"$error":"#REF!"}},{"$f":"IF(#REF!=\"\",0,VLOOKUP(#REF!,#REF!,2,FALSE))","v":{"$error":"#REF!"}},"#LK","00","DPM",{"$f":"#REF!","v":{"$error":"#REF!"}},{"$f":"#REF!","v":{"$error":"#REF!"}},null,null,null,null,null,null,null,null,null,null,null,null,null,null,null,null,null,null,{"$f":"IF(#REF!<>\"\",#REF!,\"-\")","v":{"$error":"#REF!"}},{"$error":"#REF!"},null,90]
[{"$error":"#REF!"},{"$error":"#REF!"},3,{"$error":"#REF!"},{"$error":"#REF!"},{"$error":"#REF!"},{"$f":"IF(#REF!=\"\",0,VLOOKUP(#REF!,#REF!,2,FALSE))","v":{"$error":"#REF!"}},{"$f":"IF(#REF!=\"\",0,VLOOKUP(#REF!,#REF!,2,FALSE))","v":{"$error":"#REF!"}},{"$f":"IF(#REF!=\"\",0,VLOOKUP(#REF!,#REF!,2,FALSE))","v":{"$error":"#REF!"}},"00","DPM",{"$f":"#REF!","v":{"$error":"#REF!"}},{"$f":"#REF!","v":{"$error":"#REF!"}},{"$f":"#REF!","v":{"$error":"#REF!"}},{"$f":"#REF!","v":{"$error":"#REF!"}},null,null,{"$f":"#REF!","v":{"$error":"#REF!"}},{"$f":"IF(G142=1112,#REF!*L142/(SUMIF($G$142:$G$190,1112,$L$142:$L$190)+SUMIF($G$201:$G$240,1112,$L$201:$L$240)),0)","v":{"$error":"#REF!"}},{"$f":"IF(OR(G142=1111,G142=2729),#REF!*L142/(SUMIF($G$142:$G$190,2729,$L$142:$L$190)+SUMIF($G$201:$G$240,2729,$L$201:$L$240)+SUMIF($G$142:$G$190,1111,$L$142:$L$190)+SUMIF($G$201:$G$240,1111,$L$201:$L$240)),0)","v":{"$error":"#REF!"}},null,null,null,null,null,null,null,null,null,null,null,"-",{"$error":"#REF!"},"Sheet 19 Non SBS Nominee'!F13 / G13 / H13 / I13 / J13 / ",13]
[{"$error":"#REF!"},{"$error":"#REF!"},3,{"$error":"#REF!"},{"$error":"#REF!"},{"$error":"#REF!"},{"$f":"IF(#REF!=\"\",0,VLOOKUP(#REF!,#REF!,2,FALSE))","v":{"$error":"#REF!"}},{"$f":"IF(#REF!=\"\",0,VLOOKUP(#REF!,#REF!,2,FALSE))","v":{"$error":"#REF!"}},{"$f":"IF(#REF!=\"\",0,VLOOKUP(#REF!,#REF!,2,FALSE))","v":{"$error":"#REF!"}},"00","DPM",{"$f":"#REF!","v":{"$error":"#REF!"}},{"$f":"#REF!","v":{"$error":"#REF!"}},{"$f":"#REF!","v":{"$error":"#REF!"}},{"$f":"#REF!","v":{"$error":"#REF!"}},null,null,{"$f":"#REF!","v":{"$error":"#REF!"}},{"$f":"IF(G143=1112,#REF!*L143/(SUMIF($G$142:$G$190,1112,$L$142:$L$190)+SUMIF($G$201:$G$240,1112,$L$201:$L$240)),0)","v":{"$error":"#REF!"}},{"$f":"IF(OR(G143=1111,G143=2729),#REF!*L143/(SUMIF($G$142:$G$190,2729,$L$142:$L$190)+SUMIF($G$201:$G$240,2729,$L$201:$L$240)+SUMIF($G$142:$G$190,1111,$L$142:$L$190)+SUMIF($G$201:$G$240,1111,$L$201:$L$240)),0)","v":{"$error":"#REF!"}},null,null,null,null,null,null,null,null,null,null,null,"-",{"$error":"#REF!"},"       Sheet 24 Income & services'!$E$15 / 'Sheet 24 Income & services'!$E$16",14]
[{"$error":"#REF!"},{"$error":"#REF!"},3,{"$error":"#REF!"},{"$error":"#REF!"},{"$error":"#REF!"},{"$f":"IF(#REF!=\"\",0,VLOOKUP(#REF!,#REF!,2,FALSE))","v":{"$error":"#REF!"}},{"$f":"IF(#REF!=\"\",0,VLOOKUP(#REF!,#REF!,2,FALSE))","v":{"$error":"#REF!"}},{"$f":"IF(#REF!=\"\",0,VLOOKUP(#REF!,#REF!,2,FALSE))","v":{"$error":"#REF!"}},"00","DPM",{"$f":"#REF!","v":{"$error":"#REF!"}},{"$f":"#REF!","v":{"$error":"#REF!"}},{"$f":"#REF!","v":{"$error":"#REF!"}},{"$f":"#REF!","v":{"$error":"#REF!"}},null,null,{"$f":"#REF!","v":{"$error":"#REF!"}},{"$f":"IF(G144=1112,#REF!*L144/(SUMIF($G$142:$G$190,1112,$L$142:$L$190)+SUMIF($G$201:$G$240,1112,$L$201:$L$240)),0)","v":{"$error":"#REF!"}},{"$f":"IF(OR(G144=1111,G144=2729),#REF!*L144/(SUMIF($G$142:$G$190,2729,$L$142:$L$190)+SUMIF($G$201:$G$240,2729,$L$201:$L$240)+SUMIF($G$142:$G$190,1111,$L$142:$L$190)+SUMIF($G$201:$G$240,1111,$L$201:$L$240)),0)","v":{"$error":"#REF!"}},null,null,null,null,null,null,null,null,null,null,null,"-",{"$error":"#REF!"},"Column S = INT, column T = DIV",15]
[{"$error":"#REF!"},{"$error":"#REF!"},3,{"$error":"#REF!"},{"$error":"#REF!"},{"$error":"#REF!"},{"$f":"IF(#REF!=\"\",0,VLOOKUP(#REF!,#REF!,2,FALSE))","v":{"$error":"#REF!"}},{"$f":"IF(#REF!=\"\",0,VLOOKUP(#REF!,#REF!,2,FALSE))","v":{"$error":"#REF!"}},{"$f":"IF(#REF!=\"\",0,VLOOKUP(#REF!,#REF!,2,FALSE))","v":{"$error":"#REF!"}},"00","DPM",{"$f":"#REF!","v":{"$error":"#REF!"}},{"$f":"#REF!","v":{"$error":"#REF!"}},{"$f":"#REF!","v":{"$error":"#REF!"}},{"$f":"#REF!","v":{"$error":"#REF!"}},null,null,{"$f":"#REF!","v":{"$error":"#REF!"}},{"$f":"IF(G145=1112,#REF!*L145/(SUMIF($G$142:$G$190,1112,$L$142:$L$190)+SUMIF($G$201:$G$240,1112,$L$201:$L$240)),0)","v":{"$error":"#REF!"}},{"$f":"IF(OR(G145=1111,G145=2729),#REF!*L145/(SUMIF($G$142:$G$190,2729,$L$142:$L$190)+SUMIF($G$201:$G$240,2729,$L$201:$L$240)+SUMIF($G$142:$G$190,1111,$L$142:$L$190)+SUMIF($G$201:$G$240,1111,$L$201:$L$240)),0)","v":{"$error":"#REF!"}},null,null,null,null,null,null,null,null,null,null,null,"-",{"$error":"#REF!"},null,16]
[{"$error":"#REF!"},{"$error":"#REF!"},3,{"$error":"#REF!"},{"$error":"#REF!"},{"$error":"#REF!"},{"$f":"IF(#REF!=\"\",0,VLOOKUP(#REF!,#REF!,2,FALSE))","v":{"$error":"#REF!"}},{"$f":"IF(#REF!=\"\",0,VLOOKUP(#REF!,#REF!,2,FALSE))","v":{"$error":"#REF!"}},{"$f":"IF(#REF!=\"\",0,VLOOKUP(#REF!,#REF!,2,FALSE))","v":{"$error":"#REF!"}},"00","DPM",{"$f":"#REF!","v":{"$error":"#REF!"}},{"$f":"#REF!","v":{"$error":"#REF!"}},{"$f":"#REF!","v":{"$error":"#REF!"}},{"$f":"#REF!","v":{"$error":"#REF!"}},null,null,{"$f":"#REF!","v":{"$error":"#REF!"}},{"$f":"IF(G146=1112,#REF!*L146/(SUMIF($G$142:$G$190,1112,$L$142:$L$190)+SUMIF($G$201:$G$240,1112,$L$201:$L$240)),0)","v":{"$error":"#REF!"}},{"$f":"IF(OR(G146=1111,G146=2729),#REF!*L146/(SUMIF($G$142:$G$190,2729,$L$142:$L$190)+SUMIF($G$201:$G$240,2729,$L$201:$L$240)+SUMIF($G$142:$G$190,1111,$L$142:$L$190)+SUMIF($G$201:$G$240,1111,$L$201:$L$240)),0)","v":{"$error":"#REF!"}},null,null,null,null,null,null,null,null,null,null,null,"-",{"$error":"#REF!"},null,17]
[{"$error":"#REF!"},{"$error":"#REF!"},3,{"$error":"#REF!"},{"$error":"#REF!"},{"$error":"#REF!"},{"$f":"IF(#REF!=\"\",0,VLOOKUP(#REF!,#REF!,2,FALSE))","v":{"$error":"#REF!"}},{"$f":"IF(#REF!=\"\",0,VLOOKUP(#REF!,#REF!,2,FALSE))","v":{"$error":"#REF!"}},{"$f":"IF(#REF!=\"\",0,VLOOKUP(#REF!,#REF!,2,FALSE))","v":{"$error":"#REF!"}},"00","DPM",{"$f":"#REF!","v":{"$error":"#REF!"}},{"$f":"#REF!","v":{"$error":"#REF!"}},{"$f":"#REF!","v":{"$error":"#REF!"}},{"$f":"#REF!","v":{"$error":"#REF!"}},null,null,{"$f":"#REF!","v":{"$error":"#REF!"}},{"$f":"IF(G147=1112,#REF!*L147/(SUMIF($G$142:$G$190,1112,$L$142:$L$190)+SUMIF($G$201:$G$240,1112,$L$201:$L$240)),0)","v":{"$error":"#REF!"}},{"$f":"IF(OR(G147=1111,G147=2729),#REF!*L147/(SUMIF($G$142:$G$190,2729,$L$142:$L$190)+SUMIF($G$201:$G$240,2729,$L$201:$L$240)+SUMIF($G$142:$G$190,1111,$L$142:$L$190)+SUMIF($G$201:$G$240,1111,$L$201:$L$240)),0)","v":{"$error":"#REF!"}},null,null,null,null,null,null,null,null,null,null,null,"-",{"$error":"#REF!"},null,18]
[{"$error":"#REF!"},{"$error":"#REF!"},3,{"$error":"#REF!"},{"$error":"#REF!"},{"$error":"#REF!"},{"$f":"IF(#REF!=\"\",0,VLOOKUP(#REF!,#REF!,2,FALSE))","v":{"$error":"#REF!"}},{"$f":"IF(#REF!=\"\",0,VLOOKUP(#REF!,#REF!,2,FALSE))","v":{"$error":"#REF!"}},{"$f":"IF(#REF!=\"\",0,VLOOKUP(#REF!,#REF!,2,FALSE))","v":{"$error":"#REF!"}},"00","DPM",{"$f":"#REF!","v":{"$error":"#REF!"}},{"$f":"#REF!","v":{"$error":"#REF!"}},{"$f":"#REF!","v":{"$error":"#REF!"}},{"$f":"#REF!","v":{"$error":"#REF!"}},null,null,{"$f":"#REF!","v":{"$error":"#REF!"}},{"$f":"IF(G148=1112,#REF!*L148/(SUMIF($G$142:$G$190,1112,$L$142:$L$190)+SUMIF($G$201:$G$240,1112,$L$201:$L$240)),0)","v":{"$error":"#REF!"}},{"$f":"IF(OR(G148=1111,G148=2729),#REF!*L148/(SUMIF($G$142:$G$190,2729,$L$142:$L$190)+SUMIF($G$201:$G$240,2729,$L$201:$L$240)+SUMIF($G$142:$G$190,1111,$L$142:$L$190)+SUMIF($G$201:$G$240,1111,$L$201:$L$240)),0)","v":{"$error":"#REF!"}},null,null,null,null,null,null,null,null,null,null,null,"-",{"$error":"#REF!"},null,19]
[{"$error":"#REF!"},{"$error":"#REF!"},3,{"$error":"#REF!"},{"$error":"#REF!"},{"$error":"#REF!"},{"$f":"IF(#REF!=\"\",0,VLOOKUP(#REF!,#REF!,2,FALSE))","v":{"$error":"#REF!"}},{"$f":"IF(#REF!=\"\",0,VLOOKUP(#REF!,#REF!,2,FALSE))","v":{"$error":"#REF!"}},{"$f":"IF(#REF!=\"\",0,VLOOKUP(#REF!,#REF!,2,FALSE))","v":{"$error":"#REF!"}},"00","DPM",{"$f":"#REF!","v":{"$error":"#REF!"}},{"$f":"#REF!","v":{"$error":"#REF!"}},{"$f":"#REF!","v":{"$error":"#REF!"}},{"$f":"#REF!","v":{"$error":"#REF!"}},null,null,{"$f":"#REF!","v":{"$error":"#REF!"}},{"$f":"IF(G149=1112,#REF!*L149/(SUMIF($G$142:$G$190,1112,$L$142:$L$190)+SUMIF($G$201:$G$240,1112,$L$201:$L$240)),0)","v":{"$error":"#REF!"}},{"$f":"IF(OR(G149=1111,G149=2729),#REF!*L149/(SUMIF($G$142:$G$190,2729,$L$142:$L$190)+SUMIF($G$201:$G$240,2729,$L$201:$L$240)+SUMIF($G$142:$G$190,1111,$L$142:$L$190)+SUMIF($G$201:$G$240,1111,$L$201:$L$240)),0)","v":{"$error":"#REF!"}},null,null,null,null,null,null,null,null,null,null,null,"-",{"$error":"#REF!"},null,20]
[{"$error":"#REF!"},{"$error":"#REF!"},3,{"$error":"#REF!"},{"$error":"#REF!"},{"$error":"#REF!"},{"$f":"IF(#REF!=\"\",0,VLOOKUP(#REF!,#REF!,2,FALSE))","v":{"$error":"#REF!"}},{"$f":"IF(#REF!=\"\",0,VLOOKUP(#REF!,#REF!,2,FALSE))","v":{"$error":"#REF!"}},{"$f":"IF(#REF!=\"\",0,VLOOKUP(#REF!,#REF!,2,FALSE))","v":{"$error":"#REF!"}},"00","DPM",{"$f":"#REF!","v":{"$error":"#REF!"}},{"$f":"#REF!","v":{"$error":"#REF!"}},{"$f":"#REF!","v":{"$error":"#REF!"}},{"$f":"#REF!","v":{"$error":"#REF!"}},null,null,{"$f":"#REF!","v":{"$error":"#REF!"}},{"$f":"IF(G150=1112,#REF!*L150/(SUMIF($G$142:$G$190,1112,$L$142:$L$190)+SUMIF($G$201:$G$240,1112,$L$201:$L$240)),0)","v":{"$error":"#REF!"}},{"$f":"IF(OR(G150=1111,G150=2729),#REF!*L150/(SUMIF($G$142:$G$190,2729,$L$142:$L$190)+SUMIF($G$201:$G$240,2729,$L$201:$L$240)+SUMIF($G$142:$G$190,1111,$L$142:$L$190)+SUMIF($G$201:$G$240,1111,$L$201:$L$240)),0)","v":{"$error":"#REF!"}},null,null,null,null,null,null,null,null,null,null,null,"-",{"$error":"#REF!"},null,21]
[{"$error":"#REF!"},{"$error":"#REF!"},3,{"$error":"#REF!"},{"$error":"#REF!"},{"$error":"#REF!"},{"$f":"IF(#REF!=\"\",0,VLOOKUP(#REF!,#REF!,2,FALSE))","v":{"$error":"#REF!"}},{"$f":"IF(#REF!=\"\",0,VLOOKUP(#REF!,#REF!,2,FALSE))","v":{"$error":"#REF!"}},{"$f":"IF(#REF!=\"\",0,VLOOKUP(#REF!,#REF!,2,FALSE))","v":{"$error":"#REF!"}},"00","DPM",{"$f":"#REF!","v":{"$error":"#REF!"}},{"$f":"#REF!","v":{"$error":"#REF!"}},{"$f":"#REF!","v":{"$error":"#REF!"}},{"$f":"#REF!","v":{"$error":"#REF!"}},null,null,{"$f":"#REF!","v":{"$error":"#REF!"}},{"$f":"IF(G151=1112,#REF!*L151/(SUMIF($G$142:$G$190,1112,$L$142:$L$190)+SUMIF($G$201:$G$240,1112,$L$201:$L$240)),0)","v":{"$error":"#REF!"}},{"$f":"IF(OR(G151=1111,G151=2729),#REF!*L151/(SUMIF($G$142:$G$190,2729,$L$142:$L$190)+SUMIF($G$201:$G$240,2729,$L$201:$L$240)+SUMIF($G$142:$G$190,1111,$L$142:$L$190)+SUMIF($G$201:$G$240,1111,$L$201:$L$240)),0)","v":{"$error":"#REF!"}},null,null,null,null,null,null,null,null,null,null,null,"-",{"$error":"#REF!"},null,22]
[{"$error":"#REF!"},{"$error":"#REF!"},3,{"$error":"#REF!"},{"$error":"#REF!"},{"$error":"#REF!"},{"$f":"IF(#REF!=\"\",0,VLOOKUP(#REF!,#REF!,2,FALSE))","v":{"$error":"#REF!"}},{"$f":"IF(#REF!=\"\",0,VLOOKUP(#REF!,#REF!,2,FALSE))","v":{"$error":"#REF!"}},{"$f":"IF(#REF!=\"\",0,VLOOKUP(#REF!,#REF!,2,FALSE))","v":{"$error":"#REF!"}},"00","DPM",{"$f":"#REF!","v":{"$error":"#REF!"}},{"$f":"#REF!","v":{"$error":"#REF!"}},{"$f":"#REF!","v":{"$error":"#REF!"}},{"$f":"#REF!","v":{"$error":"#REF!"}},null,null,{"$f":"#REF!","v":{"$error":"#REF!"}},{"$f":"IF(G152=1112,#REF!*L152/(SUMIF($G$142:$G$190,1112,$L$142:$L$190)+SUMIF($G$201:$G$240,1112,$L$201:$L$240)),0)","v":{"$error":"#REF!"}},{"$f":"IF(OR(G152=1111,G152=2729),#REF!*L152/(SUMIF($G$142:$G$190,2729,$L$142:$L$190)+SUMIF($G$201:$G$240,2729,$L$201:$L$240)+SUMIF($G$142:$G$190,1111,$L$142:$L$190)+SUMIF($G$201:$G$240,1111,$L$201:$L$240)),0)","v":{"$error":"#REF!"}},null,null,null,null,null,null,null,null,null,null,null,"-",{"$error":"#REF!"},null,23]
[{"$error":"#REF!"},{"$error":"#REF!"},3,{"$error":"#REF!"},{"$error":"#REF!"},{"$error":"#REF!"},{"$f":"IF(#REF!=\"\",0,VLOOKUP(#REF!,#REF!,2,FALSE))","v":{"$error":"#REF!"}},{"$f":"IF(#REF!=\"\",0,VLOOKUP(#REF!,#REF!,2,FALSE))","v":{"$error":"#REF!"}},{"$f":"IF(#REF!=\"\",0,VLOOKUP(#REF!,#REF!,2,FALSE))","v":{"$error":"#REF!"}},"00","DPM",{"$f":"#REF!","v":{"$error":"#REF!"}},{"$f":"#REF!","v":{"$error":"#REF!"}},{"$f":"#REF!","v":{"$error":"#REF!"}},{"$f":"#REF!","v":{"$error":"#REF!"}},null,null,{"$f":"#REF!","v":{"$error":"#REF!"}},{"$f":"IF(G153=1112,#REF!*L153/(SUMIF($G$142:$G$190,1112,$L$142:$L$190)+SUMIF($G$201:$G$240,1112,$L$201:$L$240)),0)","v":{"$error":"#REF!"}},{"$f":"IF(OR(G153=1111,G153=2729),#REF!*L153/(SUMIF($G$142:$G$190,2729,$L$142:$L$190)+SUMIF($G$201:$G$240,2729,$L$201:$L$240)+SUMIF($G$142:$G$190,1111,$L$142:$L$190)+SUMIF($G$201:$G$240,1111,$L$201:$L$240)),0)","v":{"$error":"#REF!"}},null,null,null,null,null,null,null,null,null,null,null,"-",{"$error":"#REF!"},null,24]
[{"$error":"#REF!"},{"$error":"#REF!"},3,{"$error":"#REF!"},{"$error":"#REF!"},{"$error":"#REF!"},{"$f":"IF(#REF!=\"\",0,VLOOKUP(#REF!,#REF!,2,FALSE))","v":{"$error":"#REF!"}},{"$f":"IF(#REF!=\"\",0,VLOOKUP(#REF!,#REF!,2,FALSE))","v":{"$error":"#REF!"}},{"$f":"IF(#REF!=\"\",0,VLOOKUP(#REF!,#REF!,2,FALSE))","v":{"$error":"#REF!"}},"00","DPM",{"$f":"#REF!","v":{"$error":"#REF!"}},{"$f":"#REF!","v":{"$error":"#REF!"}},{"$f":"#REF!","v":{"$error":"#REF!"}},{"$f":"#REF!","v":{"$error":"#REF!"}},null,null,{"$f":"#REF!","v":{"$error":"#REF!"}},{"$f":"IF(G154=1112,#REF!*L154/(SUMIF($G$142:$G$190,1112,$L$142:$L$190)+SUMIF($G$201:$G$240,1112,$L$201:$L$240)),0)","v":{"$error":"#REF!"}},{"$f":"IF(OR(G154=1111,G154=2729),#REF!*L154/(SUMIF($G$142:$G$190,2729,$L$142:$L$190)+SUMIF($G$201:$G$240,2729,$L$201:$L$240)+SUMIF($G$142:$G$190,1111,$L$142:$L$190)+SUMIF($G$201:$G$240,1111,$L$201:$L$240)),0)","v":{"$error":"#REF!"}},null,null,null,null,null,null,null,null,null,null,null,"-",{"$error":"#REF!"},null,25]
[{"$error":"#REF!"},{"$error":"#REF!"},3,{"$error":"#REF!"},{"$error":"#REF!"},{"$error":"#REF!"},{"$f":"IF(#REF!=\"\",0,VLOOKUP(#REF!,#REF!,2,FALSE))","v":{"$error":"#REF!"}},{"$f":"IF(#REF!=\"\",0,VLOOKUP(#REF!,#REF!,2,FALSE))","v":{"$error":"#REF!"}},{"$f":"IF(#REF!=\"\",0,VLOOKUP(#REF!,#REF!,2,FALSE))","v":{"$error":"#REF!"}},"00","DPM",{"$f":"#REF!","v":{"$error":"#REF!"}},{"$f":"#REF!","v":{"$error":"#REF!"}},{"$f":"#REF!","v":{"$error":"#REF!"}},{"$f":"#REF!","v":{"$error":"#REF!"}},null,null,{"$f":"#REF!","v":{"$error":"#REF!"}},{"$f":"IF(G155=1112,#REF!*L155/(SUMIF($G$142:$G$190,1112,$L$142:$L$190)+SUMIF($G$201:$G$240,1112,$L$201:$L$240)),0)","v":{"$error":"#REF!"}},{"$f":"IF(OR(G155=1111,G155=2729),#REF!*L155/(SUMIF($G$142:$G$190,2729,$L$142:$L$190)+SUMIF($G$201:$G$240,2729,$L$201:$L$240)+SUMIF($G$142:$G$190,1111,$L$142:$L$190)+SUMIF($G$201:$G$240,1111,$L$201:$L$240)),0)","v":{"$error":"#REF!"}},null,null,null,null,null,null,null,null,null,null,null,"-",{"$error":"#REF!"},null,26]
[{"$error":"#REF!"},{"$error":"#REF!"},3,{"$error":"#REF!"},{"$error":"#REF!"},{"$error":"#REF!"},{"$f":"IF(#REF!=\"\",0,VLOOKUP(#REF!,#REF!,2,FALSE))","v":{"$error":"#REF!"}},{"$f":"IF(#REF!=\"\",0,VLOOKUP(#REF!,#REF!,2,FALSE))","v":{"$error":"#REF!"}},{"$f":"IF(#REF!=\"\",0,VLOOKUP(#REF!,#REF!,2,FALSE))","v":{"$error":"#REF!"}},"00","DPM",{"$f":"#REF!","v":{"$error":"#REF!"}},{"$f":"#REF!","v":{"$error":"#REF!"}},{"$f":"#REF!","v":{"$error":"#REF!"}},{"$f":"#REF!","v":{"$error":"#REF!"}},null,null,{"$f":"#REF!","v":{"$error":"#REF!"}},{"$f":"IF(G156=1112,#REF!*L156/(SUMIF($G$142:$G$190,1112,$L$142:$L$190)+SUMIF($G$201:$G$240,1112,$L$201:$L$240)),0)","v":{"$error":"#REF!"}},{"$f":"IF(OR(G156=1111,G156=2729),#REF!*L156/(SUMIF($G$142:$G$190,2729,$L$142:$L$190)+SUMIF($G$201:$G$240,2729,$L$201:$L$240)+SUMIF($G$142:$G$190,1111,$L$142:$L$190)+SUMIF($G$201:$G$240,1111,$L$201:$L$240)),0)","v":{"$error":"#REF!"}},null,null,null,null,null,null,null,null,null,null,null,"-",{"$error":"#REF!"},null,27]
[{"$error":"#REF!"},{"$error":"#REF!"},3,{"$error":"#REF!"},{"$error":"#REF!"},{"$error":"#REF!"},{"$f":"IF(#REF!=\"\",0,VLOOKUP(#REF!,#REF!,2,FALSE))","v":{"$error":"#REF!"}},{"$f":"IF(#REF!=\"\",0,VLOOKUP(#REF!,#REF!,2,FALSE))","v":{"$error":"#REF!"}},{"$f":"IF(#REF!=\"\",0,VLOOKUP(#REF!,#REF!,2,FALSE))","v":{"$error":"#REF!"}},"00","DPM",{"$f":"#REF!","v":{"$error":"#REF!"}},{"$f":"#REF!","v":{"$error":"#REF!"}},{"$f":"#REF!","v":{"$error":"#REF!"}},{"$f":"#REF!","v":{"$error":"#REF!"}},null,null,{"$f":"#REF!","v":{"$error":"#REF!"}},{"$f":"IF(G157=1112,#REF!*L157/(SUMIF($G$142:$G$190,1112,$L$142:$L$190)+SUMIF($G$201:$G$240,1112,$L$201:$L$240)),0)","v":{"$error":"#REF!"}},{"$f":"IF(OR(G157=1111,G157=2729),#REF!*L157/(SUMIF($G$142:$G$190,2729,$L$142:$L$190)+SUMIF($G$201:$G$240,2729,$L$201:$L$240)+SUMIF($G$142:$G$190,1111,$L$142:$L$190)+SUMIF($G$201:$G$240,1111,$L$201:$L$240)),0)","v":{"$error":"#REF!"}},null,null,null,null,null,null,null,null,null,null,null,"-",{"$error":"#REF!"},null,28]
[{"$error":"#REF!"},{"$error":"#REF!"},3,{"$error":"#REF!"},{"$error":"#REF!"},{"$error":"#REF!"},{"$f":"IF(#REF!=\"\",0,VLOOKUP(#REF!,#REF!,2,FALSE))","v":{"$error":"#REF!"}},{"$f":"IF(#REF!=\"\",0,VLOOKUP(#REF!,#REF!,2,FALSE))","v":{"$error":"#REF!"}},{"$f":"IF(#REF!=\"\",0,VLOOKUP(#REF!,#REF!,2,FALSE))","v":{"$error":"#REF!"}},"00","DPM",{"$f":"#REF!","v":{"$error":"#REF!"}},{"$f":"#REF!","v":{"$error":"#REF!"}},{"$f":"#REF!","v":{"$error":"#REF!"}},{"$f":"#REF!","v":{"$error":"#REF!"}},null,null,{"$f":"#REF!","v":{"$error":"#REF!"}},{"$f":"IF(G158=1112,#REF!*L158/(SUMIF($G$142:$G$190,1112,$L$142:$L$190)+SUMIF($G$201:$G$240,1112,$L$201:$L$240)),0)","v":{"$error":"#REF!"}},{"$f":"IF(OR(G158=1111,G158=2729),#REF!*L158/(SUMIF($G$142:$G$190,2729,$L$142:$L$190)+SUMIF($G$201:$G$240,2729,$L$201:$L$240)+SUMIF($G$142:$G$190,1111,$L$142:$L$190)+SUMIF($G$201:$G$240,1111,$L$201:$L$240)),0)","v":{"$error":"#REF!"}},null,null,null,null,null,null,null,null,null,null,null,"-",{"$error":"#REF!"},null,29]
[{"$error":"#REF!"},{"$error":"#REF!"},3,{"$error":"#REF!"},{"$error":"#REF!"},{"$error":"#REF!"},{"$f":"IF(#REF!=\"\",0,VLOOKUP(#REF!,#REF!,2,FALSE))","v":{"$error":"#REF!"}},{"$f":"IF(#REF!=\"\",0,VLOOKUP(#REF!,#REF!,2,FALSE))","v":{"$error":"#REF!"}},{"$f":"IF(#REF!=\"\",0,VLOOKUP(#REF!,#REF!,2,FALSE))","v":{"$error":"#REF!"}},"00","DPM",{"$f":"#REF!","v":{"$error":"#REF!"}},{"$f":"#REF!","v":{"$error":"#REF!"}},{"$f":"#REF!","v":{"$error":"#REF!"}},{"$f":"#REF!","v":{"$error":"#REF!"}},null,null,{"$f":"#REF!","v":{"$error":"#REF!"}},{"$f":"IF(G159=1112,#REF!*L159/(SUMIF($G$142:$G$190,1112,$L$142:$L$190)+SUMIF($G$201:$G$240,1112,$L$201:$L$240)),0)","v":{"$error":"#REF!"}},{"$f":"IF(OR(G159=1111,G159=2729),#REF!*L159/(SUMIF($G$142:$G$190,2729,$L$142:$L$190)+SUMIF($G$201:$G$240,2729,$L$201:$L$240)+SUMIF($G$142:$G$190,1111,$L$142:$L$190)+SUMIF($G$201:$G$240,1111,$L$201:$L$240)),0)","v":{"$error":"#REF!"}},null,null,null,null,null,null,null,null,null,null,null,"-",{"$error":"#REF!"},null,30]
[{"$error":"#REF!"},{"$error":"#REF!"},3,{"$error":"#REF!"},{"$error":"#REF!"},{"$error":"#REF!"},{"$f":"IF(#REF!=\"\",0,VLOOKUP(#REF!,#REF!,2,FALSE))","v":{"$error":"#REF!"}},{"$f":"IF(#REF!=\"\",0,VLOOKUP(#REF!,#REF!,2,FALSE))","v":{"$error":"#REF!"}},{"$f":"IF(#REF!=\"\",0,VLOOKUP(#REF!,#REF!,2,FALSE))","v":{"$error":"#REF!"}},"00","DPM",{"$f":"#REF!","v":{"$error":"#REF!"}},{"$f":"#REF!","v":{"$error":"#REF!"}},{"$f":"#REF!","v":{"$error":"#REF!"}},{"$f":"#REF!","v":{"$error":"#REF!"}},null,null,{"$f":"#REF!","v":{"$error":"#REF!"}},{"$f":"IF(G160=1112,#REF!*L160/(SUMIF($G$142:$G$190,1112,$L$142:$L$190)+SUMIF($G$201:$G$240,1112,$L$201:$L$240)),0)","v":{"$error":"#REF!"}},{"$f":"IF(OR(G160=1111,G160=2729),#REF!*L160/(SUMIF($G$142:$G$190,2729,$L$142:$L$190)+SUMIF($G$201:$G$240,2729,$L$201:$L$240)+SUMIF($G$142:$G$190,1111,$L$142:$L$190)+SUMIF($G$201:$G$240,1111,$L$201:$L$240)),0)","v":{"$error":"#REF!"}},null,null,null,null,null,null,null,null,null,null,null,"-",{"$error":"#REF!"},null,31]
[{"$error":"#REF!"},{"$error":"#REF!"},3,{"$error":"#REF!"},{"$error":"#REF!"},{"$error":"#REF!"},{"$f":"IF(#REF!=\"\",0,VLOOKUP(#REF!,#REF!,2,FALSE))","v":{"$error":"#REF!"}},{"$f":"IF(#REF!=\"\",0,VLOOKUP(#REF!,#REF!,2,FALSE))","v":{"$error":"#REF!"}},{"$f":"IF(#REF!=\"\",0,VLOOKUP(#REF!,#REF!,2,FALSE))","v":{"$error":"#REF!"}},"00","DPM",{"$f":"#REF!","v":{"$error":"#REF!"}},{"$f":"#REF!","v":{"$error":"#REF!"}},{"$f":"#REF!","v":{"$error":"#REF!"}},{"$f":"#REF!","v":{"$error":"#REF!"}},null,null,{"$f":"#REF!","v":{"$error":"#REF!"}},{"$f":"IF(G161=1112,#REF!*L161/(SUMIF($G$142:$G$190,1112,$L$142:$L$190)+SUMIF($G$201:$G$240,1112,$L$201:$L$240)),0)","v":{"$error":"#REF!"}},{"$f":"IF(OR(G161=1111,G161=2729),#REF!*L161/(SUMIF($G$142:$G$190,2729,$L$142:$L$190)+SUMIF($G$201:$G$240,2729,$L$201:$L$240)+SUMIF($G$142:$G$190,1111,$L$142:$L$190)+SUMIF($G$201:$G$240,1111,$L$201:$L$240)),0)","v":{"$error":"#REF!"}},null,null,null,null,null,null,null,null,null,null,null,"-",{"$error":"#REF!"},null,32]
[{"$error":"#REF!"},{"$error":"#REF!"},3,{"$error":"#REF!"},{"$error":"#REF!"},{"$error":"#REF!"},{"$f":"IF(#REF!=\"\",0,VLOOKUP(#REF!,#REF!,2,FALSE))","v":{"$error":"#REF!"}},{"$f":"IF(#REF!=\"\",0,VLOOKUP(#REF!,#REF!,2,FALSE))","v":{"$error":"#REF!"}},{"$f":"IF(#REF!=\"\",0,VLOOKUP(#REF!,#REF!,2,FALSE))","v":{"$error":"#REF!"}},"00","DPM",{"$f":"#REF!","v":{"$error":"#REF!"}},{"$f":"#REF!","v":{"$error":"#REF!"}},{"$f":"#REF!","v":{"$error":"#REF!"}},{"$f":"#REF!","v":{"$error":"#REF!"}},null,null,{"$f":"#REF!","v":{"$error":"#REF!"}},{"$f":"IF(G162=1112,#REF!*L162/(SUMIF($G$142:$G$190,1112,$L$142:$L$190)+SUMIF($G$201:$G$240,1112,$L$201:$L$240)),0)","v":{"$error":"#REF!"}},{"$f":"IF(OR(G162=1111,G162=2729),#REF!*L162/(SUMIF($G$142:$G$190,2729,$L$142:$L$190)+SUMIF($G$201:$G$240,2729,$L$201:$L$240)+SUMIF($G$142:$G$190,1111,$L$142:$L$190)+SUMIF($G$201:$G$240,1111,$L$201:$L$240)),0)","v":{"$error":"#REF!"}},null,null,null,null,null,null,null,null,null,null,null,"-",{"$error":"#REF!"},null,33]
[{"$error":"#REF!"},{"$error":"#REF!"},3,{"$error":"#REF!"},{"$error":"#REF!"},{"$error":"#REF!"},{"$f":"IF(#REF!=\"\",0,VLOOKUP(#REF!,#REF!,2,FALSE))","v":{"$error":"#REF!"}},{"$f":"IF(#REF!=\"\",0,VLOOKUP(#REF!,#REF!,2,FALSE))","v":{"$error":"#REF!"}},{"$f":"IF(#REF!=\"\",0,VLOOKUP(#REF!,#REF!,2,FALSE))","v":{"$error":"#REF!"}},"00","DPM",{"$f":"#REF!","v":{"$error":"#REF!"}},{"$f":"#REF!","v":{"$error":"#REF!"}},{"$f":"#REF!","v":{"$error":"#REF!"}},{"$f":"#REF!","v":{"$error":"#REF!"}},null,null,{"$f":"#REF!","v":{"$error":"#REF!"}},{"$f":"IF(G163=1112,#REF!*L163/(SUMIF($G$142:$G$190,1112,$L$142:$L$190)+SUMIF($G$201:$G$240,1112,$L$201:$L$240)),0)","v":{"$error":"#REF!"}},{"$f":"IF(OR(G163=1111,G163=2729),#REF!*L163/(SUMIF($G$142:$G$190,2729,$L$142:$L$190)+SUMIF($G$201:$G$240,2729,$L$201:$L$240)+SUMIF($G$142:$G$190,1111,$L$142:$L$190)+SUMIF($G$201:$G$240,1111,$L$201:$L$240)),0)","v":{"$error":"#REF!"}},null,null,null,null,null,null,null,null,null,null,null,"-",{"$error":"#REF!"},null,34]
[{"$error":"#REF!"},{"$error":"#REF!"},3,{"$error":"#REF!"},{"$error":"#REF!"},{"$error":"#REF!"},{"$f":"IF(#REF!=\"\",0,VLOOKUP(#REF!,#REF!,2,FALSE))","v":{"$error":"#REF!"}},{"$f":"IF(#REF!=\"\",0,VLOOKUP(#REF!,#REF!,2,FALSE))","v":{"$error":"#REF!"}},{"$f":"IF(#REF!=\"\",0,VLOOKUP(#REF!,#REF!,2,FALSE))","v":{"$error":"#REF!"}},"00","DPM",{"$f":"#REF!","v":{"$error":"#REF!"}},{"$f":"#REF!","v":{"$error":"#REF!"}},{"$f":"#REF!","v":{"$error":"#REF!"}},{"$f":"#REF!","v":{"$error":"#REF!"}},null,null,{"$f":"#REF!","v":{"$error":"#REF!"}},{"$f":"IF(G164=1112,#REF!*L164/(SUMIF($G$142:$G$190,1112,$L$142:$L$190)+SUMIF($G$201:$G$240,1112,$L$201:$L$240)),0)","v":{"$error":"#REF!"}},{"$f":"IF(OR(G164=1111,G164=2729),#REF!*L164/(SUMIF($G$142:$G$190,2729,$L$142:$L$190)+SUMIF($G$201:$G$240,2729,$L$201:$L$240)+SUMIF($G$142:$G$190,1111,$L$142:$L$190)+SUMIF($G$201:$G$240,1111,$L$201:$L$240)),0)","v":{"$error":"#REF!"}},null,null,null,null,null,null,null,null,null,null,null,"-",{"$error":"#REF!"},null,35]
[{"$error":"#REF!"},{"$error":"#REF!"},3,{"$error":"#REF!"},{"$error":"#REF!"},{"$error":"#REF!"},{"$f":"IF(#REF!=\"\",0,VLOOKUP(#REF!,#REF!,2,FALSE))","v":{"$error":"#REF!"}},{"$f":"IF(#REF!=\"\",0,VLOOKUP(#REF!,#REF!,2,FALSE))","v":{"$error":"#REF!"}},{"$f":"IF(#REF!=\"\",0,VLOOKUP(#REF!,#REF!,2,FALSE))","v":{"$error":"#REF!"}},"00","DPM",{"$f":"#REF!","v":{"$error":"#REF!"}},{"$f":"#REF!","v":{"$error":"#REF!"}},{"$f":"#REF!","v":{"$error":"#REF!"}},{"$f":"#REF!","v":{"$error":"#REF!"}},null,null,{"$f":"#REF!","v":{"$error":"#REF!"}},{"$f":"IF(G165=1112,#REF!*L165/(SUMIF($G$142:$G$190,1112,$L$142:$L$190)+SUMIF($G$201:$G$240,1112,$L$201:$L$240)),0)","v":{"$error":"#REF!"}},{"$f":"IF(OR(G165=1111,G165=2729),#REF!*L165/(SUMIF($G$142:$G$190,2729,$L$142:$L$190)+SUMIF($G$201:$G$240,2729,$L$201:$L$240)+SUMIF($G$142:$G$190,1111,$L$142:$L$190)+SUMIF($G$201:$G$240,1111,$L$201:$L$240)),0)","v":{"$error":"#REF!"}},null,null,null,null,null,null,null,null,null,null,null,"-",{"$error":"#REF!"},null,36]
[{"$error":"#REF!"},{"$error":"#REF!"},3,{"$error":"#REF!"},{"$error":"#REF!"},{"$error":"#REF!"},{"$f":"IF(#REF!=\"\",0,VLOOKUP(#REF!,#REF!,2,FALSE))","v":{"$error":"#REF!"}},{"$f":"IF(#REF!=\"\",0,VLOOKUP(#REF!,#REF!,2,FALSE))","v":{"$error":"#REF!"}},{"$f":"IF(#REF!=\"\",0,VLOOKUP(#REF!,#REF!,2,FALSE))","v":{"$error":"#REF!"}},"00","DPM",{"$f":"#REF!","v":{"$error":"#REF!"}},{"$f":"#REF!","v":{"$error":"#REF!"}},{"$f":"#REF!","v":{"$error":"#REF!"}},{"$f":"#REF!","v":{"$error":"#REF!"}},null,null,{"$f":"#REF!","v":{"$error":"#REF!"}},{"$f":"IF(G166=1112,#REF!*L166/(SUMIF($G$142:$G$190,1112,$L$142:$L$190)+SUMIF($G$201:$G$240,1112,$L$201:$L$240)),0)","v":{"$error":"#REF!"}},{"$f":"IF(OR(G166=1111,G166=2729),#REF!*L166/(SUMIF($G$142:$G$190,2729,$L$142:$L$190)+SUMIF($G$201:$G$240,2729,$L$201:$L$240)+SUMIF($G$142:$G$190,1111,$L$142:$L$190)+SUMIF($G$201:$G$240,1111,$L$201:$L$240)),0)","v":{"$error":"#REF!"}},null,null,null,null,null,null,null,null,null,null,null,"-",{"$error":"#REF!"},null,37]
[{"$error":"#REF!"},{"$error":"#REF!"},3,{"$error":"#REF!"},{"$error":"#REF!"},{"$error":"#REF!"},{"$f":"IF(#REF!=\"\",0,VLOOKUP(#REF!,#REF!,2,FALSE))","v":{"$error":"#REF!"}},{"$f":"IF(#REF!=\"\",0,VLOOKUP(#REF!,#REF!,2,FALSE))","v":{"$error":"#REF!"}},{"$f":"IF(#REF!=\"\",0,VLOOKUP(#REF!,#REF!,2,FALSE))","v":{"$error":"#REF!"}},"00","DPM",{"$f":"#REF!","v":{"$error":"#REF!"}},{"$f":"#REF!","v":{"$error":"#REF!"}},{"$f":"#REF!","v":{"$error":"#REF!"}},{"$f":"#REF!","v":{"$error":"#REF!"}},null,null,{"$f":"#REF!","v":{"$error":"#REF!"}},{"$f":"IF(G167=1112,#REF!*L167/(SUMIF($G$142:$G$190,1112,$L$142:$L$190)+SUMIF($G$201:$G$240,1112,$L$201:$L$240)),0)","v":{"$error":"#REF!"}},{"$f":"IF(OR(G167=1111,G167=2729),#REF!*L167/(SUMIF($G$142:$G$190,2729,$L$142:$L$190)+SUMIF($G$201:$G$240,2729,$L$201:$L$240)+SUMIF($G$142:$G$190,1111,$L$142:$L$190)+SUMIF($G$201:$G$240,1111,$L$201:$L$240)),0)","v":{"$error":"#REF!"}},null,null,null,null,null,null,null,null,null,null,null,"-",{"$error":"#REF!"},null,38]
[{"$error":"#REF!"},{"$error":"#REF!"},3,{"$error":"#REF!"},{"$error":"#REF!"},{"$error":"#REF!"},{"$f":"IF(#REF!=\"\",0,VLOOKUP(#REF!,#REF!,2,FALSE))","v":{"$error":"#REF!"}},{"$f":"IF(#REF!=\"\",0,VLOOKUP(#REF!,#REF!,2,FALSE))","v":{"$error":"#REF!"}},{"$f":"IF(#REF!=\"\",0,VLOOKUP(#REF!,#REF!,2,FALSE))","v":{"$error":"#REF!"}},"00","DPM",{"$f":"#REF!","v":{"$error":"#REF!"}},{"$f":"#REF!","v":{"$error":"#REF!"}},{"$f":"#REF!","v":{"$error":"#REF!"}},{"$f":"#REF!","v":{"$error":"#REF!"}},null,null,{"$f":"#REF!","v":{"$error":"#REF!"}},{"$f":"IF(G168=1112,#REF!*L168/(SUMIF($G$142:$G$190,1112,$L$142:$L$190)+SUMIF($G$201:$G$240,1112,$L$201:$L$240)),0)","v":{"$error":"#REF!"}},{"$f":"IF(OR(G168=1111,G168=2729),#REF!*L168/(SUMIF($G$142:$G$190,2729,$L$142:$L$190)+SUMIF($G$201:$G$240,2729,$L$201:$L$240)+SUMIF($G$142:$G$190,1111,$L$142:$L$190)+SUMIF($G$201:$G$240,1111,$L$201:$L$240)),0)","v":{"$error":"#REF!"}},null,null,null,null,null,null,null,null,null,null,null,"-",{"$error":"#REF!"},null,39]
[{"$error":"#REF!"},{"$error":"#REF!"},3,{"$error":"#REF!"},{"$error":"#REF!"},{"$error":"#REF!"},{"$f":"IF(#REF!=\"\",0,VLOOKUP(#REF!,#REF!,2,FALSE))","v":{"$error":"#REF!"}},{"$f":"IF(#REF!=\"\",0,VLOOKUP(#REF!,#REF!,2,FALSE))","v":{"$error":"#REF!"}},{"$f":"IF(#REF!=\"\",0,VLOOKUP(#REF!,#REF!,2,FALSE))","v":{"$error":"#REF!"}},"00","DPM",{"$f":"#REF!","v":{"$error":"#REF!"}},{"$f":"#REF!","v":{"$error":"#REF!"}},{"$f":"#REF!","v":{"$error":"#REF!"}},{"$f":"#REF!","v":{"$error":"#REF!"}},null,null,{"$f":"#REF!","v":{"$error":"#REF!"}},{"$f":"IF(G169=1112,#REF!*L169/(SUMIF($G$142:$G$190,1112,$L$142:$L$190)+SUMIF($G$201:$G$240,1112,$L$201:$L$240)),0)","v":{"$error":"#REF!"}},{"$f":"IF(OR(G169=1111,G169=2729),#REF!*L169/(SUMIF($G$142:$G$190,2729,$L$142:$L$190)+SUMIF($G$201:$G$240,2729,$L$201:$L$240)+SUMIF($G$142:$G$190,1111,$L$142:$L$190)+SUMIF($G$201:$G$240,1111,$L$201:$L$240)),0)","v":{"$error":"#REF!"}},null,null,null,null,null,null,null,null,null,null,null,"-",{"$error":"#REF!"},null,40]
[{"$error":"#REF!"},{"$error":"#REF!"},3,{"$error":"#REF!"},{"$error":"#REF!"},{"$error":"#REF!"},{"$f":"IF(#REF!=\"\",0,VLOOKUP(#REF!,#REF!,2,FALSE))","v":{"$error":"#REF!"}},{"$f":"IF(#REF!=\"\",0,VLOOKUP(#REF!,#REF!,2,FALSE))","v":{"$error":"#REF!"}},{"$f":"IF(#REF!=\"\",0,VLOOKUP(#REF!,#REF!,2,FALSE))","v":{"$error":"#REF!"}},"00","DPM",{"$f":"#REF!","v":{"$error":"#REF!"}},{"$f":"#REF!","v":{"$error":"#REF!"}},{"$f":"#REF!","v":{"$error":"#REF!"}},{"$f":"#REF!","v":{"$error":"#REF!"}},null,null,{"$f":"#REF!","v":{"$error":"#REF!"}},{"$f":"IF(G170=1112,#REF!*L170/(SUMIF($G$142:$G$190,1112,$L$142:$L$190)+SUMIF($G$201:$G$240,1112,$L$201:$L$240)),0)","v":{"$error":"#REF!"}},{"$f":"IF(OR(G170=1111,G170=2729),#REF!*L170/(SUMIF($G$142:$G$190,2729,$L$142:$L$190)+SUMIF($G$201:$G$240,2729,$L$201:$L$240)+SUMIF($G$142:$G$190,1111,$L$142:$L$190)+SUMIF($G$201:$G$240,1111,$L$201:$L$240)),0)","v":{"$error":"#REF!"}},null,null,null,null,null,null,null,null,null,null,null,"-",{"$error":"#REF!"},null,41]
[{"$error":"#REF!"},{"$error":"#REF!"},3,{"$error":"#REF!"},{"$error":"#REF!"},{"$error":"#REF!"},{"$f":"IF(#REF!=\"\",0,VLOOKUP(#REF!,#REF!,2,FALSE))","v":{"$error":"#REF!"}},{"$f":"IF(#REF!=\"\",0,VLOOKUP(#REF!,#REF!,2,FALSE))","v":{"$error":"#REF!"}},{"$f":"IF(#REF!=\"\",0,VLOOKUP(#REF!,#REF!,2,FALSE))","v":{"$error":"#REF!"}},"00","DPM",{"$f":"#REF!","v":{"$error":"#REF!"}},{"$f":"#REF!","v":{"$error":"#REF!"}},{"$f":"#REF!","v":{"$error":"#REF!"}},{"$f":"#REF!","v":{"$error":"#REF!"}},null,null,{"$f":"#REF!","v":{"$error":"#REF!"}},{"$f":"IF(G171=1112,#REF!*L171/(SUMIF($G$142:$G$190,1112,$L$142:$L$190)+SUMIF($G$201:$G$240,1112,$L$201:$L$240)),0)","v":{"$error":"#REF!"}},{"$f":"IF(OR(G171=1111,G171=2729),#REF!*L171/(SUMIF($G$142:$G$190,2729,$L$142:$L$190)+SUMIF($G$201:$G$240,2729,$L$201:$L$240)+SUMIF($G$142:$G$190,1111,$L$142:$L$190)+SUMIF($G$201:$G$240,1111,$L$201:$L$240)),0)","v":{"$error":"#REF!"}},null,null,null,null,null,null,null,null,null,null,null,"-",{"$error":"#REF!"},null,42]
[{"$error":"#REF!"},{"$error":"#REF!"},3,{"$error":"#REF!"},{"$error":"#REF!"},{"$error":"#REF!"},{"$f":"IF(#REF!=\"\",0,VLOOKUP(#REF!,#REF!,2,FALSE))","v":{"$error":"#REF!"}},{"$f":"IF(#REF!=\"\",0,VLOOKUP(#REF!,#REF!,2,FALSE))","v":{"$error":"#REF!"}},{"$f":"IF(#REF!=\"\",0,VLOOKUP(#REF!,#REF!,2,FALSE))","v":{"$error":"#REF!"}},"00","DPM",{"$f":"#REF!","v":{"$error":"#REF!"}},{"$f":"#REF!","v":{"$error":"#REF!"}},{"$f":"#REF!","v":{"$error":"#REF!"}},{"$f":"#REF!","v":{"$error":"#REF!"}},null,null,{"$f":"#REF!","v":{"$error":"#REF!"}},{"$f":"IF(G172=1112,#REF!*L172/(SUMIF($G$142:$G$190,1112,$L$142:$L$190)+SUMIF($G$201:$G$240,1112,$L$201:$L$240)),0)","v":{"$error":"#REF!"}},{"$f":"IF(OR(G172=1111,G172=2729),#REF!*L172/(SUMIF($G$142:$G$190,2729,$L$142:$L$190)+SUMIF($G$201:$G$240,2729,$L$201:$L$240)+SUMIF($G$142:$G$190,1111,$L$142:$L$190)+SUMIF($G$201:$G$240,1111,$L$201:$L$240)),0)","v":{"$error":"#REF!"}},null,null,null,null,null,null,null,null,null,null,null,"-",{"$error":"#REF!"},null,43]
[{"$error":"#REF!"},{"$error":"#REF!"},3,{"$error":"#REF!"},{"$error":"#REF!"},{"$error":"#REF!"},{"$f":"IF(#REF!=\"\",0,VLOOKUP(#REF!,#REF!,2,FALSE))","v":{"$error":"#REF!"}},{"$f":"IF(#REF!=\"\",0,VLOOKUP(#REF!,#REF!,2,FALSE))","v":{"$error":"#REF!"}},{"$f":"IF(#REF!=\"\",0,VLOOKUP(#REF!,#REF!,2,FALSE))","v":{"$error":"#REF!"}},"00","DPM",{"$f":"#REF!","v":{"$error":"#REF!"}},{"$f":"#REF!","v":{"$error":"#REF!"}},{"$f":"#REF!","v":{"$error":"#REF!"}},{"$f":"#REF!","v":{"$error":"#REF!"}},null,null,{"$f":"#REF!","v":{"$error":"#REF!"}},{"$f":"IF(G173=1112,#REF!*L173/(SUMIF($G$142:$G$190,1112,$L$142:$L$190)+SUMIF($G$201:$G$240,1112,$L$201:$L$240)),0)","v":{"$error":"#REF!"}},{"$f":"IF(OR(G173=1111,G173=2729),#REF!*L173/(SUMIF($G$142:$G$190,2729,$L$142:$L$190)+SUMIF($G$201:$G$240,2729,$L$201:$L$240)+SUMIF($G$142:$G$190,1111,$L$142:$L$190)+SUMIF($G$201:$G$240,1111,$L$201:$L$240)),0)","v":{"$error":"#REF!"}},null,null,null,null,null,null,null,null,null,null,null,"-",{"$error":"#REF!"},null,44]
[{"$error":"#REF!"},{"$error":"#REF!"},3,{"$error":"#REF!"},{"$error":"#REF!"},{"$error":"#REF!"},{"$f":"IF(#REF!=\"\",0,VLOOKUP(#REF!,#REF!,2,FALSE))","v":{"$error":"#REF!"}},{"$f":"IF(#REF!=\"\",0,VLOOKUP(#REF!,#REF!,2,FALSE))","v":{"$error":"#REF!"}},{"$f":"IF(#REF!=\"\",0,VLOOKUP(#REF!,#REF!,2,FALSE))","v":{"$error":"#REF!"}},"00","DPM",{"$f":"#REF!","v":{"$error":"#REF!"}},{"$f":"#REF!","v":{"$error":"#REF!"}},{"$f":"#REF!","v":{"$error":"#REF!"}},{"$f":"#REF!","v":{"$error":"#REF!"}},null,null,{"$f":"#REF!","v":{"$error":"#REF!"}},{"$f":"IF(G174=1112,#REF!*L174/(SUMIF($G$142:$G$190,1112,$L$142:$L$190)+SUMIF($G$201:$G$240,1112,$L$201:$L$240)),0)","v":{"$error":"#REF!"}},{"$f":"IF(OR(G174=1111,G174=2729),#REF!*L174/(SUMIF($G$142:$G$190,2729,$L$142:$L$190)+SUMIF($G$201:$G$240,2729,$L$201:$L$240)+SUMIF($G$142:$G$190,1111,$L$142:$L$190)+SUMIF($G$201:$G$240,1111,$L$201:$L$240)),0)","v":{"$error":"#REF!"}},null,null,null,null,null,null,null,null,null,null,null,"-",{"$error":"#REF!"},null,45]
[{"$error":"#REF!"},{"$error":"#REF!"},3,{"$error":"#REF!"},{"$error":"#REF!"},{"$error":"#REF!"},{"$f":"IF(#REF!=\"\",0,VLOOKUP(#REF!,#REF!,2,FALSE))","v":{"$error":"#REF!"}},{"$f":"IF(#REF!=\"\",0,VLOOKUP(#REF!,#REF!,2,FALSE))","v":{"$error":"#REF!"}},{"$f":"IF(#REF!=\"\",0,VLOOKUP(#REF!,#REF!,2,FALSE))","v":{"$error":"#REF!"}},"00","DPM",{"$f":"#REF!","v":{"$error":"#REF!"}},{"$f":"#REF!","v":{"$error":"#REF!"}},{"$f":"#REF!","v":{"$error":"#REF!"}},{"$f":"#REF!","v":{"$error":"#REF!"}},null,null,{"$f":"#REF!","v":{"$error":"#REF!"}},{"$f":"IF(G175=1112,#REF!*L175/(SUMIF($G$142:$G$190,1112,$L$142:$L$190)+SUMIF($G$201:$G$240,1112,$L$201:$L$240)),0)","v":{"$error":"#REF!"}},{"$f":"IF(OR(G175=1111,G175=2729),#REF!*L175/(SUMIF($G$142:$G$190,2729,$L$142:$L$190)+SUMIF($G$201:$G$240,2729,$L$201:$L$240)+SUMIF($G$142:$G$190,1111,$L$142:$L$190)+SUMIF($G$201:$G$240,1111,$L$201:$L$240)),0)","v":{"$error":"#REF!"}},null,null,null,null,null,null,null,null,null,null,null,"-",{"$error":"#REF!"},null,46]
[{"$error":"#REF!"},{"$error":"#REF!"},3,{"$error":"#REF!"},{"$error":"#REF!"},{"$error":"#REF!"},{"$f":"IF(#REF!=\"\",0,VLOOKUP(#REF!,#REF!,2,FALSE))","v":{"$error":"#REF!"}},{"$f":"IF(#REF!=\"\",0,VLOOKUP(#REF!,#REF!,2,FALSE))","v":{"$error":"#REF!"}},{"$f":"IF(#REF!=\"\",0,VLOOKUP(#REF!,#REF!,2,FALSE))","v":{"$error":"#REF!"}},"00","DPM",{"$f":"#REF!","v":{"$error":"#REF!"}},{"$f":"#REF!","v":{"$error":"#REF!"}},{"$f":"#REF!","v":{"$error":"#REF!"}},{"$f":"#REF!","v":{"$error":"#REF!"}},null,null,{"$f":"#REF!","v":{"$error":"#REF!"}},{"$f":"IF(G176=1112,#REF!*L176/(SUMIF($G$142:$G$190,1112,$L$142:$L$190)+SUMIF($G$201:$G$240,1112,$L$201:$L$240)),0)","v":{"$error":"#REF!"}},{"$f":"IF(OR(G176=1111,G176=2729),#REF!*L176/(SUMIF($G$142:$G$190,2729,$L$142:$L$190)+SUMIF($G$201:$G$240,2729,$L$201:$L$240)+SUMIF($G$142:$G$190,1111,$L$142:$L$190)+SUMIF($G$201:$G$240,1111,$L$201:$L$240)),0)","v":{"$error":"#REF!"}},null,null,null,null,null,null,null,null,null,null,null,"-",{"$error":"#REF!"},null,47]
[{"$error":"#REF!"},{"$error":"#REF!"},3,{"$error":"#REF!"},{"$error":"#REF!"},{"$error":"#REF!"},{"$f":"IF(#REF!=\"\",0,VLOOKUP(#REF!,#REF!,2,FALSE))","v":{"$error":"#REF!"}},{"$f":"IF(#REF!=\"\",0,VLOOKUP(#REF!,#REF!,2,FALSE))","v":{"$error":"#REF!"}},{"$f":"IF(#REF!=\"\",0,VLOOKUP(#REF!,#REF!,2,FALSE))","v":{"$error":"#REF!"}},"00","DPM",{"$f":"#REF!","v":{"$error":"#REF!"}},{"$f":"#REF!","v":{"$error":"#REF!"}},{"$f":"#REF!","v":{"$error":"#REF!"}},{"$f":"#REF!","v":{"$error":"#REF!"}},null,null,{"$f":"#REF!","v":{"$error":"#REF!"}},{"$f":"IF(G177=1112,#REF!*L177/(SUMIF($G$142:$G$190,1112,$L$142:$L$190)+SUMIF($G$201:$G$240,1112,$L$201:$L$240)),0)","v":{"$error":"#REF!"}},{"$f":"IF(OR(G177=1111,G177=2729),#REF!*L177/(SUMIF($G$142:$G$190,2729,$L$142:$L$190)+SUMIF($G$201:$G$240,2729,$L$201:$L$240)+SUMIF($G$142:$G$190,1111,$L$142:$L$190)+SUMIF($G$201:$G$240,1111,$L$201:$L$240)),0)","v":{"$error":"#REF!"}},null,null,null,null,null,null,null,null,null,null,null,"-",{"$error":"#REF!"},null,48]
[{"$error":"#REF!"},{"$error":"#REF!"},3,{"$error":"#REF!"},{"$error":"#REF!"},{"$error":"#REF!"},{"$f":"IF(#REF!=\"\",0,VLOOKUP(#REF!,#REF!,2,FALSE))","v":{"$error":"#REF!"}},{"$f":"IF(#REF!=\"\",0,VLOOKUP(#REF!,#REF!,2,FALSE))","v":{"$error":"#REF!"}},{"$f":"IF(#REF!=\"\",0,VLOOKUP(#REF!,#REF!,2,FALSE))","v":{"$error":"#REF!"}},"00","DPM",{"$f":"#REF!","v":{"$error":"#REF!"}},{"$f":"#REF!","v":{"$error":"#REF!"}},{"$f":"#REF!","v":{"$error":"#REF!"}},{"$f":"#REF!","v":{"$error":"#REF!"}},null,null,{"$f":"#REF!","v":{"$error":"#REF!"}},{"$f":"IF(G178=1112,#REF!*L178/(SUMIF($G$142:$G$190,1112,$L$142:$L$190)+SUMIF($G$201:$G$240,1112,$L$201:$L$240)),0)","v":{"$error":"#REF!"}},{"$f":"IF(OR(G178=1111,G178=2729),#REF!*L178/(SUMIF($G$142:$G$190,2729,$L$142:$L$190)+SUMIF($G$201:$G$240,2729,$L$201:$L$240)+SUMIF($G$142:$G$190,1111,$L$142:$L$190)+SUMIF($G$201:$G$240,1111,$L$201:$L$240)),0)","v":{"$error":"#REF!"}},null,null,null,null,null,null,null,null,null,null,null,"-",{"$error":"#REF!"},null,49]
[{"$error":"#REF!"},{"$error":"#REF!"},3,{"$error":"#REF!"},{"$error":"#REF!"},{"$error":"#REF!"},{"$f":"IF(#REF!=\"\",0,VLOOKUP(#REF!,#REF!,2,FALSE))","v":{"$error":"#REF!"}},{"$f":"IF(#REF!=\"\",0,VLOOKUP(#REF!,#REF!,2,FALSE))","v":{"$error":"#REF!"}},{"$f":"IF(#REF!=\"\",0,VLOOKUP(#REF!,#REF!,2,FALSE))","v":{"$error":"#REF!"}},"00","DPM",{"$f":"#REF!","v":{"$error":"#REF!"}},{"$f":"#REF!","v":{"$error":"#REF!"}},{"$f":"#REF!","v":{"$error":"#REF!"}},{"$f":"#REF!","v":{"$error":"#REF!"}},null,null,{"$f":"#REF!","v":{"$error":"#REF!"}},{"$f":"IF(G179=1112,#REF!*L179/(SUMIF($G$142:$G$190,1112,$L$142:$L$190)+SUMIF($G$201:$G$240,1112,$L$201:$L$240)),0)","v":{"$error":"#REF!"}},{"$f":"IF(OR(G179=1111,G179=2729),#REF!*L179/(SUMIF($G$142:$G$190,2729,$L$142:$L$190)+SUMIF($G$201:$G$240,2729,$L$201:$L$240)+SUMIF($G$142:$G$190,1111,$L$142:$L$190)+SUMIF($G$201:$G$240,1111,$L$201:$L$240)),0)","v":{"$error":"#REF!"}},null,null,null,null,null,null,null,null,null,null,null,"-",{"$error":"#REF!"},null,50]
[{"$error":"#REF!"},{"$error":"#REF!"},3,{"$error":"#REF!"},{"$error":"#REF!"},{"$error":"#REF!"},{"$f":"IF(#REF!=\"\",0,VLOOKUP(#REF!,#REF!,2,FALSE))","v":{"$error":"#REF!"}},{"$f":"IF(#REF!=\"\",0,VLOOKUP(#REF!,#REF!,2,FALSE))","v":{"$error":"#REF!"}},{"$f":"IF(#REF!=\"\",0,VLOOKUP(#REF!,#REF!,2,FALSE))","v":{"$error":"#REF!"}},"00","DPM",{"$f":"#REF!","v":{"$error":"#REF!"}},{"$f":"#REF!","v":{"$error":"#REF!"}},{"$f":"#REF!","v":{"$error":"#REF!"}},{"$f":"#REF!","v":{"$error":"#REF!"}},null,null,{"$f":"#REF!","v":{"$error":"#REF!"}},{"$f":"IF(G180=1112,#REF!*L180/(SUMIF($G$142:$G$190,1112,$L$142:$L$190)+SUMIF($G$201:$G$240,1112,$L$201:$L$240)),0)","v":{"$error":"#REF!"}},{"$f":"IF(OR(G180=1111,G180=2729),#REF!*L180/(SUMIF($G$142:$G$190,2729,$L$142:$L$190)+SUMIF($G$201:$G$240,2729,$L$201:$L$240)+SUMIF($G$142:$G$190,1111,$L$142:$L$190)+SUMIF($G$201:$G$240,1111,$L$201:$L$240)),0)","v":{"$error":"#REF!"}},null,null,null,null,null,null,null,null,null,null,null,"-",{"$error":"#REF!"},null,51]
[{"$error":"#REF!"},{"$error":"#REF!"},3,{"$error":"#REF!"},{"$error":"#REF!"},{"$error":"#REF!"},{"$f":"IF(#REF!=\"\",0,VLOOKUP(#REF!,#REF!,2,FALSE))","v":{"$error":"#REF!"}},{"$f":"IF(#REF!=\"\",0,VLOOKUP(#REF!,#REF!,2,FALSE))","v":{"$error":"#REF!"}},{"$f":"IF(#REF!=\"\",0,VLOOKUP(#REF!,#REF!,2,FALSE))","v":{"$error":"#REF!"}},"00","DPM",{"$f":"#REF!","v":{"$error":"#REF!"}},{"$f":"#REF!","v":{"$error":"#REF!"}},{"$f":"#REF!","v":{"$error":"#REF!"}},{"$f":"#REF!","v":{"$error":"#REF!"}},null,null,{"$f":"#REF!","v":{"$error":"#REF!"}},{"$f":"IF(G181=1112,#REF!*L181/(SUMIF($G$142:$G$190,1112,$L$142:$L$190)+SUMIF($G$201:$G$240,1112,$L$201:$L$240)),0)","v":{"$error":"#REF!"}},{"$f":"IF(OR(G181=1111,G181=2729),#REF!*L181/(SUMIF($G$142:$G$190,2729,$L$142:$L$190)+SUMIF($G$201:$G$240,2729,$L$201:$L$240)+SUMIF($G$142:$G$190,1111,$L$142:$L$190)+SUMIF($G$201:$G$240,1111,$L$201:$L$240)),0)","v":{"$error":"#REF!"}},null,null,null,null,null,null,null,null,null,null,null,"-",{"$error":"#REF!"},null,52]
[{"$error":"#REF!"},{"$error":"#REF!"},3,{"$error":"#REF!"},{"$error":"#REF!"},{"$error":"#REF!"},{"$f":"IF(#REF!=\"\",0,VLOOKUP(#REF!,#REF!,2,FALSE))","v":{"$error":"#REF!"}},{"$f":"IF(#REF!=\"\",0,VLOOKUP(#REF!,#REF!,2,FALSE))","v":{"$error":"#REF!"}},{"$f":"IF(#REF!=\"\",0,VLOOKUP(#REF!,#REF!,2,FALSE))","v":{"$error":"#REF!"}},"00","DPM",{"$f":"#REF!","v":{"$error":"#REF!"}},{"$f":"#REF!","v":{"$error":"#REF!"}},{"$f":"#REF!","v":{"$error":"#REF!"}},{"$f":"#REF!","v":{"$error":"#REF!"}},null,null,{"$f":"#REF!","v":{"$error":"#REF!"}},{"$f":"IF(G182=1112,#REF!*L182/(SUMIF($G$142:$G$190,1112,$L$142:$L$190)+SUMIF($G$201:$G$240,1112,$L$201:$L$240)),0)","v":{"$error":"#REF!"}},{"$f":"IF(OR(G182=1111,G182=2729),#REF!*L182/(SUMIF($G$142:$G$190,2729,$L$142:$L$190)+SUMIF($G$201:$G$240,2729,$L$201:$L$240)+SUMIF($G$142:$G$190,1111,$L$142:$L$190)+SUMIF($G$201:$G$240,1111,$L$201:$L$240)),0)","v":{"$error":"#REF!"}},null,null,null,null,null,null,null,null,null,null,null,"-",{"$error":"#REF!"},null,53]
[{"$error":"#REF!"},{"$error":"#REF!"},3,{"$error":"#REF!"},{"$error":"#REF!"},{"$error":"#REF!"},{"$f":"IF(#REF!=\"\",0,VLOOKUP(#REF!,#REF!,2,FALSE))","v":{"$error":"#REF!"}},{"$f":"IF(#REF!=\"\",0,VLOOKUP(#REF!,#REF!,2,FALSE))","v":{"$error":"#REF!"}},{"$f":"IF(#REF!=\"\",0,VLOOKUP(#REF!,#REF!,2,FALSE))","v":{"$error":"#REF!"}},"00","DPM",{"$f":"#REF!","v":{"$error":"#REF!"}},{"$f":"#REF!","v":{"$error":"#REF!"}},{"$f":"#REF!","v":{"$error":"#REF!"}},{"$f":"#REF!","v":{"$error":"#REF!"}},null,null,{"$f":"#REF!","v":{"$error":"#REF!"}},{"$f":"IF(G183=1112,#REF!*L183/(SUMIF($G$142:$G$190,1112,$L$142:$L$190)+SUMIF($G$201:$G$240,1112,$L$201:$L$240)),0)","v":{"$error":"#REF!"}},{"$f":"IF(OR(G183=1111,G183=2729),#REF!*L183/(SUMIF($G$142:$G$190,2729,$L$142:$L$190)+SUMIF($G$201:$G$240,2729,$L$201:$L$240)+SUMIF($G$142:$G$190,1111,$L$142:$L$190)+SUMIF($G$201:$G$240,1111,$L$201:$L$240)),0)","v":{"$error":"#REF!"}},null,null,null,null,null,null,null,null,null,null,null,"-",{"$error":"#REF!"},null,54]
[{"$error":"#REF!"},{"$error":"#REF!"},3,{"$error":"#REF!"},{"$error":"#REF!"},{"$error":"#REF!"},{"$f":"IF(#REF!=\"\",0,VLOOKUP(#REF!,#REF!,2,FALSE))","v":{"$error":"#REF!"}},{"$f":"IF(#REF!=\"\",0,VLOOKUP(#REF!,#REF!,2,FALSE))","v":{"$error":"#REF!"}},{"$f":"IF(#REF!=\"\",0,VLOOKUP(#REF!,#REF!,2,FALSE))","v":{"$error":"#REF!"}},"00","DPM",{"$f":"#REF!","v":{"$error":"#REF!"}},{"$f":"#REF!","v":{"$error":"#REF!"}},{"$f":"#REF!","v":{"$error":"#REF!"}},{"$f":"#REF!","v":{"$error":"#REF!"}},null,null,{"$f":"#REF!","v":{"$error":"#REF!"}},{"$f":"IF(G184=1112,#REF!*L184/(SUMIF($G$142:$G$190,1112,$L$142:$L$190)+SUMIF($G$201:$G$240,1112,$L$201:$L$240)),0)","v":{"$error":"#REF!"}},{"$f":"IF(OR(G184=1111,G184=2729),#REF!*L184/(SUMIF($G$142:$G$190,2729,$L$142:$L$190)+SUMIF($G$201:$G$240,2729,$L$201:$L$240)+SUMIF($G$142:$G$190,1111,$L$142:$L$190)+SUMIF($G$201:$G$240,1111,$L$201:$L$240)),0)","v":{"$error":"#REF!"}},null,null,null,null,null,null,null,null,null,null,null,"-",{"$error":"#REF!"},null,55]
[{"$error":"#REF!"},{"$error":"#REF!"},3,{"$error":"#REF!"},{"$error":"#REF!"},{"$error":"#REF!"},{"$f":"IF(#REF!=\"\",0,VLOOKUP(#REF!,#REF!,2,FALSE))","v":{"$error":"#REF!"}},{"$f":"IF(#REF!=\"\",0,VLOOKUP(#REF!,#REF!,2,FALSE))","v":{"$error":"#REF!"}},{"$f":"IF(#REF!=\"\",0,VLOOKUP(#REF!,#REF!,2,FALSE))","v":{"$error":"#REF!"}},"00","DPM",{"$f":"#REF!","v":{"$error":"#REF!"}},{"$f":"#REF!","v":{"$error":"#REF!"}},{"$f":"#REF!","v":{"$error":"#REF!"}},{"$f":"#REF!","v":{"$error":"#REF!"}},null,null,{"$f":"#REF!","v":{"$error":"#REF!"}},{"$f":"IF(G185=1112,#REF!*L185/(SUMIF($G$142:$G$190,1112,$L$142:$L$190)+SUMIF($G$201:$G$240,1112,$L$201:$L$240)),0)","v":{"$error":"#REF!"}},{"$f":"IF(OR(G185=1111,G185=2729),#REF!*L185/(SUMIF($G$142:$G$190,2729,$L$142:$L$190)+SUMIF($G$201:$G$240,2729,$L$201:$L$240)+SUMIF($G$142:$G$190,1111,$L$142:$L$190)+SUMIF($G$201:$G$240,1111,$L$201:$L$240)),0)","v":{"$error":"#REF!"}},null,null,null,null,null,null,null,null,null,null,null,"-",{"$error":"#REF!"},null,56]
[{"$error":"#REF!"},{"$error":"#REF!"},3,{"$error":"#REF!"},{"$error":"#REF!"},{"$error":"#REF!"},{"$f":"IF(#REF!=\"\",0,VLOOKUP(#REF!,#REF!,2,FALSE))","v":{"$error":"#REF!"}},{"$f":"IF(#REF!=\"\",0,VLOOKUP(#REF!,#REF!,2,FALSE))","v":{"$error":"#REF!"}},{"$f":"IF(#REF!=\"\",0,VLOOKUP(#REF!,#REF!,2,FALSE))","v":{"$error":"#REF!"}},"00","DPM",{"$f":"#REF!","v":{"$error":"#REF!"}},{"$f":"#REF!","v":{"$error":"#REF!"}},{"$f":"#REF!","v":{"$error":"#REF!"}},{"$f":"#REF!","v":{"$error":"#REF!"}},null,null,{"$f":"#REF!","v":{"$error":"#REF!"}},{"$f":"IF(G186=1112,#REF!*L186/(SUMIF($G$142:$G$190,1112,$L$142:$L$190)+SUMIF($G$201:$G$240,1112,$L$201:$L$240)),0)","v":{"$error":"#REF!"}},{"$f":"IF(OR(G186=1111,G186=2729),#REF!*L186/(SUMIF($G$142:$G$190,2729,$L$142:$L$190)+SUMIF($G$201:$G$240,2729,$L$201:$L$240)+SUMIF($G$142:$G$190,1111,$L$142:$L$190)+SUMIF($G$201:$G$240,1111,$L$201:$L$240)),0)","v":{"$error":"#REF!"}},null,null,null,null,null,null,null,null,null,null,null,"-",{"$error":"#REF!"},null,57]
[{"$error":"#REF!"},{"$error":"#REF!"},3,{"$error":"#REF!"},{"$error":"#REF!"},{"$error":"#REF!"},{"$f":"IF(#REF!=\"\",0,VLOOKUP(#REF!,#REF!,2,FALSE))","v":{"$error":"#REF!"}},{"$f":"IF(#REF!=\"\",0,VLOOKUP(#REF!,#REF!,2,FALSE))","v":{"$error":"#REF!"}},{"$f":"IF(#REF!=\"\",0,VLOOKUP(#REF!,#REF!,2,FALSE))","v":{"$error":"#REF!"}},"00","DPM",{"$f":"#REF!","v":{"$error":"#REF!"}},{"$f":"#REF!","v":{"$error":"#REF!"}},{"$f":"#REF!","v":{"$error":"#REF!"}},{"$f":"#REF!","v":{"$error":"#REF!"}},null,null,{"$f":"#REF!","v":{"$error":"#REF!"}},{"$f":"IF(G187=1112,#REF!*L187/(SUMIF($G$142:$G$190,1112,$L$142:$L$190)+SUMIF($G$201:$G$240,1112,$L$201:$L$240)),0)","v":{"$error":"#REF!"}},{"$f":"IF(OR(G187=1111,G187=2729),#REF!*L187/(SUMIF($G$142:$G$190,2729,$L$142:$L$190)+SUMIF($G$201:$G$240,2729,$L$201:$L$240)+SUMIF($G$142:$G$190,1111,$L$142:$L$190)+SUMIF($G$201:$G$240,1111,$L$201:$L$240)),0)","v":{"$error":"#REF!"}},null,null,null,null,null,null,null,null,null,null,null,"-",{"$error":"#REF!"},null,58]
[{"$error":"#REF!"},{"$error":"#REF!"},3,{"$error":"#REF!"},{"$error":"#REF!"},{"$error":"#REF!"},{"$f":"IF(#REF!=\"\",0,VLOOKUP(#REF!,#REF!,2,FALSE))","v":{"$error":"#REF!"}},{"$f":"IF(#REF!=\"\",0,VLOOKUP(#REF!,#REF!,2,FALSE))","v":{"$error":"#REF!"}},{"$f":"IF(#REF!=\"\",0,VLOOKUP(#REF!,#REF!,2,FALSE))","v":{"$error":"#REF!"}},"00","DPM",{"$f":"#REF!","v":{"$error":"#REF!"}},{"$f":"#REF!","v":{"$error":"#REF!"}},{"$f":"#REF!","v":{"$error":"#REF!"}},{"$f":"#REF!","v":{"$error":"#REF!"}},null,null,{"$f":"#REF!","v":{"$error":"#REF!"}},{"$f":"IF(G188=1112,#REF!*L188/(SUMIF($G$142:$G$190,1112,$L$142:$L$190)+SUMIF($G$201:$G$240,1112,$L$201:$L$240)),0)","v":{"$error":"#REF!"}},{"$f":"IF(OR(G188=1111,G188=2729),#REF!*L188/(SUMIF($G$142:$G$190,2729,$L$142:$L$190)+SUMIF($G$201:$G$240,2729,$L$201:$L$240)+SUMIF($G$142:$G$190,1111,$L$142:$L$190)+SUMIF($G$201:$G$240,1111,$L$201:$L$240)),0)","v":{"$error":"#REF!"}},null,null,null,null,null,null,null,null,null,null,null,"-",{"$error":"#REF!"},null,59]
[{"$error":"#REF!"},{"$error":"#REF!"},3,{"$error":"#REF!"},{"$error":"#REF!"},{"$error":"#REF!"},{"$f":"IF(#REF!=\"\",0,VLOOKUP(#REF!,#REF!,2,FALSE))","v":{"$error":"#REF!"}},{"$f":"IF(#REF!=\"\",0,VLOOKUP(#REF!,#REF!,2,FALSE))","v":{"$error":"#REF!"}},{"$f":"IF(#REF!=\"\",0,VLOOKUP(#REF!,#REF!,2,FALSE))","v":{"$error":"#REF!"}},"00","DPM",{"$f":"#REF!","v":{"$error":"#REF!"}},{"$f":"#REF!","v":{"$error":"#REF!"}},{"$f":"#REF!","v":{"$error":"#REF!"}},{"$f":"#REF!","v":{"$error":"#REF!"}},null,null,{"$f":"#REF!","v":{"$error":"#REF!"}},{"$f":"IF(G189=1112,#REF!*L189/(SUMIF($G$142:$G$190,1112,$L$142:$L$190)+SUMIF($G$201:$G$240,1112,$L$201:$L$240)),0)","v":{"$error":"#REF!"}},{"$f":"IF(OR(G189=1111,G189=2729),#REF!*L189/(SUMIF($G$142:$G$190,2729,$L$142:$L$190)+SUMIF($G$201:$G$240,2729,$L$201:$L$240)+SUMIF($G$142:$G$190,1111,$L$142:$L$190)+SUMIF($G$201:$G$240,1111,$L$201:$L$240)),0)","v":{"$error":"#REF!"}},null,null,null,null,null,null,null,null,null,null,null,"-",{"$error":"#REF!"},null,60]
[{"$error":"#REF!"},{"$error":"#REF!"},3,{"$error":"#REF!"},{"$error":"#REF!"},{"$error":"#REF!"},{"$f":"IF(#REF!=\"\",0,VLOOKUP(#REF!,#REF!,2,FALSE))","v":{"$error":"#REF!"}},{"$f":"IF(#REF!=\"\",0,VLOOKUP(#REF!,#REF!,2,FALSE))","v":{"$error":"#REF!"}},{"$f":"IF(#REF!=\"\",0,VLOOKUP(#REF!,#REF!,2,FALSE))","v":{"$error":"#REF!"}},"00","DPM",{"$f":"#REF!","v":{"$error":"#REF!"}},{"$f":"#REF!","v":{"$error":"#REF!"}},{"$f":"#REF!","v":{"$error":"#REF!"}},{"$f":"#REF!","v":{"$error":"#REF!"}},null,null,{"$f":"#REF!","v":{"$error":"#REF!"}},{"$f":"IF(G190=1112,#REF!*L190/(SUMIF($G$142:$G$190,1112,$L$142:$L$190)+SUMIF($G$201:$G$240,1112,$L$201:$L$240)),0)","v":{"$error":"#REF!"}},{"$f":"IF(OR(G190=1111,G190=2729),#REF!*L190/(SUMIF($G$142:$G$190,2729,$L$142:$L$190)+SUMIF($G$201:$G$240,2729,$L$201:$L$240)+SUMIF($G$142:$G$190,1111,$L$142:$L$190)+SUMIF($G$201:$G$240,1111,$L$201:$L$240)),0)","v":{"$error":"#REF!"}},null,null,null,null,null,null,null,null,null,null,null,"-",{"$error":"#REF!"},null,61]
[{"$error":"#REF!"},{"$error":"#REF!"},3,{"$error":"#REF!"},{"$error":"#REF!"},{"$error":"#REF!"},{"$f":"IF(#REF!<>\"\",9990,0)","v":{"$error":"#REF!"}},{"$f":"IF(#REF!=\"\",0,VLOOKUP(#REF!,#REF!,2,FALSE))","v":{"$error":"#REF!"}},"#LK","00","DPM",{"$f":"#REF!","v":{"$error":"#REF!"}},{"$f":"#REF!","v":{"$error":"#REF!"}},{"$f":"#REF!","v":{"$error":"#REF!"}},null,{"$f":"#REF!","v":{"$error":"#REF!"}},null,{"$f":"#REF!","v":{"$error":"#REF!"}},null,null,null,null,null,null,null,null,null,null,null,null,null,{"$f":"IF(#REF!<>\"\",#REF!,\"-\")","v":{"$error":"#REF!"}},{"$error":"#REF!"},"Sheet 19 Non SBS Nominee'!F66 / G66 / H66 / I66 / J66",66]
[{"$error":"#REF!"},{"$error":"#REF!"},3,{"$error":"#REF!"},{"$error":"#REF!"},{"$error":"#REF!"},{"$f":"IF(#REF!<>\"\",9990,0)","v":{"$error":"#REF!"}},{"$f":"IF(#REF!=\"\",0,VLOOKUP(#REF!,#REF!,2,FALSE))","v":{"$error":"#REF!"}},"#LK","00","DPM",{"$f":"#REF!","v":{"$error":"#REF!"}},{"$f":"#REF!","v":{"$error":"#REF!"}},{"$f":"#REF!","v":{"$error":"#REF!"}},null,{"$f":"#REF!","v":{"$error":"#REF!"}},null,{"$f":"#REF!","v":{"$error":"#REF!"}},null,null,null,null,null,null,null,null,null,null,null,null,null,{"$f":"IF(#REF!<>\"\",#REF!,\"-\")","v":{"$error":"#REF!"}},{"$error":"#REF!"},null,67]
[{"$error":"#REF!"},{"$error":"#REF!"},3,{"$error":"#REF!"},{"$error":"#REF!"},{"$error":"#REF!"},{"$f":"IF(#REF!<>\"\",9990,0)","v":{"$error":"#REF!"}},{"$f":"IF(#REF!=\"\",0,VLOOKUP(#REF!,#REF!,2,FALSE))","v":{"$error":"#REF!"}},"#LK","00","DPM",{"$f":"#REF!","v":{"$error":"#REF!"}},{"$f":"#REF!","v":{"$error":"#REF!"}},{"$f":"#REF!","v":{"$error":"#REF!"}},null,{"$f":"#REF!","v":{"$error":"#REF!"}},null,{"$f":"#REF!","v":{"$error":"#REF!"}},null,null,null,null,null,null,null,null,null,null,null,null,null,{"$f":"IF(#REF!<>\"\",#REF!,\"-\")","v":{"$error":"#REF!"}},{"$error":"#REF!"},null,68]
[{"$error":"#REF!"},{"$error":"#REF!"},3,{"$error":"#REF!"},{"$error":"#REF!"},{"$error":"#REF!"},{"$f":"IF(#REF!<>\"\",9990,0)","v":{"$error":"#REF!"}},{"$f":"IF(#REF!=\"\",0,VLOOKUP(#REF!,#REF!,2,FALSE))","v":{"$error":"#REF!"}},"#LK","00","DPM",{"$f":"#REF!","v":{"$error":"#REF!"}},{"$f":"#REF!","v":{"$error":"#REF!"}},{"$f":"#REF!","v":{"$error":"#REF!"}},null,{"$f":"#REF!","v":{"$error":"#REF!"}},null,{"$f":"#REF!","v":{"$error":"#REF!"}},null,null,null,null,null,null,null,null,null,null,null,null,null,{"$f":"IF(#REF!<>\"\",#REF!,\"-\")","v":{"$error":"#REF!"}},{"$f":"IF(OR(ABS(L194)>=0.55,ABS(M194)>=0.55,ABS(N194)>=0.55,ABS(O194)>=0.55,ABS(P194)>=0.55,ABS(Q194)>=0.55,ABS(R194)>=0.55,ABS(S194)>=0.55,ABS(T194)>=0.55,ABS(U194)>=0.55,ABS(V194)>=0.55,ABS(W194)>=0.55,ABS(X194)>=0.55,ABS(Y194)>=0.55,ABS(Z194)>=0.55,ABS(AA194)>=0.55,ABS(AB194)>=0.55,ABS(AC194)>=0.55,ABS(AD194)>=0.55,ABS(AE194)>=0.55),0,1)","v":{"$error":"#REF!"}},null,69]
[{"$f":"$A$2","v":{"$error":"#REF!"}},{"$f":"$B$2","v":{"$error":"#REF!"}},3,{"$f":"$D$2","v":{"$error":"#REF!"}},{"$f":"$E$2","v":{"$error":"#REF!"}},{"$f":"$F$2","v":{"$error":"#REF!"}},{"$f":"IF(#REF!<>\"\",9990,0)","v":{"$error":"#REF!"}},{"$f":"IF(#REF!=\"\",0,VLOOKUP(#REF!,#REF!,2,FALSE))","v":{"$error":"#REF!"}},"#LK","00","DPM",{"$f":"#REF!","v":{"$error":"#REF!"}},{"$f":"#REF!","v":{"$error":"#REF!"}},{"$f":"#REF!","v":{"$error":"#REF!"}},null,{"$f":"#REF!","v":{"$error":"#REF!"}},null,{"$f":"#REF!","v":{"$error":"#REF!"}},null,null,null,null,null,null,null,null,null,null,null,null,null,{"$f":"IF(#REF!<>\"\",#REF!,\"-\")","v":{"$error":"#REF!"}},{"$error":"#REF!"},null,70]
[{"$error":"#REF!"},{"$error":"#REF!"},3,{"$error":"#REF!"},{"$error":"#REF!"},{"$error":"#REF!"},{"$f":"IF(#REF!<>\"\",9990,0)","v":{"$error":"#REF!"}},{"$f":"IF(#REF!=\"\",0,VLOOKUP(#REF!,#REF!,2,FALSE))","v":{"$error":"#REF!"}},"#LK","00","DPM",{"$f":"#REF!","v":{"$error":"#REF!"}},{"$f":"#REF!","v":{"$error":"#REF!"}},{"$f":"#REF!","v":{"$error":"#REF!"}},null,{"$f":"#REF!","v":{"$error":"#REF!"}},null,{"$f":"#REF!","v":{"$error":"#REF!"}},null,null,null,null,null,null,null,null,null,null,null,null,null,{"$f":"IF(#REF!<>\"\",#REF!,\"-\")","v":{"$error":"#REF!"}},{"$error":"#REF!"},null,71]
[{"$error":"#REF!"},{"$error":"#REF!"},3,{"$error":"#REF!"},{"$error":"#REF!"},{"$error":"#REF!"},{"$f":"IF(#REF!<>\"\",9990,0)","v":{"$error":"#REF!"}},{"$f":"IF(#REF!=\"\",0,VLOOKUP(#REF!,#REF!,2,FALSE))","v":{"$error":"#REF!"}},"#LK","00","DPM",{"$f":"#REF!","v":{"$error":"#REF!"}},{"$f":"#REF!","v":{"$error":"#REF!"}},{"$f":"#REF!","v":{"$error":"#REF!"}},null,{"$f":"#REF!","v":{"$error":"#REF!"}},null,{"$f":"#REF!","v":{"$error":"#REF!"}},null,null,null,null,null,null,null,null,null,null,null,null,null,{"$f":"IF(#REF!<>\"\",#REF!,\"-\")","v":{"$error":"#REF!"}},{"$error":"#REF!"},null,72]
[{"$error":"#REF!"},{"$error":"#REF!"},3,{"$error":"#REF!"},{"$error":"#REF!"},{"$error":"#REF!"},{"$f":"IF(#REF!<>\"\",9990,0)","v":{"$error":"#REF!"}},{"$f":"IF(#REF!=\"\",0,VLOOKUP(#REF!,#REF!,2,FALSE))","v":{"$error":"#REF!"}},"#LK","00","DPM",{"$f":"#REF!","v":{"$error":"#REF!"}},{"$f":"#REF!","v":{"$error":"#REF!"}},{"$f":"#REF!","v":{"$error":"#REF!"}},null,{"$f":"#REF!","v":{"$error":"#REF!"}},null,{"$f":"#REF!","v":{"$error":"#REF!"}},null,null,null,null,null,null,null,null,null,null,null,null,null,{"$f":"IF(#REF!<>\"\",#REF!,\"-\")","v":{"$error":"#REF!"}},{"$error":"#REF!"},null,73]
[{"$error":"#REF!"},{"$error":"#REF!"},3,{"$error":"#REF!"},{"$error":"#REF!"},{"$error":"#REF!"},{"$f":"IF(#REF!<>\"\",9990,0)","v":{"$error":"#REF!"}},{"$f":"IF(#REF!=\"\",0,VLOOKUP(#REF!,#REF!,2,FALSE))","v":{"$error":"#REF!"}},"#LK","00","DPM",{"$f":"#REF!","v":{"$error":"#REF!"}},{"$f":"#REF!","v":{"$error":"#REF!"}},{"$f":"#REF!","v":{"$error":"#REF!"}},null,{"$f":"#REF!","v":{"$error":"#REF!"}},null,{"$f":"#REF!","v":{"$error":"#REF!"}},null,null,null,null,null,null,null,null,null,null,null,null,null,{"$f":"IF(#REF!<>\"\",#REF!,\"-\")","v":{"$error":"#REF!"}},{"$error":"#REF!"},null,74]
[{"$error":"#REF!"},{"$error":"#REF!"},3,{"$error":"#REF!"},{"$error":"#REF!"},{"$error":"#REF!"},{"$f":"IF(#REF!<>\"\",9990,0)","v":{"$error":"#REF!"}},{"$f":"IF(#REF!=\"\",0,VLOOKUP(#REF!,#REF!,2,FALSE))","v":{"$error":"#REF!"}},"#LK","00","DPM",{"$f":"#REF!","v":{"$error":"#REF!"}},{"$f":"#REF!","v":{"$error":"#REF!"}},{"$f":"#REF!","v":{"$error":"#REF!"}},null,{"$f":"#REF!","v":{"$error":"#REF!"}},null,{"$f":"#REF!","v":{"$error":"#REF!"}},null,null,null,null,null,null,null,null,null,null,null,null,null,{"$f":"IF(#REF!<>\"\",#REF!,\"-\")","v":{"$error":"#REF!"}},{"$error":"#REF!"},null,75]
[{"$error":"#REF!"},{"$error":"#REF!"},4,{"$error":"#REF!"},{"$error":"#REF!"},{"$error":"#REF!"},{"$f":"IF(#REF!=\"\",0,VLOOKUP(#REF!,#REF!,2,FALSE))","v":{"$error":"#REF!"}},{"$f":"IF(#REF!=\"\",0,VLOOKUP(#REF!,#REF!,2,FALSE))","v":{"$error":"#REF!"}},{"$f":"IF(#REF!=\"\",0,VLOOKUP(#REF!,#REF!,2,FALSE))","v":{"$error":"#REF!"}},"00","DPM",{"$f":"#REF!","v":{"$error":"#REF!"}},{"$f":"#REF!","v":{"$error":"#REF!"}},{"$f":"#REF!","v":{"$error":"#REF!"}},null,null,{"$f":"#REF!","v":{"$error":"#REF!"}},{"$f":"#REF!","v":{"$error":"#REF!"}},{"$f":"IF(G201=1112,#REF!*L201/(SUMIF($G$142:$G$190,1112,$L$142:$L$190)+SUMIF($G$201:$G$240,1112,$L$201:$L$240)),0)","v":{"$error":"#REF!"}},{"$f":"IF(OR(G201=1111,G201=2729),#REF!*L201/(SUMIF($G$142:$G$190,2729,$L$142:$L$190)+SUMIF($G$201:$G$240,2729,$L$201:$L$240)+SUMIF($G$142:$G$190,1111,$L$142:$L$190)+SUMIF($G$201:$G$240,1111,$L$201:$L$240)),0)","v":{"$error":"#REF!"}},null,null,null,null,null,null,null,null,null,null,null,"-",{"$error":"#REF!"},"Sheet 19 Non SBS Nominee'!F81 / G81 / H81 / I81 / J81 /",81]
[{"$error":"#REF!"},{"$error":"#REF!"},4,{"$error":"#REF!"},{"$error":"#REF!"},{"$error":"#REF!"},{"$f":"IF(#REF!=\"\",0,VLOOKUP(#REF!,#REF!,2,FALSE))","v":{"$error":"#REF!"}},{"$f":"IF(#REF!=\"\",0,VLOOKUP(#REF!,#REF!,2,FALSE))","v":{"$error":"#REF!"}},{"$f":"IF(#REF!=\"\",0,VLOOKUP(#REF!,#REF!,2,FALSE))","v":{"$error":"#REF!"}},"00","DPM",{"$f":"#REF!","v":{"$error":"#REF!"}},{"$f":"#REF!","v":{"$error":"#REF!"}},{"$f":"#REF!","v":{"$error":"#REF!"}},null,null,{"$f":"#REF!","v":{"$error":"#REF!"}},{"$f":"#REF!","v":{"$error":"#REF!"}},{"$f":"IF(G202=1112,#REF!*L202/(SUMIF($G$142:$G$190,1112,$L$142:$L$190)+SUMIF($G$201:$G$240,1112,$L$201:$L$240)),0)","v":{"$error":"#REF!"}},{"$f":"IF(OR(G202=1111,G202=2729),#REF!*L202/(SUMIF($G$142:$G$190,2729,$L$142:$L$190)+SUMIF($G$201:$G$240,2729,$L$201:$L$240)+SUMIF($G$142:$G$190,1111,$L$142:$L$190)+SUMIF($G$201:$G$240,1111,$L$201:$L$240)),0)","v":{"$error":"#REF!"}},null,null,null,null,null,null,null,null,null,null,null,"-",{"$error":"#REF!"},"       'Sheet 24 Income & services'!$E$15 / 'Sheet 24 Income & services'!$E$16",82]
[{"$error":"#REF!"},{"$error":"#REF!"},4,{"$error":"#REF!"},{"$error":"#REF!"},{"$error":"#REF!"},{"$f":"IF(#REF!=\"\",0,VLOOKUP(#REF!,#REF!,2,FALSE))","v":{"$error":"#REF!"}},{"$f":"IF(#REF!=\"\",0,VLOOKUP(#REF!,#REF!,2,FALSE))","v":{"$error":"#REF!"}},{"$f":"IF(#REF!=\"\",0,VLOOKUP(#REF!,#REF!,2,FALSE))","v":{"$error":"#REF!"}},"00","DPM",{"$f":"#REF!","v":{"$error":"#REF!"}},{"$f":"#REF!","v":{"$error":"#REF!"}},{"$f":"#REF!","v":{"$error":"#REF!"}},null,null,{"$f":"#REF!","v":{"$error":"#REF!"}},{"$f":"#REF!","v":{"$error":"#REF!"}},{"$f":"IF(G203=1112,#REF!*L203/(SUMIF($G$142:$G$190,1112,$L$142:$L$190)+SUMIF($G$201:$G$240,1112,$L$201:$L$240)),0)","v":{"$error":"#REF!"}},{"$f":"IF(OR(G203=1111,G203=2729),#REF!*L203/(SUMIF($G$142:$G$190,2729,$L$142:$L$190)+SUMIF($G$201:$G$240,2729,$L$201:$L$240)+SUMIF($G$142:$G$190,1111,$L$142:$L$190)+SUMIF($G$201:$G$240,1111,$L$201:$L$240)),0)","v":{"$error":"#REF!"}},null,null,null,null,null,null,null,null,null,null,null,"-",{"$error":"#REF!"},null,83]
[{"$error":"#REF!"},{"$error":"#REF!"},4,{"$error":"#REF!"},{"$error":"#REF!"},{"$error":"#REF!"},{"$f":"IF(#REF!=\"\",0,VLOOKUP(#REF!,#REF!,2,FALSE))","v":{"$error":"#REF!"}},{"$f":"IF(#REF!=\"\",0,VLOOKUP(#REF!,#REF!,2,FALSE))","v":{"$error":"#REF!"}},{"$f":"IF(#REF!=\"\",0,VLOOKUP(#REF!,#REF!,2,FALSE))","v":{"$error":"#REF!"}},"00","DPM",{"$f":"#REF!","v":{"$error":"#REF!"}},{"$f":"#REF!","v":{"$error":"#REF!"}},{"$f":"#REF!","v":{"$error":"#REF!"}},null,null,{"$f":"#REF!","v":{"$error":"#REF!"}},{"$f":"#REF!","v":{"$error":"#REF!"}},{"$f":"IF(G204=1112,#REF!*L204/(SUMIF($G$142:$G$190,1112,$L$142:$L$190)+SUMIF($G$201:$G$240,1112,$L$201:$L$240)),0)","v":{"$error":"#REF!"}},{"$f":"IF(OR(G204=1111,G204=2729),#REF!*L204/(SUMIF($G$142:$G$190,2729,$L$142:$L$190)+SUMIF($G$201:$G$240,2729,$L$201:$L$240)+SUMIF($G$142:$G$190,1111,$L$142:$L$190)+SUMIF($G$201:$G$240,1111,$L$201:$L$240)),0)","v":{"$error":"#REF!"}},null,null,null,null,null,null,null,null,null,null,null,"-",{"$error":"#REF!"},null,84]
[{"$error":"#REF!"},{"$error":"#REF!"},4,{"$error":"#REF!"},{"$error":"#REF!"},{"$error":"#REF!"},{"$f":"IF(#REF!=\"\",0,VLOOKUP(#REF!,#REF!,2,FALSE))","v":{"$error":"#REF!"}},{"$f":"IF(#REF!=\"\",0,VLOOKUP(#REF!,#REF!,2,FALSE))","v":{"$error":"#REF!"}},{"$f":"IF(#REF!=\"\",0,VLOOKUP(#REF!,#REF!,2,FALSE))","v":{"$error":"#REF!"}},"00","DPM",{"$f":"#REF!","v":{"$error":"#REF!"}},{"$f":"#REF!","v":{"$error":"#REF!"}},{"$f":"#REF!","v":{"$error":"#REF!"}},null,null,{"$f":"#REF!","v":{"$error":"#REF!"}},{"$f":"#REF!","v":{"$error":"#REF!"}},{"$f":"IF(G205=1112,#REF!*L205/(SUMIF($G$142:$G$190,1112,$L$142:$L$190)+SUMIF($G$201:$G$240,1112,$L$201:$L$240)),0)","v":{"$error":"#REF!"}},{"$f":"IF(OR(G205=1111,G205=2729),#REF!*L205/(SUMIF($G$142:$G$190,2729,$L$142:$L$190)+SUMIF($G$201:$G$240,2729,$L$201:$L$240)+SUMIF($G$142:$G$190,1111,$L$142:$L$190)+SUMIF($G$201:$G$240,1111,$L$201:$L$240)),0)","v":{"$error":"#REF!"}},null,null,null,null,null,null,null,null,null,null,null,"-",{"$error":"#REF!"},null,85]
[{"$error":"#REF!"},{"$error":"#REF!"},4,{"$error":"#REF!"},{"$error":"#REF!"},{"$error":"#REF!"},{"$f":"IF(#REF!=\"\",0,VLOOKUP(#REF!,#REF!,2,FALSE))","v":{"$error":"#REF!"}},{"$f":"IF(#REF!=\"\",0,VLOOKUP(#REF!,#REF!,2,FALSE))","v":{"$error":"#REF!"}},{"$f":"IF(#REF!=\"\",0,VLOOKUP(#REF!,#REF!,2,FALSE))","v":{"$error":"#REF!"}},"00","DPM",{"$f":"#REF!","v":{"$error":"#REF!"}},{"$f":"#REF!","v":{"$error":"#REF!"}},{"$f":"#REF!","v":{"$error":"#REF!"}},null,null,{"$f":"#REF!","v":{"$error":"#REF!"}},{"$f":"#REF!","v":{"$error":"#REF!"}},{"$f":"IF(G206=1112,#REF!*L206/(SUMIF($G$142:$G$190,1112,$L$142:$L$190)+SUMIF($G$201:$G$240,1112,$L$201:$L$240)),0)","v":{"$error":"#REF!"}},{"$f":"IF(OR(G206=1111,G206=2729),#REF!*L206/(SUMIF($G$142:$G$190,2729,$L$142:$L$190)+SUMIF($G$201:$G$240,2729,$L$201:$L$240)+SUMIF($G$142:$G$190,1111,$L$142:$L$190)+SUMIF($G$201:$G$240,1111,$L$201:$L$240)),0)","v":{"$error":"#REF!"}},null,null,null,null,null,null,null,null,null,null,null,"-",{"$error":"#REF!"},null,86]
[{"$error":"#REF!"},{"$error":"#REF!"},4,{"$error":"#REF!"},{"$error":"#REF!"},{"$error":"#REF!"},{"$f":"IF(#REF!=\"\",0,VLOOKUP(#REF!,#REF!,2,FALSE))","v":{"$error":"#REF!"}},{"$f":"IF(#REF!=\"\",0,VLOOKUP(#REF!,#REF!,2,FALSE))","v":{"$error":"#REF!"}},{"$f":"IF(#REF!=\"\",0,VLOOKUP(#REF!,#REF!,2,FALSE))","v":{"$error":"#REF!"}},"00","DPM",{"$f":"#REF!","v":{"$error":"#REF!"}},{"$f":"#REF!","v":{"$error":"#REF!"}},{"$f":"#REF!","v":{"$error":"#REF!"}},null,null,{"$f":"#REF!","v":{"$error":"#REF!"}},{"$f":"#REF!","v":{"$error":"#REF!"}},{"$f":"IF(G207=1112,#REF!*L207/(SUMIF($G$142:$G$190,1112,$L$142:$L$190)+SUMIF($G$201:$G$240,1112,$L$201:$L$240)),0)","v":{"$error":"#REF!"}},{"$f":"IF(OR(G207=1111,G207=2729),#REF!*L207/(SUMIF($G$142:$G$190,2729,$L$142:$L$190)+SUMIF($G$201:$G$240,2729,$L$201:$L$240)+SUMIF($G$142:$G$190,1111,$L$142:$L$190)+SUMIF($G$201:$G$240,1111,$L$201:$L$240)),0)","v":{"$error":"#REF!"}},null,null,null,null,null,null,null,null,null,null,null,"-",{"$error":"#REF!"},null,87]
[{"$error":"#REF!"},{"$error":"#REF!"},4,{"$error":"#REF!"},{"$error":"#REF!"},{"$error":"#REF!"},{"$f":"IF(#REF!=\"\",0,VLOOKUP(#REF!,#REF!,2,FALSE))","v":{"$error":"#REF!"}},{"$f":"IF(#REF!=\"\",0,VLOOKUP(#REF!,#REF!,2,FALSE))","v":{"$error":"#REF!"}},{"$f":"IF(#REF!=\"\",0,VLOOKUP(#REF!,#REF!,2,FALSE))","v":{"$error":"#REF!"}},"00","DPM",{"$f":"#REF!","v":{"$error":"#REF!"}},{"$f":"#REF!","v":{"$error":"#REF!"}},{"$f":"#REF!","v":{"$error":"#REF!"}},null,null,{"$f":"#REF!","v":{"$error":"#REF!"}},{"$f":"#REF!","v":{"$error":"#REF!"}},{"$f":"IF(G208=1112,#REF!*L208/(SUMIF($G$142:$G$190,1112,$L$142:$L$190)+SUMIF($G$201:$G$240,1112,$L$201:$L$240)),0)","v":{"$error":"#REF!"}},{"$f":"IF(OR(G208=1111,G208=2729),#REF!*L208/(SUMIF($G$142:$G$190,2729,$L$142:$L$190)+SUMIF($G$201:$G$240,2729,$L$201:$L$240)+SUMIF($G$142:$G$190,1111,$L$142:$L$190)+SUMIF($G$201:$G$240,1111,$L$201:$L$240)),0)","v":{"$error":"#REF!"}},null,null,null,null,null,null,null,null,null,null,null,"-",{"$error":"#REF!"},null,88]
[{"$error":"#REF!"},{"$error":"#REF!"},4,{"$error":"#REF!"},{"$error":"#REF!"},{"$error":"#REF!"},{"$f":"IF(#REF!=\"\",0,VLOOKUP(#REF!,#REF!,2,FALSE))","v":{"$error":"#REF!"}},{"$f":"IF(#REF!=\"\",0,VLOOKUP(#REF!,#REF!,2,FALSE))","v":{"$error":"#REF!"}},{"$f":"IF(#REF!=\"\",0,VLOOKUP(#REF!,#REF!,2,FALSE))","v":{"$error":"#REF!"}},"00","DPM",{"$f":"#REF!","v":{"$error":"#REF!"}},{"$f":"#REF!","v":{"$error":"#REF!"}},{"$f":"#REF!","v":{"$error":"#REF!"}},null,null,{"$f":"#REF!","v":{"$error":"#REF!"}},{"$f":"#REF!","v":{"$error":"#REF!"}},{"$f":"IF(G209=1112,#REF!*L209/(SUMIF($G$142:$G$190,1112,$L$142:$L$190)+SUMIF($G$201:$G$240,1112,$L$201:$L$240)),0)","v":{"$error":"#REF!"}},{"$f":"IF(OR(G209=1111,G209=2729),#REF!*L209/(SUMIF($G$142:$G$190,2729,$L$142:$L$190)+SUMIF($G$201:$G$240,2729,$L$201:$L$240)+SUMIF($G$142:$G$190,1111,$L$142:$L$190)+SUMIF($G$201:$G$240,1111,$L$201:$L$240)),0)","v":{"$error":"#REF!"}},null,null,null,null,null,null,null,null,null,null,null,"-",{"$error":"#REF!"},null,89]
[{"$error":"#REF!"},{"$error":"#REF!"},4,{"$error":"#REF!"},{"$error":"#REF!"},{"$error":"#REF!"},{"$f":"IF(#REF!=\"\",0,VLOOKUP(#REF!,#REF!,2,FALSE))","v":{"$error":"#REF!"}},{"$f":"IF(#REF!=\"\",0,VLOOKUP(#REF!,#REF!,2,FALSE))","v":{"$error":"#REF!"}},{"$f":"IF(#REF!=\"\",0,VLOOKUP(#REF!,#REF!,2,FALSE))","v":{"$error":"#REF!"}},"00","DPM",{"$f":"#REF!","v":{"$error":"#REF!"}},{"$f":"#REF!","v":{"$error":"#REF!"}},{"$f":"#REF!","v":{"$error":"#REF!"}},null,null,{"$f":"#REF!","v":{"$error":"#REF!"}},{"$f":"#REF!","v":{"$error":"#REF!"}},{"$f":"IF(G210=1112,#REF!*L210/(SUMIF($G$142:$G$190,1112,$L$142:$L$190)+SUMIF($G$201:$G$240,1112,$L$201:$L$240)),0)","v":{"$error":"#REF!"}},{"$f":"IF(OR(G210=1111,G210=2729),#REF!*L210/(SUMIF($G$142:$G$190,2729,$L$142:$L$190)+SUMIF($G$201:$G$240,2729,$L$201:$L$240)+SUMIF($G$142:$G$190,1111,$L$142:$L$190)+SUMIF($G$201:$G$240,1111,$L$201:$L$240)),0)","v":{"$error":"#REF!"}},null,null,null,null,null,null,null,null,null,null,null,"-",{"$error":"#REF!"},null,90]
[{"$error":"#REF!"},{"$error":"#REF!"},4,{"$error":"#REF!"},{"$error":"#REF!"},{"$error":"#REF!"},{"$f":"IF(#REF!=\"\",0,VLOOKUP(#REF!,#REF!,2,FALSE))","v":{"$error":"#REF!"}},{"$f":"IF(#REF!=\"\",0,VLOOKUP(#REF!,#REF!,2,FALSE))","v":{"$error":"#REF!"}},{"$f":"IF(#REF!=\"\",0,VLOOKUP(#REF!,#REF!,2,FALSE))","v":{"$error":"#REF!"}},"00","DPM",{"$f":"#REF!","v":{"$error":"#REF!"}},{"$f":"#REF!","v":{"$error":"#REF!"}},{"$f":"#REF!","v":{"$error":"#REF!"}},null,null,{"$f":"#REF!","v":{"$error":"#REF!"}},{"$f":"#REF!","v":{"$error":"#REF!"}},{"$f":"IF(G211=1112,#REF!*L211/(SUMIF($G$142:$G$190,1112,$L$142:$L$190)+SUMIF($G$201:$G$240,1112,$L$201:$L$240)),0)","v":{"$error":"#REF!"}},{"$f":"IF(OR(G211=1111,G211=2729),#REF!*L211/(SUMIF($G$142:$G$190,2729,$L$142:$L$190)+SUMIF($G$201:$G$240,2729,$L$201:$L$240)+SUMIF($G$142:$G$190,1111,$L$142:$L$190)+SUMIF($G$201:$G$240,1111,$L$201:$L$240)),0)","v":{"$error":"#REF!"}},null,null,null,null,null,null,null,null,null,null,null,"-",{"$error":"#REF!"},null,91]
[{"$error":"#REF!"},{"$error":"#REF!"},4,{"$error":"#REF!"},{"$error":"#REF!"},{"$error":"#REF!"},{"$f":"IF(#REF!=\"\",0,VLOOKUP(#REF!,#REF!,2,FALSE))","v":{"$error":"#REF!"}},{"$f":"IF(#REF!=\"\",0,VLOOKUP(#REF!,#REF!,2,FALSE))","v":{"$error":"#REF!"}},{"$f":"IF(#REF!=\"\",0,VLOOKUP(#REF!,#REF!,2,FALSE))","v":{"$error":"#REF!"}},"00","DPM",{"$f":"#REF!","v":{"$error":"#REF!"}},{"$f":"#REF!","v":{"$error":"#REF!"}},{"$f":"#REF!","v":{"$error":"#REF!"}},null,null,{"$f":"#REF!","v":{"$error":"#REF!"}},{"$f":"#REF!","v":{"$error":"#REF!"}},{"$f":"IF(G212=1112,#REF!*L212/(SUMIF($G$142:$G$190,1112,$L$142:$L$190)+SUMIF($G$201:$G$240,1112,$L$201:$L$240)),0)","v":{"$error":"#REF!"}},{"$f":"IF(OR(G212=1111,G212=2729),#REF!*L212/(SUMIF($G$142:$G$190,2729,$L$142:$L$190)+SUMIF($G$201:$G$240,2729,$L$201:$L$240)+SUMIF($G$142:$G$190,1111,$L$142:$L$190)+SUMIF($G$201:$G$240,1111,$L$201:$L$240)),0)","v":{"$error":"#REF!"}},null,null,null,null,null,null,null,null,null,null,null,"-",{"$error":"#REF!"},null,92]
[{"$error":"#REF!"},{"$error":"#REF!"},4,{"$error":"#REF!"},{"$error":"#REF!"},{"$error":"#REF!"},{"$f":"IF(#REF!=\"\",0,VLOOKUP(#REF!,#REF!,2,FALSE))","v":{"$error":"#REF!"}},{"$f":"IF(#REF!=\"\",0,VLOOKUP(#REF!,#REF!,2,FALSE))","v":{"$error":"#REF!"}},{"$f":"IF(#REF!=\"\",0,VLOOKUP(#REF!,#REF!,2,FALSE))","v":{"$error":"#REF!"}},"00","DPM",{"$f":"#REF!","v":{"$error":"#REF!"}},{"$f":"#REF!","v":{"$error":"#REF!"}},{"$f":"#REF!","v":{"$error":"#REF!"}},null,null,{"$f":"#REF!","v":{"$error":"#REF!"}},{"$f":"#REF!","v":{"$error":"#REF!"}},{"$f":"IF(G213=1112,#REF!*L213/(SUMIF($G$142:$G$190,1112,$L$142:$L$190)+SUMIF($G$201:$G$240,1112,$L$201:$L$240)),0)","v":{"$error":"#REF!"}},{"$f":"IF(OR(G213=1111,G213=2729),#REF!*L213/(SUMIF($G$142:$G$190,2729,$L$142:$L$190)+SUMIF($G$201:$G$240,2729,$L$201:$L$240)+SUMIF($G$142:$G$190,1111,$L$142:$L$190)+SUMIF($G$201:$G$240,1111,$L$201:$L$240)),0)","v":{"$error":"#REF!"}},null,null,null,null,null,null,null,null,null,null,null,"-",{"$error":"#REF!"},null,93]
[{"$error":"#REF!"},{"$error":"#REF!"},4,{"$error":"#REF!"},{"$error":"#REF!"},{"$error":"#REF!"},{"$f":"IF(#REF!=\"\",0,VLOOKUP(#REF!,#REF!,2,FALSE))","v":{"$error":"#REF!"}},{"$f":"IF(#REF!=\"\",0,VLOOKUP(#REF!,#REF!,2,FALSE))","v":{"$error":"#REF!"}},{"$f":"IF(#REF!=\"\",0,VLOOKUP(#REF!,#REF!,2,FALSE))","v":{"$error":"#REF!"}},"00","DPM",{"$f":"#REF!","v":{"$error":"#REF!"}},{"$f":"#REF!","v":{"$error":"#REF!"}},{"$f":"#REF!","v":{"$error":"#REF!"}},null,null,{"$f":"#REF!","v":{"$error":"#REF!"}},{"$f":"#REF!","v":{"$error":"#REF!"}},{"$f":"IF(G214=1112,#REF!*L214/(SUMIF($G$142:$G$190,1112,$L$142:$L$190)+SUMIF($G$201:$G$240,1112,$L$201:$L$240)),0)","v":{"$error":"#REF!"}},{"$f":"IF(OR(G214=1111,G214=2729),#REF!*L214/(SUMIF($G$142:$G$190,2729,$L$142:$L$190)+SUMIF($G$201:$G$240,2729,$L$201:$L$240)+SUMIF($G$142:$G$190,1111,$L$142:$L$190)+SUMIF($G$201:$G$240,1111,$L$201:$L$240)),0)","v":{"$error":"#REF!"}},null,null,null,null,null,null,null,null,null,null,null,"-",{"$error":"#REF!"},null,94]
[{"$error":"#REF!"},{"$error":"#REF!"},4,{"$error":"#REF!"},{"$error":"#REF!"},{"$error":"#REF!"},{"$f":"IF(#REF!=\"\",0,VLOOKUP(#REF!,#REF!,2,FALSE))","v":{"$error":"#REF!"}},{"$f":"IF(#REF!=\"\",0,VLOOKUP(#REF!,#REF!,2,FALSE))","v":{"$error":"#REF!"}},{"$f":"IF(#REF!=\"\",0,VLOOKUP(#REF!,#REF!,2,FALSE))","v":{"$error":"#REF!"}},"00","DPM",{"$f":"#REF!","v":{"$error":"#REF!"}},{"$f":"#REF!","v":{"$error":"#REF!"}},{"$f":"#REF!","v":{"$error":"#REF!"}},null,null,{"$f":"#REF!","v":{"$error":"#REF!"}},{"$f":"#REF!","v":{"$error":"#REF!"}},{"$f":"IF(G215=1112,#REF!*L215/(SUMIF($G$142:$G$190,1112,$L$142:$L$190)+SUMIF($G$201:$G$240,1112,$L$201:$L$240)),0)","v":{"$error":"#REF!"}},{"$f":"IF(OR(G215=1111,G215=2729),#REF!*L215/(SUMIF($G$142:$G$190,2729,$L$142:$L$190)+SUMIF($G$201:$G$240,2729,$L$201:$L$240)+SUMIF($G$142:$G$190,1111,$L$142:$L$190)+SUMIF($G$201:$G$240,1111,$L$201:$L$240)),0)","v":{"$error":"#REF!"}},null,null,null,null,null,null,null,null,null,null,null,"-",{"$error":"#REF!"},null,95]
[{"$error":"#REF!"},{"$error":"#REF!"},4,{"$error":"#REF!"},{"$error":"#REF!"},{"$error":"#REF!"},{"$f":"IF(#REF!=\"\",0,VLOOKUP(#REF!,#REF!,2,FALSE))","v":{"$error":"#REF!"}},{"$f":"IF(#REF!=\"\",0,VLOOKUP(#REF!,#REF!,2,FALSE))","v":{"$error":"#REF!"}},{"$f":"IF(#REF!=\"\",0,VLOOKUP(#REF!,#REF!,2,FALSE))","v":{"$error":"#REF!"}},"00","DPM",{"$f":"#REF!","v":{"$error":"#REF!"}},{"$f":"#REF!","v":{"$error":"#REF!"}},{"$f":"#REF!","v":{"$error":"#REF!"}},null,null,{"$f":"#REF!","v":{"$error":"#REF!"}},{"$f":"#REF!","v":{"$error":"#REF!"}},{"$f":"IF(G216=1112,#REF!*L216/(SUMIF($G$142:$G$190,1112,$L$142:$L$190)+SUMIF($G$201:$G$240,1112,$L$201:$L$240)),0)","v":{"$error":"#REF!"}},{"$f":"IF(OR(G216=1111,G216=2729),#REF!*L216/(SUMIF($G$142:$G$190,2729,$L$142:$L$190)+SUMIF($G$201:$G$240,2729,$L$201:$L$240)+SUMIF($G$142:$G$190,1111,$L$142:$L$190)+SUMIF($G$201:$G$240,1111,$L$201:$L$240)),0)","v":{"$error":"#REF!"}},null,null,null,null,null,null,null,null,null,null,null,"-",{"$error":"#REF!"},null,96]
[{"$error":"#REF!"},{"$error":"#REF!"},4,{"$error":"#REF!"},{"$error":"#REF!"},{"$error":"#REF!"},{"$f":"IF(#REF!=\"\",0,VLOOKUP(#REF!,#REF!,2,FALSE))","v":{"$error":"#REF!"}},{"$f":"IF(#REF!=\"\",0,VLOOKUP(#REF!,#REF!,2,FALSE))","v":{"$error":"#REF!"}},{"$f":"IF(#REF!=\"\",0,VLOOKUP(#REF!,#REF!,2,FALSE))","v":{"$error":"#REF!"}},"00","DPM",{"$f":"#REF!","v":{"$error":"#REF!"}},{"$f":"#REF!","v":{"$error":"#REF!"}},{"$f":"#REF!","v":{"$error":"#REF!"}},null,null,{"$f":"#REF!","v":{"$error":"#REF!"}},{"$f":"#REF!","v":{"$error":"#REF!"}},{"$f":"IF(G217=1112,#REF!*L217/(SUMIF($G$142:$G$190,1112,$L$142:$L$190)+SUMIF($G$201:$G$240,1112,$L$201:$L$240)),0)","v":{"$error":"#REF!"}},{"$f":"IF(OR(G217=1111,G217=2729),#REF!*L217/(SUMIF($G$142:$G$190,2729,$L$142:$L$190)+SUMIF($G$201:$G$240,2729,$L$201:$L$240)+SUMIF($G$142:$G$190,1111,$L$142:$L$190)+SUMIF($G$201:$G$240,1111,$L$201:$L$240)),0)","v":{"$error":"#REF!"}},null,null,null,null,null,null,null,null,null,null,null,"-",{"$error":"#REF!"},null,97]
[{"$error":"#REF!"},{"$error":"#REF!"},4,{"$error":"#REF!"},{"$error":"#REF!"},{"$error":"#REF!"},{"$f":"IF(#REF!=\"\",0,VLOOKUP(#REF!,#REF!,2,FALSE))","v":{"$error":"#REF!"}},{"$f":"IF(#REF!=\"\",0,VLOOKUP(#REF!,#REF!,2,FALSE))","v":{"$error":"#REF!"}},{"$f":"IF(#REF!=\"\",0,VLOOKUP(#REF!,#REF!,2,FALSE))","v":{"$error":"#REF!"}},"00","DPM",{"$f":"#REF!","v":{"$error":"#REF!"}},{"$f":"#REF!","v":{"$error":"#REF!"}},{"$f":"#REF!","v":{"$error":"#REF!"}},null,null,{"$f":"#REF!","v":{"$error":"#REF!"}},{"$f":"#REF!","v":{"$error":"#REF!"}},{"$f":"IF(G218=1112,#REF!*L218/(SUMIF($G$142:$G$190,1112,$L$142:$L$190)+SUMIF($G$201:$G$240,1112,$L$201:$L$240)),0)","v":{"$error":"#REF!"}},{"$f":"IF(OR(G218=1111,G218=2729),#REF!*L218/(SUMIF($G$142:$G$190,2729,$L$142:$L$190)+SUMIF($G$201:$G$240,2729,$L$201:$L$240)+SUMIF($G$142:$G$190,1111,$L$142:$L$190)+SUMIF($G$201:$G$240,1111,$L$201:$L$240)),0)","v":{"$error":"#REF!"}},null,null,null,null,null,null,null,null,null,null,null,"-",{"$error":"#REF!"},null,98]
[{"$error":"#REF!"},{"$error":"#REF!"},4,{"$error":"#REF!"},{"$error":"#REF!"},{"$error":"#REF!"},{"$f":"IF(#REF!=\"\",0,VLOOKUP(#REF!,#REF!,2,FALSE))","v":{"$error":"#REF!"}},{"$f":"IF(#REF!=\"\",0,VLOOKUP(#REF!,#REF!,2,FALSE))","v":{"$error":"#REF!"}},{"$f":"IF(#REF!=\"\",0,VLOOKUP(#REF!,#REF!,2,FALSE))","v":{"$error":"#REF!"}},"00","DPM",{"$f":"#REF!","v":{"$error":"#REF!"}},{"$f":"#REF!","v":{"$error":"#REF!"}},{"$f":"#REF!","v":{"$error":"#REF!"}},null,null,{"$f":"#REF!","v":{"$error":"#REF!"}},{"$f":"#REF!","v":{"$error":"#REF!"}},{"$f":"IF(G219=1112,#REF!*L219/(SUMIF($G$142:$G$190,1112,$L$142:$L$190)+SUMIF($G$201:$G$240,1112,$L$201:$L$240)),0)","v":{"$error":"#REF!"}},{"$f":"IF(OR(G219=1111,G219=2729),#REF!*L219/(SUMIF($G$142:$G$190,2729,$L$142:$L$190)+SUMIF($G$201:$G$240,2729,$L$201:$L$240)+SUMIF($G$142:$G$190,1111,$L$142:$L$190)+SUMIF($G$201:$G$240,1111,$L$201:$L$240)),0)","v":{"$error":"#REF!"}},null,null,null,null,null,null,null,null,null,null,null,"-",{"$error":"#REF!"},null,99]
[{"$error":"#REF!"},{"$error":"#REF!"},4,{"$error":"#REF!"},{"$error":"#REF!"},{"$error":"#REF!"},{"$f":"IF(#REF!=\"\",0,VLOOKUP(#REF!,#REF!,2,FALSE))","v":{"$error":"#REF!"}},{"$f":"IF(#REF!=\"\",0,VLOOKUP(#REF!,#REF!,2,FALSE))","v":{"$error":"#REF!"}},{"$f":"IF(#REF!=\"\",0,VLOOKUP(#REF!,#REF!,2,FALSE))","v":{"$error":"#REF!"}},"00","DPM",{"$f":"#REF!","v":{"$error":"#REF!"}},{"$f":"#REF!","v":{"$error":"#REF!"}},{"$f":"#REF!","v":{"$error":"#REF!"}},null,null,{"$f":"#REF!","v":{"$error":"#REF!"}},{"$f":"#REF!","v":{"$error":"#REF!"}},{"$f":"IF(G220=1112,#REF!*L220/(SUMIF($G$142:$G$190,1112,$L$142:$L$190)+SUMIF($G$201:$G$240,1112,$L$201:$L$240)),0)","v":{"$error":"#REF!"}},{"$f":"IF(OR(G220=1111,G220=2729),#REF!*L220/(SUMIF($G$142:$G$190,2729,$L$142:$L$190)+SUMIF($G$201:$G$240,2729,$L$201:$L$240)+SUMIF($G$142:$G$190,1111,$L$142:$L$190)+SUMIF($G$201:$G$240,1111,$L$201:$L$240)),0)","v":{"$error":"#REF!"}},null,null,null,null,null,null,null,null,null,null,null,"-",{"$error":"#REF!"},null,100]
[{"$error":"#REF!"},{"$error":"#REF!"},4,{"$error":"#REF!"},{"$error":"#REF!"},{"$error":"#REF!"},{"$f":"IF(#REF!=\"\",0,VLOOKUP(#REF!,#REF!,2,FALSE))","v":{"$error":"#REF!"}},{"$f":"IF(#REF!=\"\",0,VLOOKUP(#REF!,#REF!,2,FALSE))","v":{"$error":"#REF!"}},{"$f":"IF(#REF!=\"\",0,VLOOKUP(#REF!,#REF!,2,FALSE))","v":{"$error":"#REF!"}},"00","DPM",{"$f":"#REF!","v":{"$error":"#REF!"}},{"$f":"#REF!","v":{"$error":"#REF!"}},{"$f":"#REF!","v":{"$error":"#REF!"}},null,null,{"$f":"#REF!","v":{"$error":"#REF!"}},{"$f":"#REF!","v":{"$error":"#REF!"}},{"$f":"IF(G221=1112,#REF!*L221/(SUMIF($G$142:$G$190,1112,$L$142:$L$190)+SUMIF($G$201:$G$240,1112,$L$201:$L$240)),0)","v":{"$error":"#REF!"}},{"$f":"IF(OR(G221=1111,G221=2729),#REF!*L221/(SUMIF($G$142:$G$190,2729,$L$142:$L$190)+SUMIF($G$201:$G$240,2729,$L$201:$L$240)+SUMIF($G$142:$G$190,1111,$L$142:$L$190)+SUMIF($G$201:$G$240,1111,$L$201:$L$240)),0)","v":{"$error":"#REF!"}},null,null,null,null,null,null,null,null,null,null,null,"-",{"$error":"#REF!"},null,101]
[{"$error":"#REF!"},{"$error":"#REF!"},4,{"$error":"#REF!"},{"$error":"#REF!"},{"$error":"#REF!"},{"$f":"IF(#REF!=\"\",0,VLOOKUP(#REF!,#REF!,2,FALSE))","v":{"$error":"#REF!"}},{"$f":"IF(#REF!=\"\",0,VLOOKUP(#REF!,#REF!,2,FALSE))","v":{"$error":"#REF!"}},{"$f":"IF(#REF!=\"\",0,VLOOKUP(#REF!,#REF!,2,FALSE))","v":{"$error":"#REF!"}},"00","DPM",{"$f":"#REF!","v":{"$error":"#REF!"}},{"$f":"#REF!","v":{"$error":"#REF!"}},{"$f":"#REF!","v":{"$error":"#REF!"}},null,null,{"$f":"#REF!","v":{"$error":"#REF!"}},{"$f":"#REF!","v":{"$error":"#REF!"}},{"$f":"IF(G222=1112,#REF!*L222/(SUMIF($G$142:$G$190,1112,$L$142:$L$190)+SUMIF($G$201:$G$240,1112,$L$201:$L$240)),0)","v":{"$error":"#REF!"}},{"$f":"IF(OR(G222=1111,G222=2729),#REF!*L222/(SUMIF($G$142:$G$190,2729,$L$142:$L$190)+SUMIF($G$201:$G$240,2729,$L$201:$L$240)+SUMIF($G$142:$G$190,1111,$L$142:$L$190)+SUMIF($G$201:$G$240,1111,$L$201:$L$240)),0)","v":{"$error":"#REF!"}},null,null,null,null,null,null,null,null,null,null,null,"-",{"$error":"#REF!"},null,102]
[{"$error":"#REF!"},{"$error":"#REF!"},4,{"$error":"#REF!"},{"$error":"#REF!"},{"$error":"#REF!"},{"$f":"IF(#REF!=\"\",0,VLOOKUP(#REF!,#REF!,2,FALSE))","v":{"$error":"#REF!"}},{"$f":"IF(#REF!=\"\",0,VLOOKUP(#REF!,#REF!,2,FALSE))","v":{"$error":"#REF!"}},{"$f":"IF(#REF!=\"\",0,VLOOKUP(#REF!,#REF!,2,FALSE))","v":{"$error":"#REF!"}},"00","DPM",{"$f":"#REF!","v":{"$error":"#REF!"}},{"$f":"#REF!","v":{"$error":"#REF!"}},{"$f":"#REF!","v":{"$error":"#REF!"}},null,null,{"$f":"#REF!","v":{"$error":"#REF!"}},{"$f":"#REF!","v":{"$error":"#REF!"}},{"$f":"IF(G223=1112,#REF!*L223/(SUMIF($G$142:$G$190,1112,$L$142:$L$190)+SUMIF($G$201:$G$240,1112,$L$201:$L$240)),0)","v":{"$error":"#REF!"}},{"$f":"IF(OR(G223=1111,G223=2729),#REF!*L223/(SUMIF($G$142:$G$190,2729,$L$142:$L$190)+SUMIF($G$201:$G$240,2729,$L$201:$L$240)+SUMIF($G$142:$G$190,1111,$L$142:$L$190)+SUMIF($G$201:$G$240,1111,$L$201:$L$240)),0)","v":{"$error":"#REF!"}},null,null,null,null,null,null,null,null,null,null,null,"-",{"$error":"#REF!"},null,103]
[{"$error":"#REF!"},{"$error":"#REF!"},4,{"$error":"#REF!"},{"$error":"#REF!"},{"$error":"#REF!"},{"$f":"IF(#REF!=\"\",0,VLOOKUP(#REF!,#REF!,2,FALSE))","v":{"$error":"#REF!"}},{"$f":"IF(#REF!=\"\",0,VLOOKUP(#REF!,#REF!,2,FALSE))","v":{"$error":"#REF!"}},{"$f":"IF(#REF!=\"\",0,VLOOKUP(#REF!,#REF!,2,FALSE))","v":{"$error":"#REF!"}},"00","DPM",{"$f":"#REF!","v":{"$error":"#REF!"}},{"$f":"#REF!","v":{"$error":"#REF!"}},{"$f":"#REF!","v":{"$error":"#REF!"}},null,null,{"$f":"#REF!","v":{"$error":"#REF!"}},{"$f":"#REF!","v":{"$error":"#REF!"}},{"$f":"IF(G224=1112,#REF!*L224/(SUMIF($G$142:$G$190,1112,$L$142:$L$190)+SUMIF($G$201:$G$240,1112,$L$201:$L$240)),0)","v":{"$error":"#REF!"}},{"$f":"IF(OR(G224=1111,G224=2729),#REF!*L224/(SUMIF($G$142:$G$190,2729,$L$142:$L$190)+SUMIF($G$201:$G$240,2729,$L$201:$L$240)+SUMIF($G$142:$G$190,1111,$L$142:$L$190)+SUMIF($G$201:$G$240,1111,$L$201:$L$240)),0)","v":{"$error":"#REF!"}},null,null,null,null,null,null,null,null,null,null,null,"-",{"$error":"#REF!"},null,104]
[{"$error":"#REF!"},{"$error":"#REF!"},4,{"$error":"#REF!"},{"$error":"#REF!"},{"$error":"#REF!"},{"$f":"IF(#REF!=\"\",0,VLOOKUP(#REF!,#REF!,2,FALSE))","v":{"$error":"#REF!"}},{"$f":"IF(#REF!=\"\",0,VLOOKUP(#REF!,#REF!,2,FALSE))","v":{"$error":"#REF!"}},{"$f":"IF(#REF!=\"\",0,VLOOKUP(#REF!,#REF!,2,FALSE))","v":{"$error":"#REF!"}},"00","DPM",{"$f":"#REF!","v":{"$error":"#REF!"}},{"$f":"#REF!","v":{"$error":"#REF!"}},{"$f":"#REF!","v":{"$error":"#REF!"}},null,null,{"$f":"#REF!","v":{"$error":"#REF!"}},{"$f":"#REF!","v":{"$error":"#REF!"}},{"$f":"IF(G225=1112,#REF!*L225/(SUMIF($G$142:$G$190,1112,$L$142:$L$190)+SUMIF($G$201:$G$240,1112,$L$201:$L$240)),0)","v":{"$error":"#REF!"}},{"$f":"IF(OR(G225=1111,G225=2729),#REF!*L225/(SUMIF($G$142:$G$190,2729,$L$142:$L$190)+SUMIF($G$201:$G$240,2729,$L$201:$L$240)+SUMIF($G$142:$G$190,1111,$L$142:$L$190)+SUMIF($G$201:$G$240,1111,$L$201:$L$240)),0)","v":{"$error":"#REF!"}},null,null,null,null,null,null,null,null,null,null,null,"-",{"$error":"#REF!"},null,105]
[{"$error":"#REF!"},{"$error":"#REF!"},4,{"$error":"#REF!"},{"$error":"#REF!"},{"$error":"#REF!"},{"$f":"IF(#REF!=\"\",0,VLOOKUP(#REF!,#REF!,2,FALSE))","v":{"$error":"#REF!"}},{"$f":"IF(#REF!=\"\",0,VLOOKUP(#REF!,#REF!,2,FALSE))","v":{"$error":"#REF!"}},{"$f":"IF(#REF!=\"\",0,VLOOKUP(#REF!,#REF!,2,FALSE))","v":{"$error":"#REF!"}},"00","DPM",{"$f":"#REF!","v":{"$error":"#REF!"}},{"$f":"#REF!","v":{"$error":"#REF!"}},{"$f":"#REF!","v":{"$error":"#REF!"}},null,null,{"$f":"#REF!","v":{"$error":"#REF!"}},{"$f":"#REF!","v":{"$error":"#REF!"}},{"$f":"IF(G226=1112,#REF!*L226/(SUMIF($G$142:$G$190,1112,$L$142:$L$190)+SUMIF($G$201:$G$240,1112,$L$201:$L$240)),0)","v":{"$error":"#REF!"}},{"$f":"IF(OR(G226=1111,G226=2729),#REF!*L226/(SUMIF($G$142:$G$190,2729,$L$142:$L$190)+SUMIF($G$201:$G$240,2729,$L$201:$L$240)+SUMIF($G$142:$G$190,1111,$L$142:$L$190)+SUMIF($G$201:$G$240,1111,$L$201:$L$240)),0)","v":{"$error":"#REF!"}},null,null,null,null,null,null,null,null,null,null,null,"-",{"$error":"#REF!"},null,106]
[{"$error":"#REF!"},{"$error":"#REF!"},4,{"$error":"#REF!"},{"$error":"#REF!"},{"$error":"#REF!"},{"$f":"IF(#REF!=\"\",0,VLOOKUP(#REF!,#REF!,2,FALSE))","v":{"$error":"#REF!"}},{"$f":"IF(#REF!=\"\",0,VLOOKUP(#REF!,#REF!,2,FALSE))","v":{"$error":"#REF!"}},{"$f":"IF(#REF!=\"\",0,VLOOKUP(#REF!,#REF!,2,FALSE))","v":{"$error":"#REF!"}},"00","DPM",{"$f":"#REF!","v":{"$error":"#REF!"}},{"$f":"#REF!","v":{"$error":"#REF!"}},{"$f":"#REF!","v":{"$error":"#REF!"}},null,null,{"$f":"#REF!","v":{"$error":"#REF!"}},{"$f":"#REF!","v":{"$error":"#REF!"}},{"$f":"IF(G227=1112,#REF!*L227/(SUMIF($G$142:$G$190,1112,$L$142:$L$190)+SUMIF($G$201:$G$240,1112,$L$201:$L$240)),0)","v":{"$error":"#REF!"}},{"$f":"IF(OR(G227=1111,G227=2729),#REF!*L227/(SUMIF($G$142:$G$190,2729,$L$142:$L$190)+SUMIF($G$201:$G$240,2729,$L$201:$L$240)+SUMIF($G$142:$G$190,1111,$L$142:$L$190)+SUMIF($G$201:$G$240,1111,$L$201:$L$240)),0)","v":{"$error":"#REF!"}},null,null,null,null,null,null,null,null,null,null,null,"-",{"$error":"#REF!"},null,107]
[{"$error":"#REF!"},{"$error":"#REF!"},4,{"$error":"#REF!"},{"$error":"#REF!"},{"$error":"#REF!"},{"$f":"IF(#REF!=\"\",0,VLOOKUP(#REF!,#REF!,2,FALSE))","v":{"$error":"#REF!"}},{"$f":"IF(#REF!=\"\",0,VLOOKUP(#REF!,#REF!,2,FALSE))","v":{"$error":"#REF!"}},{"$f":"IF(#REF!=\"\",0,VLOOKUP(#REF!,#REF!,2,FALSE))","v":{"$error":"#REF!"}},"00","DPM",{"$f":"#REF!","v":{"$error":"#REF!"}},{"$f":"#REF!","v":{"$error":"#REF!"}},{"$f":"#REF!","v":{"$error":"#REF!"}},null,null,{"$f":"#REF!","v":{"$error":"#REF!"}},{"$f":"#REF!","v":{"$error":"#REF!"}},{"$f":"IF(G228=1112,#REF!*L228/(SUMIF($G$142:$G$190,1112,$L$142:$L$190)+SUMIF($G$201:$G$240,1112,$L$201:$L$240)),0)","v":{"$error":"#REF!"}},{"$f":"IF(OR(G228=1111,G228=2729),#REF!*L228/(SUMIF($G$142:$G$190,2729,$L$142:$L$190)+SUMIF($G$201:$G$240,2729,$L$201:$L$240)+SUMIF($G$142:$G$190,1111,$L$142:$L$190)+SUMIF($G$201:$G$240,1111,$L$201:$L$240)),0)","v":{"$error":"#REF!"}},null,null,null,null,null,null,null,null,null,null,null,"-",{"$error":"#REF!"},null,108]
[{"$error":"#REF!"},{"$error":"#REF!"},4,{"$error":"#REF!"},{"$error":"#REF!"},{"$error":"#REF!"},{"$f":"IF(#REF!=\"\",0,VLOOKUP(#REF!,#REF!,2,FALSE))","v":{"$error":"#REF!"}},{"$f":"IF(#REF!=\"\",0,VLOOKUP(#REF!,#REF!,2,FALSE))","v":{"$error":"#REF!"}},{"$f":"IF(#REF!=\"\",0,VLOOKUP(#REF!,#REF!,2,FALSE))","v":{"$error":"#REF!"}},"00","DPM",{"$f":"#REF!","v":{"$error":"#REF!"}},{"$f":"#REF!","v":{"$error":"#REF!"}},{"$f":"#REF!","v":{"$error":"#REF!"}},null,null,{"$f":"#REF!","v":{"$error":"#REF!"}},{"$f":"#REF!","v":{"$error":"#REF!"}},{"$f":"IF(G229=1112,#REF!*L229/(SUMIF($G$142:$G$190,1112,$L$142:$L$190)+SUMIF($G$201:$G$240,1112,$L$201:$L$240)),0)","v":{"$error":"#REF!"}},{"$f":"IF(OR(G229=1111,G229=2729),#REF!*L229/(SUMIF($G$142:$G$190,2729,$L$142:$L$190)+SUMIF($G$201:$G$240,2729,$L$201:$L$240)+SUMIF($G$142:$G$190,1111,$L$142:$L$190)+SUMIF($G$201:$G$240,1111,$L$201:$L$240)),0)","v":{"$error":"#REF!"}},null,null,null,null,null,null,null,null,null,null,null,"-",{"$error":"#REF!"},null,109]
[{"$error":"#REF!"},{"$error":"#REF!"},4,{"$error":"#REF!"},{"$error":"#REF!"},{"$error":"#REF!"},{"$f":"IF(#REF!=\"\",0,VLOOKUP(#REF!,#REF!,2,FALSE))","v":{"$error":"#REF!"}},{"$f":"IF(#REF!=\"\",0,VLOOKUP(#REF!,#REF!,2,FALSE))","v":{"$error":"#REF!"}},{"$f":"IF(#REF!=\"\",0,VLOOKUP(#REF!,#REF!,2,FALSE))","v":{"$error":"#REF!"}},"00","DPM",{"$f":"#REF!","v":{"$error":"#REF!"}},{"$f":"#REF!","v":{"$error":"#REF!"}},{"$f":"#REF!","v":{"$error":"#REF!"}},null,null,{"$f":"#REF!","v":{"$error":"#REF!"}},{"$f":"#REF!","v":{"$error":"#REF!"}},{"$f":"IF(G230=1112,#REF!*L230/(SUMIF($G$142:$G$190,1112,$L$142:$L$190)+SUMIF($G$201:$G$240,1112,$L$201:$L$240)),0)","v":{"$error":"#REF!"}},{"$f":"IF(OR(G230=1111,G230=2729),#REF!*L230/(SUMIF($G$142:$G$190,2729,$L$142:$L$190)+SUMIF($G$201:$G$240,2729,$L$201:$L$240)+SUMIF($G$142:$G$190,1111,$L$142:$L$190)+SUMIF($G$201:$G$240,1111,$L$201:$L$240)),0)","v":{"$error":"#REF!"}},null,null,null,null,null,null,null,null,null,null,null,"-",{"$error":"#REF!"},null,110]
[{"$error":"#REF!"},{"$error":"#REF!"},4,{"$error":"#REF!"},{"$error":"#REF!"},{"$error":"#REF!"},{"$f":"IF(#REF!=\"\",0,VLOOKUP(#REF!,#REF!,2,FALSE))","v":{"$error":"#REF!"}},{"$f":"IF(#REF!=\"\",0,VLOOKUP(#REF!,#REF!,2,FALSE))","v":{"$error":"#REF!"}},{"$f":"IF(#REF!=\"\",0,VLOOKUP(#REF!,#REF!,2,FALSE))","v":{"$error":"#REF!"}},"00","DPM",{"$f":"#REF!","v":{"$error":"#REF!"}},{"$f":"#REF!","v":{"$error":"#REF!"}},{"$f":"#REF!","v":{"$error":"#REF!"}},null,null,{"$f":"#REF!","v":{"$error":"#REF!"}},{"$f":"#REF!","v":{"$error":"#REF!"}},{"$f":"IF(G231=1112,#REF!*L231/(SUMIF($G$142:$G$190,1112,$L$142:$L$190)+SUMIF($G$201:$G$240,1112,$L$201:$L$240)),0)","v":{"$error":"#REF!"}},{"$f":"IF(OR(G231=1111,G231=2729),#REF!*L231/(SUMIF($G$142:$G$190,2729,$L$142:$L$190)+SUMIF($G$201:$G$240,2729,$L$201:$L$240)+SUMIF($G$142:$G$190,1111,$L$142:$L$190)+SUMIF($G$201:$G$240,1111,$L$201:$L$240)),0)","v":{"$error":"#REF!"}},null,null,null,null,null,null,null,null,null,null,null,"-",{"$error":"#REF!"},null,111]
[{"$error":"#REF!"},{"$error":"#REF!"},4,{"$error":"#REF!"},{"$error":"#REF!"},{"$error":"#REF!"},{"$f":"IF(#REF!=\"\",0,VLOOKUP(#REF!,#REF!,2,FALSE))","v":{"$error":"#REF!"}},{"$f":"IF(#REF!=\"\",0,VLOOKUP(#REF!,#REF!,2,FALSE))","v":{"$error":"#REF!"}},{"$f":"IF(#REF!=\"\",0,VLOOKUP(#REF!,#REF!,2,FALSE))","v":{"$error":"#REF!"}},"00","DPM",{"$f":"#REF!","v":{"$error":"#REF!"}},{"$f":"#REF!","v":{"$error":"#REF!"}},{"$f":"#REF!","v":{"$error":"#REF!"}},null,null,{"$f":"#REF!","v":{"$error":"#REF!"}},{"$f":"#REF!","v":{"$error":"#REF!"}},{"$f":"IF(G232=1112,#REF!*L232/(SUMIF($G$142:$G$190,1112,$L$142:$L$190)+SUMIF($G$201:$G$240,1112,$L$201:$L$240)),0)","v":{"$error":"#REF!"}},{"$f":"IF(OR(G232=1111,G232=2729),#REF!*L232/(SUMIF($G$142:$G$190,2729,$L$142:$L$190)+SUMIF($G$201:$G$240,2729,$L$201:$L$240)+SUMIF($G$142:$G$190,1111,$L$142:$L$190)+SUMIF($G$201:$G$240,1111,$L$201:$L$240)),0)","v":{"$error":"#REF!"}},null,null,null,null,null,null,null,null,null,null,null,"-",{"$error":"#REF!"},null,112]
[{"$error":"#REF!"},{"$error":"#REF!"},4,{"$error":"#REF!"},{"$error":"#REF!"},{"$error":"#REF!"},{"$f":"IF(#REF!=\"\",0,VLOOKUP(#REF!,#REF!,2,FALSE))","v":{"$error":"#REF!"}},{"$f":"IF(#REF!=\"\",0,VLOOKUP(#REF!,#REF!,2,FALSE))","v":{"$error":"#REF!"}},{"$f":"IF(#REF!=\"\",0,VLOOKUP(#REF!,#REF!,2,FALSE))","v":{"$error":"#REF!"}},"00","DPM",{"$f":"#REF!","v":{"$error":"#REF!"}},{"$f":"#REF!","v":{"$error":"#REF!"}},{"$f":"#REF!","v":{"$error":"#REF!"}},null,null,{"$f":"#REF!","v":{"$error":"#REF!"}},{"$f":"#REF!","v":{"$error":"#REF!"}},{"$f":"IF(G233=1112,#REF!*L233/(SUMIF($G$142:$G$190,1112,$L$142:$L$190)+SUMIF($G$201:$G$240,1112,$L$201:$L$240)),0)","v":{"$error":"#REF!"}},{"$f":"IF(OR(G233=1111,G233=2729),#REF!*L233/(SUMIF($G$142:$G$190,2729,$L$142:$L$190)+SUMIF($G$201:$G$240,2729,$L$201:$L$240)+SUMIF($G$142:$G$190,1111,$L$142:$L$190)+SUMIF($G$201:$G$240,1111,$L$201:$L$240)),0)","v":{"$error":"#REF!"}},null,null,null,null,null,null,null,null,null,null,null,"-",{"$error":"#REF!"},null,113]
[{"$error":"#REF!"},{"$error":"#REF!"},4,{"$error":"#REF!"},{"$error":"#REF!"},{"$error":"#REF!"},{"$f":"IF(#REF!=\"\",0,VLOOKUP(#REF!,#REF!,2,FALSE))","v":{"$error":"#REF!"}},{"$f":"IF(#REF!=\"\",0,VLOOKUP(#REF!,#REF!,2,FALSE))","v":{"$error":"#REF!"}},{"$f":"IF(#REF!=\"\",0,VLOOKUP(#REF!,#REF!,2,FALSE))","v":{"$error":"#REF!"}},"00","DPM",{"$f":"#REF!","v":{"$error":"#REF!"}},{"$f":"#REF!","v":{"$error":"#REF!"}},{"$f":"#REF!","v":{"$error":"#REF!"}},null,null,{"$f":"#REF!","v":{"$error":"#REF!"}},{"$f":"#REF!","v":{"$error":"#REF!"}},{"$f":"IF(G234=1112,#REF!*L234/(SUMIF($G$142:$G$190,1112,$L$142:$L$190)+SUMIF($G$201:$G$240,1112,$L$201:$L$240)),0)","v":{"$error":"#REF!"}},{"$f":"IF(OR(G234=1111,G234=2729),#REF!*L234/(SUMIF($G$142:$G$190,2729,$L$142:$L$190)+SUMIF($G$201:$G$240,2729,$L$201:$L$240)+SUMIF($G$142:$G$190,1111,$L$142:$L$190)+SUMIF($G$201:$G$240,1111,$L$201:$L$240)),0)","v":{"$error":"#REF!"}},null,null,null,null,null,null,null,null,null,null,null,"-",{"$error":"#REF!"},null,114]
[{"$error":"#REF!"},{"$error":"#REF!"},4,{"$error":"#REF!"},{"$error":"#REF!"},{"$error":"#REF!"},{"$f":"IF(#REF!=\"\",0,VLOOKUP(#REF!,#REF!,2,FALSE))","v":{"$error":"#REF!"}},{"$f":"IF(#REF!=\"\",0,VLOOKUP(#REF!,#REF!,2,FALSE))","v":{"$error":"#REF!"}},{"$f":"IF(#REF!=\"\",0,VLOOKUP(#REF!,#REF!,2,FALSE))","v":{"$error":"#REF!"}},"00","DPM",{"$f":"#REF!","v":{"$error":"#REF!"}},{"$f":"#REF!","v":{"$error":"#REF!"}},{"$f":"#REF!","v":{"$error":"#REF!"}},null,null,{"$f":"#REF!","v":{"$error":"#REF!"}},{"$f":"#REF!","v":{"$error":"#REF!"}},{"$f":"IF(G235=1112,#REF!*L235/(SUMIF($G$142:$G$190,1112,$L$142:$L$190)+SUMIF($G$201:$G$240,1112,$L$201:$L$240)),0)","v":{"$error":"#REF!"}},{"$f":"IF(OR(G235=1111,G235=2729),#REF!*L235/(SUMIF($G$142:$G$190,2729,$L$142:$L$190)+SUMIF($G$201:$G$240,2729,$L$201:$L$240)+SUMIF($G$142:$G$190,1111,$L$142:$L$190)+SUMIF($G$201:$G$240,1111,$L$201:$L$240)),0)","v":{"$error":"#REF!"}},null,null,null,null,null,null,null,null,null,null,null,"-",{"$error":"#REF!"},null,115]
[{"$error":"#REF!"},{"$error":"#REF!"},4,{"$error":"#REF!"},{"$error":"#REF!"},{"$error":"#REF!"},{"$f":"IF(#REF!=\"\",0,VLOOKUP(#REF!,#REF!,2,FALSE))","v":{"$error":"#REF!"}},{"$f":"IF(#REF!=\"\",0,VLOOKUP(#REF!,#REF!,2,FALSE))","v":{"$error":"#REF!"}},{"$f":"IF(#REF!=\"\",0,VLOOKUP(#REF!,#REF!,2,FALSE))","v":{"$error":"#REF!"}},"00","DPM",{"$f":"#REF!","v":{"$error":"#REF!"}},{"$f":"#REF!","v":{"$error":"#REF!"}},{"$f":"#REF!","v":{"$error":"#REF!"}},null,null,{"$f":"#REF!","v":{"$error":"#REF!"}},{"$f":"#REF!","v":{"$error":"#REF!"}},{"$f":"IF(G236=1112,#REF!*L236/(SUMIF($G$142:$G$190,1112,$L$142:$L$190)+SUMIF($G$201:$G$240,1112,$L$201:$L$240)),0)","v":{"$error":"#REF!"}},{"$f":"IF(OR(G236=1111,G236=2729),#REF!*L236/(SUMIF($G$142:$G$190,2729,$L$142:$L$190)+SUMIF($G$201:$G$240,2729,$L$201:$L$240)+SUMIF($G$142:$G$190,1111,$L$142:$L$190)+SUMIF($G$201:$G$240,1111,$L$201:$L$240)),0)","v":{"$error":"#REF!"}},null,null,null,null,null,null,null,null,null,null,null,"-",{"$error":"#REF!"},null,116]
[{"$error":"#REF!"},{"$error":"#REF!"},4,{"$error":"#REF!"},{"$error":"#REF!"},{"$error":"#REF!"},{"$f":"IF(#REF!=\"\",0,VLOOKUP(#REF!,#REF!,2,FALSE))","v":{"$error":"#REF!"}},{"$f":"IF(#REF!=\"\",0,VLOOKUP(#REF!,#REF!,2,FALSE))","v":{"$error":"#REF!"}},{"$f":"IF(#REF!=\"\",0,VLOOKUP(#REF!,#REF!,2,FALSE))","v":{"$error":"#REF!"}},"00","DPM",{"$f":"#REF!","v":{"$error":"#REF!"}},{"$f":"#REF!","v":{"$error":"#REF!"}},{"$f":"#REF!","v":{"$error":"#REF!"}},null,null,{"$f":"#REF!","v":{"$error":"#REF!"}},{"$f":"#REF!","v":{"$error":"#REF!"}},{"$f":"IF(G237=1112,#REF!*L237/(SUMIF($G$142:$G$190,1112,$L$142:$L$190)+SUMIF($G$201:$G$240,1112,$L$201:$L$240)),0)","v":{"$error":"#REF!"}},{"$f":"IF(OR(G237=1111,G237=2729),#REF!*L237/(SUMIF($G$142:$G$190,2729,$L$142:$L$190)+SUMIF($G$201:$G$240,2729,$L$201:$L$240)+SUMIF($G$142:$G$190,1111,$L$142:$L$190)+SUMIF($G$201:$G$240,1111,$L$201:$L$240)),0)","v":{"$error":"#REF!"}},null,null,null,null,null,null,null,null,null,null,null,"-",{"$error":"#REF!"},null,117]
[{"$error":"#REF!"},{"$error":"#REF!"},4,{"$error":"#REF!"},{"$error":"#REF!"},{"$error":"#REF!"},{"$f":"IF(#REF!=\"\",0,VLOOKUP(#REF!,#REF!,2,FALSE))","v":{"$error":"#REF!"}},{"$f":"IF(#REF!=\"\",0,VLOOKUP(#REF!,#REF!,2,FALSE))","v":{"$error":"#REF!"}},{"$f":"IF(#REF!=\"\",0,VLOOKUP(#REF!,#REF!,2,FALSE))","v":{"$error":"#REF!"}},"00","DPM",{"$f":"#REF!","v":{"$error":"#REF!"}},{"$f":"#REF!","v":{"$error":"#REF!"}},{"$f":"#REF!","v":{"$error":"#REF!"}},null,null,{"$f":"#REF!","v":{"$error":"#REF!"}},{"$f":"#REF!","v":{"$error":"#REF!"}},{"$f":"IF(G238=1112,#REF!*L238/(SUMIF($G$142:$G$190,1112,$L$142:$L$190)+SUMIF($G$201:$G$240,1112,$L$201:$L$240)),0)","v":{"$error":"#REF!"}},{"$f":"IF(OR(G238=1111,G238=2729),#REF!*L238/(SUMIF($G$142:$G$190,2729,$L$142:$L$190)+SUMIF($G$201:$G$240,2729,$L$201:$L$240)+SUMIF($G$142:$G$190,1111,$L$142:$L$190)+SUMIF($G$201:$G$240,1111,$L$201:$L$240)),0)","v":{"$error":"#REF!"}},null,null,null,null,null,null,null,null,null,null,null,"-",{"$error":"#REF!"},null,118]
[{"$error":"#REF!"},{"$error":"#REF!"},4,{"$error":"#REF!"},{"$error":"#REF!"},{"$error":"#REF!"},{"$f":"IF(#REF!=\"\",0,VLOOKUP(#REF!,#REF!,2,FALSE))","v":{"$error":"#REF!"}},{"$f":"IF(#REF!=\"\",0,VLOOKUP(#REF!,#REF!,2,FALSE))","v":{"$error":"#REF!"}},{"$f":"IF(#REF!=\"\",0,VLOOKUP(#REF!,#REF!,2,FALSE))","v":{"$error":"#REF!"}},"00","DPM",{"$f":"#REF!","v":{"$error":"#REF!"}},{"$f":"#REF!","v":{"$error":"#REF!"}},{"$f":"#REF!","v":{"$error":"#REF!"}},null,null,{"$f":"#REF!","v":{"$error":"#REF!"}},{"$f":"#REF!","v":{"$error":"#REF!"}},{"$f":"IF(G239=1112,#REF!*L239/(SUMIF($G$142:$G$190,1112,$L$142:$L$190)+SUMIF($G$201:$G$240,1112,$L$201:$L$240)),0)","v":{"$error":"#REF!"}},{"$f":"IF(OR(G239=1111,G239=2729),#REF!*L239/(SUMIF($G$142:$G$190,2729,$L$142:$L$190)+SUMIF($G$201:$G$240,2729,$L$201:$L$240)+SUMIF($G$142:$G$190,1111,$L$142:$L$190)+SUMIF($G$201:$G$240,1111,$L$201:$L$240)),0)","v":{"$error":"#REF!"}},null,null,null,null,null,null,null,null,null,null,null,"-",{"$error":"#REF!"},null,119]
[{"$error":"#REF!"},{"$error":"#REF!"},4,{"$error":"#REF!"},{"$error":"#REF!"},{"$error":"#REF!"},{"$f":"IF(#REF!=\"\",0,VLOOKUP(#REF!,#REF!,2,FALSE))","v":{"$error":"#REF!"}},{"$f":"IF(#REF!=\"\",0,VLOOKUP(#REF!,#REF!,2,FALSE))","v":{"$error":"#REF!"}},{"$f":"IF(#REF!=\"\",0,VLOOKUP(#REF!,#REF!,2,FALSE))","v":{"$error":"#REF!"}},"00","DPM",{"$f":"#REF!","v":{"$error":"#REF!"}},{"$f":"#REF!","v":{"$error":"#REF!"}},{"$f":"#REF!","v":{"$error":"#REF!"}},null,null,{"$f":"#REF!","v":{"$error":"#REF!"}},{"$f":"#REF!","v":{"$error":"#REF!"}},{"$f":"IF(G240=1112,#REF!*L240/(SUMIF($G$142:$G$190,1112,$L$142:$L$190)+SUMIF($G$201:$G$240,1112,$L$201:$L$240)),0)","v":{"$error":"#REF!"}},{"$f":"IF(OR(G240=1111,G240=2729),#REF!*L240/(SUMIF($G$142:$G$190,2729,$L$142:$L$190)+SUMIF($G$201:$G$240,2729,$L$201:$L$240)+SUMIF($G$142:$G$190,1111,$L$142:$L$190)+SUMIF($G$201:$G$240,1111,$L$201:$L$240)),0)","v":{"$error":"#REF!"}},null,null,null,null,null,null,null,null,null,null,null,"-",{"$error":"#REF!"},null,120]
[{"$error":"#REF!"},{"$error":"#REF!"},4,{"$error":"#REF!"},{"$error":"#REF!"},{"$error":"#REF!"},{"$f":"IF(#REF!<>\"\",9990,0)","v":{"$error":"#REF!"}},{"$f":"IF(#REF!=\"\",0,VLOOKUP(#REF!,#REF!,2,FALSE))","v":{"$error":"#REF!"}},"#LK","00","DPM",{"$f":"#REF!","v":{"$error":"#REF!"}},{"$f":"#REF!","v":{"$error":"#REF!"}},{"$f":"#REF!","v":{"$error":"#REF!"}},null,null,{"$f":"#REF!","v":{"$error":"#REF!"}},{"$f":"#REF!","v":{"$error":"#REF!"}},null,null,null,null,null,null,null,null,null,null,null,null,null,{"$f":"IF(#REF!<>\"\",#REF!,\"-\")","v":{"$error":"#REF!"}},{"$error":"#REF!"},"Sheet 19 Non SBS Nominee'!F125 / G125 / H125 / I125 / J125",125]
[{"$error":"#REF!"},{"$error":"#REF!"},4,{"$error":"#REF!"},{"$error":"#REF!"},{"$error":"#REF!"},{"$f":"IF(#REF!<>\"\",9990,0)","v":{"$error":"#REF!"}},{"$f":"IF(#REF!=\"\",0,VLOOKUP(#REF!,#REF!,2,FALSE))","v":{"$error":"#REF!"}},"#LK","00","DPM",{"$f":"#REF!","v":{"$error":"#REF!"}},{"$f":"#REF!","v":{"$error":"#REF!"}},{"$f":"#REF!","v":{"$error":"#REF!"}},null,null,{"$f":"#REF!","v":{"$error":"#REF!"}},{"$f":"#REF!","v":{"$error":"#REF!"}},null,null,null,null,null,null,null,null,null,null,null,null,null,{"$f":"IF(#REF!<>\"\",#REF!,\"-\")","v":{"$error":"#REF!"}},{"$error":"#REF!"},null,126]
[{"$error":"#REF!"},{"$error":"#REF!"},4,{"$error":"#REF!"},{"$error":"#REF!"},{"$error":"#REF!"},{"$f":"IF(#REF!<>\"\",9990,0)","v":{"$error":"#REF!"}},{"$f":"IF(#REF!=\"\",0,VLOOKUP(#REF!,#REF!,2,FALSE))","v":{"$error":"#REF!"}},"#LK","00","DPM",{"$f":"#REF!","v":{"$error":"#REF!"}},{"$f":"#REF!","v":{"$error":"#REF!"}},{"$f":"#REF!","v":{"$error":"#REF!"}},null,null,{"$f":"#REF!","v":{"$error":"#REF!"}},{"$f":"#REF!","v":{"$error":"#REF!"}},null,null,null,null,null,null,null,null,null,null,null,null,null,{"$f":"IF(#REF!<>\"\",#REF!,\"-\")","v":{"$error":"#REF!"}},{"$error":"#REF!"},null,127]
[{"$error":"#REF!"},{"$error":"#REF!"},4,{"$error":"#REF!"},{"$error":"#REF!"},{"$error":"#REF!"},{"$f":"IF(#REF!<>\"\",9990,0)","v":{"$error":"#REF!"}},{"$f":"IF(#REF!=\"\",0,VLOOKUP(#REF!,#REF!,2,FALSE))","v":{"$error":"#REF!"}},"#LK","00","DPM",{"$f":"#REF!","v":{"$error":"#REF!"}},{"$f":"#REF!","v":{"$error":"#REF!"}},{"$f":"#REF!","v":{"$error":"#REF!"}},null,null,{"$f":"#REF!","v":{"$error":"#REF!"}},{"$f":"#REF!","v":{"$error":"#REF!"}},null,null,null,null,null,null,null,null,null,null,null,null,null,{"$f":"IF(#REF!<>\"\",#REF!,\"-\")","v":{"$error":"#REF!"}},{"$error":"#REF!"},null,128]
[{"$error":"#REF!"},{"$error":"#REF!"},4,{"$error":"#REF!"},{"$error":"#REF!"},{"$error":"#REF!"},{"$f":"IF(#REF!<>\"\",9990,0)","v":{"$error":"#REF!"}},{"$f":"IF(#REF!=\"\",0,VLOOKUP(#REF!,#REF!,2,FALSE))","v":{"$error":"#REF!"}},"#LK","00","DPM",{"$f":"#REF!","v":{"$error":"#REF!"}},{"$f":"#REF!","v":{"$error":"#REF!"}},{"$f":"#REF!","v":{"$error":"#REF!"}},null,null,{"$f":"#REF!","v":{"$error":"#REF!"}},{"$f":"#REF!","v":{"$error":"#REF!"}},null,null,null,null,null,null,null,null,null,null,null,null,null,{"$f":"IF(#REF!<>\"\",#REF!,\"-\")","v":{"$error":"#REF!"}},{"$error":"#REF!"},null,129]
[{"$error":"#REF!"},{"$error":"#REF!"},4,{"$error":"#REF!"},{"$error":"#REF!"},{"$error":"#REF!"},{"$f":"IF(#REF!<>\"\",9990,0)","v":{"$error":"#REF!"}},{"$f":"IF(#REF!=\"\",0,VLOOKUP(#REF!,#REF!,2,FALSE))","v":{"$error":"#REF!"}},"#LK","00","DPM",{"$f":"#REF!","v":{"$error":"#REF!"}},{"$f":"#REF!","v":{"$error":"#REF!"}},{"$f":"#REF!","v":{"$error":"#REF!"}},null,null,{"$f":"#REF!","v":{"$error":"#REF!"}},{"$f":"#REF!","v":{"$error":"#REF!"}},null,null,null,null,null,null,null,null,null,null,null,null,null,{"$f":"IF(#REF!<>\"\",#REF!,\"-\")","v":{"$error":"#REF!"}},{"$error":"#REF!"},null,130]
[{"$error":"#REF!"},{"$error":"#REF!"},4,{"$error":"#REF!"},{"$error":"#REF!"},{"$error":"#REF!"},{"$f":"IF(#REF!<>\"\",9990,0)","v":{"$error":"#REF!"}},{"$f":"IF(#REF!=\"\",0,VLOOKUP(#REF!,#REF!,2,FALSE))","v":{"$error":"#REF!"}},"#LK","00","DPM",{"$f":"#REF!","v":{"$error":"#REF!"}},{"$f":"#REF!","v":{"$error":"#REF!"}},{"$f":"#REF!","v":{"$error":"#REF!"}},null,null,{"$f":"#REF!","v":{"$error":"#REF!"}},{"$f":"#REF!","v":{"$error":"#REF!"}},null,null,null,null,null,null,null,null,null,null,null,null,null,{"$f":"IF(#REF!<>\"\",#REF!,\"-\")","v":{"$error":"#REF!"}},{"$error":"#REF!"},null,131]
[{"$error":"#REF!"},{"$error":"#REF!"},4,{"$error":"#REF!"},{"$error":"#REF!"},{"$error":"#REF!"},{"$f":"IF(#REF!<>\"\",9990,0)","v":{"$error":"#REF!"}},{"$f":"IF(#REF!=\"\",0,VLOOKUP(#REF!,#REF!,2,FALSE))","v":{"$error":"#REF!"}},"#LK","00","DPM",{"$f":"#REF!","v":{"$error":"#REF!"}},{"$f":"#REF!","v":{"$error":"#REF!"}},{"$f":"#REF!","v":{"$error":"#REF!"}},null,null,{"$f":"#REF!","v":{"$error":"#REF!"}},{"$f":"#REF!","v":{"$error":"#REF!"}},null,null,null,null,null,null,null,null,null,null,null,null,null,{"$f":"IF(#REF!<>\"\",#REF!,\"-\")","v":{"$error":"#REF!"}},{"$error":"#REF!"},null,132]
[{"$error":"#REF!"},{"$error":"#REF!"},4,{"$error":"#REF!"},{"$error":"#REF!"},{"$error":"#REF!"},{"$f":"IF(#REF!<>\"\",9990,0)","v":{"$error":"#REF!"}},{"$f":"IF(#REF!=\"\",0,VLOOKUP(#REF!,#REF!,2,FALSE))","v":{"$error":"#REF!"}},"#LK","00","DPM",{"$f":"#REF!","v":{"$error":"#REF!"}},{"$f":"#REF!","v":{"$error":"#REF!"}},{"$f":"#REF!","v":{"$error":"#REF!"}},null,null,{"$f":"#REF!","v":{"$error":"#REF!"}},{"$f":"#REF!","v":{"$error":"#REF!"}},null,null,null,null,null,null,null,null,null,null,null,null,null,{"$f":"IF(#REF!<>\"\",#REF!,\"-\")","v":{"$error":"#REF!"}},{"$error":"#REF!"},null,133]
[{"$error":"#REF!"},{"$error":"#REF!"},6,{"$error":"#REF!"},{"$error":"#REF!"},{"$error":"#REF!"},{"$f":"IF(#REF!=\"\",0,VLOOKUP(#REF!,#REF!,2,FALSE))","v":{"$error":"#REF!"}},{"$f":"IF(#REF!=\"\",0,VLOOKUP(#REF!,#REF!,2,FALSE))","v":{"$error":"#REF!"}},{"$f":"IF(#REF!=\"\",\"#LK\",VLOOKUP(#REF!,#REF!,2,FALSE))","v":{"$error":"#REF!"}},"00","DPM",{"$f":"#REF!","v":{"$error":"#REF!"}},{"$f":"#REF!","v":{"$error":"#REF!"}},{"$f":"#REF!","v":{"$error":"#REF!"}},{"$f":"IF(OR(#REF!=\"Bank Deposits held with foreign banks\",#REF!=\"Receivables from non-residents\"),#REF!,0)","v":{"$error":"#REF!"}},{"$f":"IF(OR(#REF!=\"Debt securities issued by non-residents\",#REF!=\"Equities issued by non-residents\",#REF!=\"Financial derivatives\",#REF!=\"Investment fund share/units issued by foreign institutions \"),#REF!,0)","v":{"$error":"#REF!"}},null,{"$f":"#REF!","v":{"$error":"#REF!"}},null,null,null,null,null,null,null,null,null,null,null,null,null,"-",{"$error":"#REF!"},"Sheet 25 External Balance Sheet'!F13 / G13 / H13 / I13 / J13",13]
[{"$error":"#REF!"},{"$error":"#REF!"},6,{"$error":"#REF!"},{"$error":"#REF!"},{"$error":"#REF!"},{"$f":"IF(#REF!=\"\",0,VLOOKUP(#REF!,#REF!,2,FALSE))","v":{"$error":"#REF!"}},{"$f":"IF(#REF!=\"\",0,VLOOKUP(#REF!,#REF!,2,FALSE))","v":{"$error":"#REF!"}},{"$f":"IF(#REF!=\"\",\"#LK\",VLOOKUP(#REF!,#REF!,2,FALSE))","v":{"$error":"#REF!"}},"00","DPM",{"$f":"#REF!","v":{"$error":"#REF!"}},{"$f":"#REF!","v":{"$error":"#REF!"}},{"$f":"#REF!","v":{"$error":"#REF!"}},{"$f":"IF(OR(#REF!=\"Bank Deposits held with foreign banks\",#REF!=\"Receivables from non-residents\"),#REF!,0)","v":{"$error":"#REF!"}},{"$f":"IF(OR(#REF!=\"Debt securities issued by non-residents\",#REF!=\"Equities issued by non-residents\",#REF!=\"Financial derivatives\",#REF!=\"Investment fund share/units issued by foreign institutions \"),#REF!,0)","v":{"$error":"#REF!"}},null,{"$f":"#REF!","v":{"$error":"#REF!"}},null,null,null,null,null,null,null,null,null,null,null,null,null,"-",{"$error":"#REF!"},null,14]
[{"$error":"#REF!"},{"$error":"#REF!"},6,{"$error":"#REF!"},{"$error":"#REF!"},{"$error":"#REF!"},{"$f":"IF(#REF!=\"\",0,VLOOKUP(#REF!,#REF!,2,FALSE))","v":{"$error":"#REF!"}},{"$f":"IF(#REF!=\"\",0,VLOOKUP(#REF!,#REF!,2,FALSE))","v":{"$error":"#REF!"}},{"$f":"IF(#REF!=\"\",\"#LK\",VLOOKUP(#REF!,#REF!,2,FALSE))","v":{"$error":"#REF!"}},"00","DPM",{"$f":"#REF!","v":{"$error":"#REF!"}},{"$f":"#REF!","v":{"$error":"#REF!"}},{"$f":"#REF!","v":{"$error":"#REF!"}},{"$f":"IF(OR(#REF!=\"Bank Deposits held with foreign banks\",#REF!=\"Receivables from non-residents\"),#REF!,0)","v":{"$error":"#REF!"}},{"$f":"IF(OR(#REF!=\"Debt securities issued by non-residents\",#REF!=\"Equities issued by non-residents\",#REF!=\"Financial derivatives\",#REF!=\"Investment fund share/units issued by foreign institutions \"),#REF!,0)","v":{"$error":"#REF!"}},null,{"$f":"#REF!","v":{"$error":"#REF!"}},null,null,null,null,null,null,null,null,null,null,null,null,null,"-",{"$error":"#REF!"},null,15]
[{"$error":"#REF!"},{"$error":"#REF!"},6,{"$error":"#REF!"},{"$error":"#REF!"},{"$error":"#REF!"},{"$f":"IF(#REF!=\"\",0,VLOOKUP(#REF!,#REF!,2,FALSE))","v":{"$error":"#REF!"}},{"$f":"IF(#REF!=\"\",0,VLOOKUP(#REF!,#REF!,2,FALSE))","v":{"$error":"#REF!"}},{"$f":"IF(#REF!=\"\",\"#LK\",VLOOKUP(#REF!,#REF!,2,FALSE))","v":{"$error":"#REF!"}},"00","DPM",{"$f":"#REF!","v":{"$error":"#REF!"}},{"$f":"#REF!","v":{"$error":"#REF!"}},{"$f":"#REF!","v":{"$error":"#REF!"}},{"$f":"IF(OR(#REF!=\"Bank Deposits held with foreign banks\",#REF!=\"Receivables from non-residents\"),#REF!,0)","v":{"$error":"#REF!"}},{"$f":"IF(OR(#REF!=\"Debt securities issued by non-residents\",#REF!=\"Equities issued by non-residents\",#REF!=\"Financial derivatives\",#REF!=\"Investment fund share/units issued by foreign institutions \"),#REF!,0)","v":{"$error":"#REF!"}},null,{"$f":"#REF!","v":{"$error":"#REF!"}},null,null,null,null,null,null,null,null,null,null,null,null,null,"-",{"$error":"#REF!"},null,16]
[{"$error":"#REF!"},{"$error":"#REF!"},6,{"$error":"#REF!"},{"$error":"#REF!"},{"$error":"#REF!"},{"$f":"IF(#REF!=\"\",0,VLOOKUP(#REF!,#REF!,2,FALSE))","v":{"$error":"#REF!"}},{"$f":"IF(#REF!=\"\",0,VLOOKUP(#REF!,#REF!,2,FALSE))","v":{"$error":"#REF!"}},{"$f":"IF(#REF!=\"\",\"#LK\",VLOOKUP(#REF!,#REF!,2,FALSE))","v":{"$error":"#REF!"}},"00","DPM",{"$f":"#REF!","v":{"$error":"#REF!"}},{"$f":"#REF!","v":{"$error":"#REF!"}},{"$f":"#REF!","v":{"$error":"#REF!"}},{"$f":"IF(OR(#REF!=\"Bank Deposits held with foreign banks\",#REF!=\"Receivables from non-residents\"),#REF!,0)","v":{"$error":"#REF!"}},{"$f":"IF(OR(#REF!=\"Debt securities issued by non-residents\",#REF!=\"Equities issued by non-residents\",#REF!=\"Financial derivatives\",#REF!=\"Investment fund share/units issued by foreign institutions \"),#REF!,0)","v":{"$error":"#REF!"}},null,{"$f":"#REF!","v":{"$error":"#REF!"}},null,null,null,null,null,null,null,null,null,null,null,null,null,"-",{"$error":"#REF!"},null,17]
[{"$error":"#REF!"},{"$error":"#REF!"},6,{"$error":"#REF!"},{"$error":"#REF!"},{"$error":"#REF!"},{"$f":"IF(#REF!=\"\",0,VLOOKUP(#REF!,#REF!,2,FALSE))","v":{"$error":"#REF!"}},{"$f":"IF(#REF!=\"\",0,VLOOKUP(#REF!,#REF!,2,FALSE))","v":{"$error":"#REF!"}},{"$f":"IF(#REF!=\"\",\"#LK\",VLOOKUP(#REF!,#REF!,2,FALSE))","v":{"$error":"#REF!"}},"00","DPM",{"$f":"#REF!","v":{"$error":"#REF!"}},{"$f":"#REF!","v":{"$error":"#REF!"}},{"$f":"#REF!","v":{"$error":"#REF!"}},{"$f":"IF(OR(#REF!=\"Bank Deposits held with foreign banks\",#REF!=\"Receivables from non-residents\"),#REF!,0)","v":{"$error":"#REF!"}},{"$f":"IF(OR(#REF!=\"Debt securities issued by non-residents\",#REF!=\"Equities issued by non-residents\",#REF!=\"Financial derivatives\",#REF!=\"Investment fund share/units issued by foreign institutions \"),#REF!,0)","v":{"$error":"#REF!"}},null,{"$f":"#REF!","v":{"$error":"#REF!"}},null,null,null,null,null,null,null,null,null,null,null,null,null,"-",{"$error":"#REF!"},null,18]
[{"$error":"#REF!"},{"$error":"#REF!"},6,{"$error":"#REF!"},{"$error":"#REF!"},{"$error":"#REF!"},{"$f":"IF(#REF!=\"\",0,VLOOKUP(#REF!,#REF!,2,FALSE))","v":{"$error":"#REF!"}},{"$f":"IF(#REF!=\"\",0,VLOOKUP(#REF!,#REF!,2,FALSE))","v":{"$error":"#REF!"}},{"$f":"IF(#REF!=\"\",\"#LK\",VLOOKUP(#REF!,#REF!,2,FALSE))","v":{"$error":"#REF!"}},"00","DPM",{"$f":"#REF!","v":{"$error":"#REF!"}},{"$f":"#REF!","v":{"$error":"#REF!"}},{"$f":"#REF!","v":{"$error":"#REF!"}},{"$f":"IF(OR(#REF!=\"Bank Deposits held with foreign banks\",#REF!=\"Receivables from non-residents\"),#REF!,0)","v":{"$error":"#REF!"}},{"$f":"IF(OR(#REF!=\"Debt securities issued by non-residents\",#REF!=\"Equities issued by non-residents\",#REF!=\"Financial derivatives\",#REF!=\"Investment fund share/units issued by foreign institutions \"),#REF!,0)","v":{"$error":"#REF!"}},null,{"$f":"#REF!","v":{"$error":"#REF!"}},null,null,null,null,null,null,null,null,null,null,null,null,null,"-",{"$error":"#REF!"},null,19]
[{"$error":"#REF!"},{"$error":"#REF!"},6,{"$error":"#REF!"},{"$error":"#REF!"},{"$error":"#REF!"},{"$f":"IF(#REF!=\"\",0,VLOOKUP(#REF!,#REF!,2,FALSE))","v":{"$error":"#REF!"}},{"$f":"IF(#REF!=\"\",0,VLOOKUP(#REF!,#REF!,2,FALSE))","v":{"$error":"#REF!"}},{"$f":"IF(#REF!=\"\",\"#LK\",VLOOKUP(#REF!,#REF!,2,FALSE))","v":{"$error":"#REF!"}},"00","DPM",{"$f":"#REF!","v":{"$error":"#REF!"}},{"$f":"#REF!","v":{"$error":"#REF!"}},{"$f":"#REF!","v":{"$error":"#REF!"}},{"$f":"IF(OR(#REF!=\"Bank Deposits held with foreign banks\",#REF!=\"Receivables from non-residents\"),#REF!,0)","v":{"$error":"#REF!"}},{"$f":"IF(OR(#REF!=\"Debt securities issued by non-residents\",#REF!=\"Equities issued by non-residents\",#REF!=\"Financial derivatives\",#REF!=\"Investment fund share/units issued by foreign institutions \"),#REF!,0)","v":{"$error":"#REF!"}},null,{"$f":"#REF!","v":{"$error":"#REF!"}},null,null,null,null,null,null,null,null,null,null,null,null,null,"-",{"$error":"#REF!"},null,20]
[{"$error":"#REF!"},{"$error":"#REF!"},6,{"$error":"#REF!"},{"$error":"#REF!"},{"$error":"#REF!"},{"$f":"IF(#REF!=\"\",0,VLOOKUP(#REF!,#REF!,2,FALSE))","v":{"$error":"#REF!"}},{"$f":"IF(#REF!=\"\",0,VLOOKUP(#REF!,#REF!,2,FALSE))","v":{"$error":"#REF!"}},{"$f":"IF(#REF!=\"\",\"#LK\",VLOOKUP(#REF!,#REF!,2,FALSE))","v":{"$error":"#REF!"}},"00","DPM",{"$f":"#REF!","v":{"$error":"#REF!"}},{"$f":"#REF!","v":{"$error":"#REF!"}},{"$f":"#REF!","v":{"$error":"#REF!"}},{"$f":"IF(OR(#REF!=\"Bank Deposits held with foreign banks\",#REF!=\"Receivables from non-residents\"),#REF!,0)","v":{"$error":"#REF!"}},{"$f":"IF(OR(#REF!=\"Debt securities issued by non-residents\",#REF!=\"Equities issued by non-residents\",#REF!=\"Financial derivatives\",#REF!=\"Investment fund share/units issued by foreign institutions \"),#REF!,0)","v":{"$error":"#REF!"}},null,{"$f":"#REF!","v":{"$error":"#REF!"}},null,null,null,null,null,null,null,null,null,null,null,null,null,"-",{"$f":"IF(OR(ABS(L258)>=0.55,ABS(M258)>=0.55,ABS(N258)>=0.55,ABS(O258)>=0.55,ABS(P258)>=0.55,ABS(Q258)>=0.55,ABS(R258)>=0.55,ABS(S258)>=0.55,ABS(T258)>=0.55,ABS(U258)>=0.55,ABS(V258)>=0.55,ABS(W258)>=0.55,ABS(X258)>=0.55,ABS(Y258)>=0.55,ABS(Z258)>=0.55,ABS(AA258)>=0.55,ABS(AB258)>=0.55,ABS(AC258)>=0.55,ABS(AD258)>=0.55,ABS(AE258)>=0.55),0,1)","v":{"$error":"#REF!"}},null,21]
[{"$f":"$A$2","v":{"$error":"#REF!"}},{"$f":"$B$2","v":{"$error":"#REF!"}},6,{"$f":"$D$2","v":{"$error":"#REF!"}},{"$f":"$E$2","v":{"$error":"#REF!"}},{"$f":"$F$2","v":{"$error":"#REF!"}},{"$f":"IF(#REF!=\"\",0,VLOOKUP(#REF!,#REF!,2,FALSE))","v":{"$error":"#REF!"}},{"$f":"IF(#REF!=\"\",0,VLOOKUP(#REF!,#REF!,2,FALSE))","v":{"$error":"#REF!"}},{"$f":"IF(#REF!=\"\",\"#LK\",VLOOKUP(#REF!,#REF!,2,FALSE))","v":{"$error":"#REF!"}},"00","DPM",{"$f":"#REF!","v":{"$error":"#REF!"}},{"$f":"#REF!","v":{"$error":"#REF!"}},{"$f":"#REF!","v":{"$error":"#REF!"}},{"$f":"IF(OR(#REF!=\"Bank Deposits held with foreign banks\",#REF!=\"Receivables from non-residents\"),#REF!,0)","v":{"$error":"#REF!"}},{"$f":"IF(OR(#REF!=\"Debt securities issued by non-residents\",#REF!=\"Equities issued by non-residents\",#REF!=\"Financial derivatives\",#REF!=\"Investment fund share/units issued by foreign institutions \"),#REF!,0)","v":{"$error":"#REF!"}},null,{"$f":"#REF!","v":{"$error":"#REF!"}},null,null,null,null,null,null,null,null,null,null,null,null,null,"-",{"$error":"#REF!"},null,22]
[{"$error":"#REF!"},{"$error":"#REF!"},6,{"$error":"#REF!"},{"$error":"#REF!"},{"$error":"#REF!"},{"$f":"IF(#REF!=\"\",0,VLOOKUP(#REF!,#REF!,2,FALSE))","v":{"$error":"#REF!"}},{"$f":"IF(#REF!=\"\",0,VLOOKUP(#REF!,#REF!,2,FALSE))","v":{"$error":"#REF!"}},{"$f":"IF(#REF!=\"\",\"#LK\",VLOOKUP(#REF!,#REF!,2,FALSE))","v":{"$error":"#REF!"}},"00","DPM",{"$f":"#REF!","v":{"$error":"#REF!"}},{"$f":"#REF!","v":{"$error":"#REF!"}},{"$f":"#REF!","v":{"$error":"#REF!"}},{"$f":"IF(OR(#REF!=\"Bank Deposits held with foreign banks\",#REF!=\"Receivables from non-residents\"),#REF!,0)","v":{"$error":"#REF!"}},{"$f":"IF(OR(#REF!=\"Debt securities issued by non-residents\",#REF!=\"Equities issued by non-residents\",#REF!=\"Financial derivatives\",#REF!=\"Investment fund share/units issued by foreign institutions \"),#REF!,0)","v":{"$error":"#REF!"}},null,{"$f":"#REF!","v":{"$error":"#REF!"}},null,null,null,null,null,null,null,null,null,null,null,null,null,"-",{"$error":"#REF!"},null,23]
[{"$error":"#REF!"},{"$error":"#REF!"},6,{"$error":"#REF!"},{"$error":"#REF!"},{"$error":"#REF!"},{"$f":"IF(#REF!=\"\",0,VLOOKUP(#REF!,#REF!,2,FALSE))","v":{"$error":"#REF!"}},{"$f":"IF(#REF!=\"\",0,VLOOKUP(#REF!,#REF!,2,FALSE))","v":{"$error":"#REF!"}},{"$f":"IF(#REF!=\"\",\"#LK\",VLOOKUP(#REF!,#REF!,2,FALSE))","v":{"$error":"#REF!"}},"00","DPM",{"$f":"#REF!","v":{"$error":"#REF!"}},{"$f":"#REF!","v":{"$error":"#REF!"}},{"$f":"#REF!","v":{"$error":"#REF!"}},{"$f":"IF(OR(#REF!=\"Bank Deposits held with foreign banks\",#REF!=\"Receivables from non-residents\"),#REF!,0)","v":{"$error":"#REF!"}},{"$f":"IF(OR(#REF!=\"Debt securities issued by non-residents\",#REF!=\"Equities issued by non-residents\",#REF!=\"Financial derivatives\",#REF!=\"Investment fund share/units issued by foreign institutions \"),#REF!,0)","v":{"$error":"#REF!"}},null,{"$f":"#REF!","v":{"$error":"#REF!"}},null,null,null,null,null,null,null,null,null,null,null,null,null,"-",{"$error":"#REF!"},null,24]
[{"$error":"#REF!"},{"$error":"#REF!"},6,{"$error":"#REF!"},{"$error":"#REF!"},{"$error":"#REF!"},{"$f":"IF(#REF!=\"\",0,VLOOKUP(#REF!,#REF!,2,FALSE))","v":{"$error":"#REF!"}},{"$f":"IF(#REF!=\"\",0,VLOOKUP(#REF!,#REF!,2,FALSE))","v":{"$error":"#REF!"}},{"$f":"IF(#REF!=\"\",\"#LK\",VLOOKUP(#REF!,#REF!,2,FALSE))","v":{"$error":"#REF!"}},"00","DPM",{"$f":"#REF!","v":{"$error":"#REF!"}},{"$f":"#REF!","v":{"$error":"#REF!"}},{"$f":"#REF!","v":{"$error":"#REF!"}},{"$f":"IF(OR(#REF!=\"Bank Deposits held with foreign banks\",#REF!=\"Receivables from non-residents\"),#REF!,0)","v":{"$error":"#REF!"}},{"$f":"IF(OR(#REF!=\"Debt securities issued by non-residents\",#REF!=\"Equities issued by non-residents\",#REF!=\"Financial derivatives\",#REF!=\"Investment fund share/units issued by foreign institutions \"),#REF!,0)","v":{"$error":"#REF!"}},null,{"$f":"#REF!","v":{"$error":"#REF!"}},null,null,null,null,null,null,null,null,null,null,null,null,null,"-",{"$error":"#REF!"},null,25]
[{"$error":"#REF!"},{"$error":"#REF!"},6,{"$error":"#REF!"},{"$error":"#REF!"},{"$error":"#REF!"},{"$f":"IF(#REF!=\"\",0,VLOOKUP(#REF!,#REF!,2,FALSE))","v":{"$error":"#REF!"}},{"$f":"IF(#REF!=\"\",0,VLOOKUP(#REF!,#REF!,2,FALSE))","v":{"$error":"#REF!"}},{"$f":"IF(#REF!=\"\",\"#LK\",VLOOKUP(#REF!,#REF!,2,FALSE))","v":{"$error":"#REF!"}},"00","DPM",{"$f":"#REF!","v":{"$error":"#REF!"}},{"$f":"#REF!","v":{"$error":"#REF!"}},{"$f":"#REF!","v":{"$error":"#REF!"}},{"$f":"IF(OR(#REF!=\"Bank Deposits held with foreign banks\",#REF!=\"Receivables from non-residents\"),#REF!,0)","v":{"$error":"#REF!"}},{"$f":"IF(OR(#REF!=\"Debt securities issued by non-residents\",#REF!=\"Equities issued by non-residents\",#REF!=\"Financial derivatives\",#REF!=\"Investment fund share/units issued by foreign institutions \"),#REF!,0)","v":{"$error":"#REF!"}},null,{"$f":"#REF!","v":{"$error":"#REF!"}},null,null,null,null,null,null,null,null,null,null,null,null,null,"-",{"$error":"#REF!"},null,26]
[{"$error":"#REF!"},{"$error":"#REF!"},6,{"$error":"#REF!"},{"$error":"#REF!"},{"$error":"#REF!"},{"$f":"IF(#REF!=\"\",0,VLOOKUP(#REF!,#REF!,2,FALSE))","v":{"$error":"#REF!"}},{"$f":"IF(#REF!=\"\",0,VLOOKUP(#REF!,#REF!,2,FALSE))","v":{"$error":"#REF!"}},{"$f":"IF(#REF!=\"\",\"#LK\",VLOOKUP(#REF!,#REF!,2,FALSE))","v":{"$error":"#REF!"}},"00","DPM",{"$f":"#REF!","v":{"$error":"#REF!"}},{"$f":"#REF!","v":{"$error":"#REF!"}},{"$f":"#REF!","v":{"$error":"#REF!"}},{"$f":"IF(OR(#REF!=\"Bank Deposits held with foreign banks\",#REF!=\"Receivables from non-residents\"),#REF!,0)","v":{"$error":"#REF!"}},{"$f":"IF(OR(#REF!=\"Debt securities issued by non-residents\",#REF!=\"Equities issued by non-residents\",#REF!=\"Financial derivatives\",#REF!=\"Investment fund share/units issued by foreign institutions \"),#REF!,0)","v":{"$error":"#REF!"}},null,{"$f":"#REF!","v":{"$error":"#REF!"}},null,null,null,null,null,null,null,null,null,null,null,null,null,"-",{"$error":"#REF!"},null,27]
[{"$error":"#REF!"},{"$error":"#REF!"},6,{"$error":"#REF!"},{"$error":"#REF!"},{"$error":"#REF!"},{"$f":"IF(#REF!=\"\",0,VLOOKUP(#REF!,#REF!,2,FALSE))","v":{"$error":"#REF!"}},{"$f":"IF(#REF!=\"\",0,VLOOKUP(#REF!,#REF!,2,FALSE))","v":{"$error":"#REF!"}},{"$f":"IF(#REF!=\"\",\"#LK\",VLOOKUP(#REF!,#REF!,2,FALSE))","v":{"$error":"#REF!"}},"00","DPM",{"$f":"#REF!","v":{"$error":"#REF!"}},{"$f":"#REF!","v":{"$error":"#REF!"}},{"$f":"#REF!","v":{"$error":"#REF!"}},{"$f":"IF(OR(#REF!=\"Bank Deposits held with foreign banks\",#REF!=\"Receivables from non-residents\"),#REF!,0)","v":{"$error":"#REF!"}},{"$f":"IF(OR(#REF!=\"Debt securities issued by non-residents\",#REF!=\"Equities issued by non-residents\",#REF!=\"Financial derivatives\",#REF!=\"Investment fund share/units issued by foreign institutions \"),#REF!,0)","v":{"$error":"#REF!"}},null,{"$f":"#REF!","v":{"$error":"#REF!"}},null,null,null,null,null,null,null,null,null,null,null,null,null,"-",{"$error":"#REF!"},null,28]
[{"$error":"#REF!"},{"$error":"#REF!"},6,{"$error":"#REF!"},{"$error":"#REF!"},{"$error":"#REF!"},{"$f":"IF(#REF!=\"\",0,VLOOKUP(#REF!,#REF!,2,FALSE))","v":{"$error":"#REF!"}},{"$f":"IF(#REF!=\"\",0,VLOOKUP(#REF!,#REF!,2,FALSE))","v":{"$error":"#REF!"}},{"$f":"IF(#REF!=\"\",\"#LK\",VLOOKUP(#REF!,#REF!,2,FALSE))","v":{"$error":"#REF!"}},"00","DPM",{"$f":"#REF!","v":{"$error":"#REF!"}},{"$f":"#REF!","v":{"$error":"#REF!"}},{"$f":"#REF!","v":{"$error":"#REF!"}},{"$f":"IF(OR(#REF!=\"Bank Deposits held with foreign banks\",#REF!=\"Receivables from non-residents\"),#REF!,0)","v":{"$error":"#REF!"}},{"$f":"IF(OR(#REF!=\"Debt securities issued by non-residents\",#REF!=\"Equities issued by non-residents\",#REF!=\"Financial derivatives\",#REF!=\"Investment fund share/units issued by foreign institutions \"),#REF!,0)","v":{"$error":"#REF!"}},null,{"$f":"#REF!","v":{"$error":"#REF!"}},null,null,null,null,null,null,null,null,null,null,null,null,null,"-",{"$error":"#REF!"},null,29]
[{"$error":"#REF!"},{"$error":"#REF!"},6,{"$error":"#REF!"},{"$error":"#REF!"},{"$error":"#REF!"},{"$f":"IF(#REF!=\"\",0,VLOOKUP(#REF!,#REF!,2,FALSE))","v":{"$error":"#REF!"}},{"$f":"IF(#REF!=\"\",0,VLOOKUP(#REF!,#REF!,2,FALSE))","v":{"$error":"#REF!"}},{"$f":"IF(#REF!=\"\",\"#LK\",VLOOKUP(#REF!,#REF!,2,FALSE))","v":{"$error":"#REF!"}},"00","DPM",{"$f":"#REF!","v":{"$error":"#REF!"}},{"$f":"#REF!","v":{"$error":"#REF!"}},{"$f":"#REF!","v":{"$error":"#REF!"}},{"$f":"IF(OR(#REF!=\"Bank Deposits held with foreign banks\",#REF!=\"Receivables from non-residents\"),#REF!,0)","v":{"$error":"#REF!"}},{"$f":"IF(OR(#REF!=\"Debt securities issued by non-residents\",#REF!=\"Equities issued by non-residents\",#REF!=\"Financial derivatives\",#REF!=\"Investment fund share/units issued by foreign institutions \"),#REF!,0)","v":{"$error":"#REF!"}},null,{"$f":"#REF!","v":{"$error":"#REF!"}},null,null,null,null,null,null,null,null,null,null,null,null,null,"-",{"$error":"#REF!"},null,30]
[{"$error":"#REF!"},{"$error":"#REF!"},6,{"$error":"#REF!"},{"$error":"#REF!"},{"$error":"#REF!"},{"$f":"IF(#REF!=\"\",0,VLOOKUP(#REF!,#REF!,2,FALSE))","v":{"$error":"#REF!"}},{"$f":"IF(#REF!=\"\",0,VLOOKUP(#REF!,#REF!,2,FALSE))","v":{"$error":"#REF!"}},{"$f":"IF(#REF!=\"\",\"#LK\",VLOOKUP(#REF!,#REF!,2,FALSE))","v":{"$error":"#REF!"}},"00","DPM",{"$f":"#REF!","v":{"$error":"#REF!"}},{"$f":"#REF!","v":{"$error":"#REF!"}},{"$f":"#REF!","v":{"$error":"#REF!"}},{"$f":"IF(OR(#REF!=\"Bank Deposits held with foreign banks\",#REF!=\"Receivables from non-residents\"),#REF!,0)","v":{"$error":"#REF!"}},{"$f":"IF(OR(#REF!=\"Debt securities issued by non-residents\",#REF!=\"Equities issued by non-residents\",#REF!=\"Financial derivatives\",#REF!=\"Investment fund share/units issued by foreign institutions \"),#REF!,0)","v":{"$error":"#REF!"}},null,{"$f":"#REF!","v":{"$error":"#REF!"}},null,null,null,null,null,null,null,null,null,null,null,null,null,"-",{"$error":"#REF!"},null,31]
[{"$error":"#REF!"},{"$error":"#REF!"},6,{"$error":"#REF!"},{"$error":"#REF!"},{"$error":"#REF!"},{"$f":"IF(#REF!=\"\",0,VLOOKUP(#REF!,#REF!,2,FALSE))","v":{"$error":"#REF!"}},{"$f":"IF(#REF!=\"\",0,VLOOKUP(#REF!,#REF!,2,FALSE))","v":{"$error":"#REF!"}},{"$f":"IF(#REF!=\"\",\"#LK\",VLOOKUP(#REF!,#REF!,2,FALSE))","v":{"$error":"#REF!"}},"00","DPM",{"$f":"#REF!","v":{"$error":"#REF!"}},{"$f":"#REF!","v":{"$error":"#REF!"}},{"$f":"#REF!","v":{"$error":"#REF!"}},{"$f":"IF(OR(#REF!=\"Bank Deposits held with foreign banks\",#REF!=\"Receivables from non-residents\"),#REF!,0)","v":{"$error":"#REF!"}},{"$f":"IF(OR(#REF!=\"Debt securities issued by non-residents\",#REF!=\"Equities issued by non-residents\",#REF!=\"Financial derivatives\",#REF!=\"Investment fund share/units issued by foreign institutions \"),#REF!,0)","v":{"$error":"#REF!"}},null,{"$f":"#REF!","v":{"$error":"#REF!"}},null,null,null,null,null,null,null,null,null,null,null,null,null,"-",{"$error":"#REF!"},null,32]
[{"$error":"#REF!"},{"$error":"#REF!"},6,{"$error":"#REF!"},{"$error":"#REF!"},{"$error":"#REF!"},{"$f":"IF(#REF!=\"\",0,VLOOKUP(#REF!,#REF!,2,FALSE))","v":{"$error":"#REF!"}},{"$f":"IF(#REF!=\"\",0,VLOOKUP(#REF!,#REF!,2,FALSE))","v":{"$error":"#REF!"}},{"$f":"IF(#REF!=\"\",\"#LK\",VLOOKUP(#REF!,#REF!,2,FALSE))","v":{"$error":"#REF!"}},"00","DPM",{"$f":"#REF!","v":{"$error":"#REF!"}},{"$f":"#REF!","v":{"$error":"#REF!"}},{"$f":"#REF!","v":{"$error":"#REF!"}},{"$f":"IF(OR(#REF!=\"Bank Deposits held with foreign banks\",#REF!=\"Receivables from non-residents\"),#REF!,0)","v":{"$error":"#REF!"}},{"$f":"IF(OR(#REF!=\"Debt securities issued by non-residents\",#REF!=\"Equities issued by non-residents\",#REF!=\"Financial derivatives\",#REF!=\"Investment fund share/units issued by foreign institutions \"),#REF!,0)","v":{"$error":"#REF!"}},null,{"$f":"#REF!","v":{"$error":"#REF!"}},null,null,null,null,null,null,null,null,null,null,null,null,null,"-",{"$error":"#REF!"},null,33]
[{"$error":"#REF!"},{"$error":"#REF!"},6,{"$error":"#REF!"},{"$error":"#REF!"},{"$error":"#REF!"},{"$f":"IF(#REF!=\"\",0,VLOOKUP(#REF!,#REF!,2,FALSE))","v":{"$error":"#REF!"}},{"$f":"IF(#REF!=\"\",0,VLOOKUP(#REF!,#REF!,2,FALSE))","v":{"$error":"#REF!"}},{"$f":"IF(#REF!=\"\",\"#LK\",VLOOKUP(#REF!,#REF!,2,FALSE))","v":{"$error":"#REF!"}},"00","DPM",{"$f":"#REF!","v":{"$error":"#REF!"}},{"$f":"#REF!","v":{"$error":"#REF!"}},{"$f":"#REF!","v":{"$error":"#REF!"}},{"$f":"IF(OR(#REF!=\"Bank Deposits held with foreign banks\",#REF!=\"Receivables from non-residents\"),#REF!,0)","v":{"$error":"#REF!"}},{"$f":"IF(OR(#REF!=\"Debt securities issued by non-residents\",#REF!=\"Equities issued by non-residents\",#REF!=\"Financial derivatives\",#REF!=\"Investment fund share/units issued by foreign institutions \"),#REF!,0)","v":{"$error":"#REF!"}},null,{"$f":"#REF!","v":{"$error":"#REF!"}},null,null,null,null,null,null,null,null,null,null,null,null,null,"-",{"$error":"#REF!"},null,34]
[{"$error":"#REF!"},{"$error":"#REF!"},6,{"$error":"#REF!"},{"$error":"#REF!"},{"$error":"#REF!"},{"$f":"IF(#REF!=\"\",0,VLOOKUP(#REF!,#REF!,2,FALSE))","v":{"$error":"#REF!"}},{"$f":"IF(#REF!=\"\",0,VLOOKUP(#REF!,#REF!,2,FALSE))","v":{"$error":"#REF!"}},{"$f":"IF(#REF!=\"\",\"#LK\",VLOOKUP(#REF!,#REF!,2,FALSE))","v":{"$error":"#REF!"}},"00","DPM",{"$f":"#REF!","v":{"$error":"#REF!"}},{"$f":"#REF!","v":{"$error":"#REF!"}},{"$f":"#REF!","v":{"$error":"#REF!"}},{"$f":"IF(OR(#REF!=\"Bank Deposits held with foreign banks\",#REF!=\"Receivables from non-residents\"),#REF!,0)","v":{"$error":"#REF!"}},{"$f":"IF(OR(#REF!=\"Debt securities issued by non-residents\",#REF!=\"Equities issued by non-residents\",#REF!=\"Financial derivatives\",#REF!=\"Investment fund share/units issued by foreign institutions \"),#REF!,0)","v":{"$error":"#REF!"}},null,{"$f":"#REF!","v":{"$error":"#REF!"}},null,null,null,null,null,null,null,null,null,null,null,null,null,"-",{"$error":"#REF!"},null,35]
[{"$error":"#REF!"},{"$error":"#REF!"},6,{"$error":"#REF!"},{"$error":"#REF!"},{"$error":"#REF!"},{"$f":"IF(#REF!=\"\",0,VLOOKUP(#REF!,#REF!,2,FALSE))","v":{"$error":"#REF!"}},{"$f":"IF(#REF!=\"\",0,VLOOKUP(#REF!,#REF!,2,FALSE))","v":{"$error":"#REF!"}},{"$f":"IF(#REF!=\"\",\"#LK\",VLOOKUP(#REF!,#REF!,2,FALSE))","v":{"$error":"#REF!"}},"00","DPM",{"$f":"#REF!","v":{"$error":"#REF!"}},{"$f":"#REF!","v":{"$error":"#REF!"}},{"$f":"#REF!","v":{"$error":"#REF!"}},{"$f":"IF(OR(#REF!=\"Bank Deposits held with foreign banks\",#REF!=\"Receivables from non-residents\"),#REF!,0)","v":{"$error":"#REF!"}},{"$f":"IF(OR(#REF!=\"Debt securities issued by non-residents\",#REF!=\"Equities issued by non-residents\",#REF!=\"Financial derivatives\",#REF!=\"Investment fund share/units issued by foreign institutions \"),#REF!,0)","v":{"$error":"#REF!"}},null,{"$f":"#REF!","v":{"$error":"#REF!"}},null,null,null,null,null,null,null,null,null,null,null,null,null,"-",{"$error":"#REF!"},null,36]
[{"$error":"#REF!"},{"$error":"#REF!"},6,{"$error":"#REF!"},{"$error":"#REF!"},{"$error":"#REF!"},{"$f":"IF(#REF!=\"\",0,VLOOKUP(#REF!,#REF!,2,FALSE))","v":{"$error":"#REF!"}},{"$f":"IF(#REF!=\"\",0,VLOOKUP(#REF!,#REF!,2,FALSE))","v":{"$error":"#REF!"}},{"$f":"IF(#REF!=\"\",\"#LK\",VLOOKUP(#REF!,#REF!,2,FALSE))","v":{"$error":"#REF!"}},"00","DPM",{"$f":"#REF!","v":{"$error":"#REF!"}},{"$f":"#REF!","v":{"$error":"#REF!"}},{"$f":"#REF!","v":{"$error":"#REF!"}},{"$f":"IF(OR(#REF!=\"Bank Deposits held with foreign banks\",#REF!=\"Receivables from non-residents\"),#REF!,0)","v":{"$error":"#REF!"}},{"$f":"IF(OR(#REF!=\"Debt securities issued by non-residents\",#REF!=\"Equities issued by non-residents\",#REF!=\"Financial derivatives\",#REF!=\"Investment fund share/units issued by foreign institutions \"),#REF!,0)","v":{"$error":"#REF!"}},null,{"$f":"#REF!","v":{"$error":"#REF!"}},null,null,null,null,null,null,null,null,null,null,null,null,null,"-",{"$error":"#REF!"},null,37]
[{"$error":"#REF!"},{"$error":"#REF!"},6,{"$error":"#REF!"},{"$error":"#REF!"},{"$error":"#REF!"},{"$f":"IF(#REF!=\"\",0,VLOOKUP(#REF!,#REF!,2,FALSE))","v":{"$error":"#REF!"}},{"$f":"IF(#REF!=\"\",0,VLOOKUP(#REF!,#REF!,2,FALSE))","v":{"$error":"#REF!"}},{"$f":"IF(#REF!=\"\",\"#LK\",VLOOKUP(#REF!,#REF!,2,FALSE))","v":{"$error":"#REF!"}},"00","DPM",{"$f":"#REF!","v":{"$error":"#REF!"}},{"$f":"#REF!","v":{"$error":"#REF!"}},{"$f":"#REF!","v":{"$error":"#REF!"}},{"$f":"IF(OR(#REF!=\"Bank Deposits held with foreign banks\",#REF!=\"Receivables from non-residents\"),#REF!,0)","v":{"$error":"#REF!"}},{"$f":"IF(OR(#REF!=\"Debt securities issued by non-residents\",#REF!=\"Equities issued by non-residents\",#REF!=\"Financial derivatives\",#REF!=\"Investment fund share/units issued by foreign institutions \"),#REF!,0)","v":{"$error":"#REF!"}},null,{"$f":"#REF!","v":{"$error":"#REF!"}},null,null,null,null,null,null,null,null,null,null,null,null,null,"-",{"$error":"#REF!"},null,38]
[{"$error":"#REF!"},{"$error":"#REF!"},6,{"$error":"#REF!"},{"$error":"#REF!"},{"$error":"#REF!"},{"$f":"IF(#REF!=\"\",0,VLOOKUP(#REF!,#REF!,2,FALSE))","v":{"$error":"#REF!"}},{"$f":"IF(#REF!=\"\",0,VLOOKUP(#REF!,#REF!,2,FALSE))","v":{"$error":"#REF!"}},{"$f":"IF(#REF!=\"\",\"#LK\",VLOOKUP(#REF!,#REF!,2,FALSE))","v":{"$error":"#REF!"}},"00","DPM",{"$f":"#REF!","v":{"$error":"#REF!"}},{"$f":"#REF!","v":{"$error":"#REF!"}},{"$f":"#REF!","v":{"$error":"#REF!"}},{"$f":"IF(OR(#REF!=\"Bank Deposits held with foreign banks\",#REF!=\"Receivables from non-residents\"),#REF!,0)","v":{"$error":"#REF!"}},{"$f":"IF(OR(#REF!=\"Debt securities issued by non-residents\",#REF!=\"Equities issued by non-residents\",#REF!=\"Financial derivatives\",#REF!=\"Investment fund share/units issued by foreign institutions \"),#REF!,0)","v":{"$error":"#REF!"}},null,{"$f":"#REF!","v":{"$error":"#REF!"}},null,null,null,null,null,null,null,null,null,null,null,null,null,"-",{"$error":"#REF!"},null,39]
[{"$error":"#REF!"},{"$error":"#REF!"},6,{"$error":"#REF!"},{"$error":"#REF!"},{"$error":"#REF!"},{"$f":"IF(#REF!=\"\",0,VLOOKUP(#REF!,#REF!,2,FALSE))","v":{"$error":"#REF!"}},{"$f":"IF(#REF!=\"\",0,VLOOKUP(#REF!,#REF!,2,FALSE))","v":{"$error":"#REF!"}},{"$f":"IF(#REF!=\"\",\"#LK\",VLOOKUP(#REF!,#REF!,2,FALSE))","v":{"$error":"#REF!"}},"00","DPM",{"$f":"#REF!","v":{"$error":"#REF!"}},{"$f":"#REF!","v":{"$error":"#REF!"}},{"$f":"#REF!","v":{"$error":"#REF!"}},{"$f":"IF(OR(#REF!=\"Bank Deposits held with foreign banks\",#REF!=\"Receivables from non-residents\"),#REF!,0)","v":{"$error":"#REF!"}},{"$f":"IF(OR(#REF!=\"Debt securities issued by non-residents\",#REF!=\"Equities issued by non-residents\",#REF!=\"Financial derivatives\",#REF!=\"Investment fund share/units issued by foreign institutions \"),#REF!,0)","v":{"$error":"#REF!"}},null,{"$f":"#REF!","v":{"$error":"#REF!"}},null,null,null,null,null,null,null,null,null,null,null,null,null,"-",{"$error":"#REF!"},null,40]
[{"$error":"#REF!"},{"$error":"#REF!"},6,{"$error":"#REF!"},{"$error":"#REF!"},{"$error":"#REF!"},{"$f":"IF(#REF!=\"\",0,VLOOKUP(#REF!,#REF!,2,FALSE))","v":{"$error":"#REF!"}},{"$f":"IF(#REF!=\"\",0,VLOOKUP(#REF!,#REF!,2,FALSE))","v":{"$error":"#REF!"}},{"$f":"IF(#REF!=\"\",\"#LK\",VLOOKUP(#REF!,#REF!,2,FALSE))","v":{"$error":"#REF!"}},"00","DPM",{"$f":"#REF!","v":{"$error":"#REF!"}},{"$f":"#REF!","v":{"$error":"#REF!"}},{"$f":"#REF!","v":{"$error":"#REF!"}},{"$f":"IF(OR(#REF!=\"Bank Deposits held with foreign banks\",#REF!=\"Receivables from non-residents\"),#REF!,0)","v":{"$error":"#REF!"}},{"$f":"IF(OR(#REF!=\"Debt securities issued by non-residents\",#REF!=\"Equities issued by non-residents\",#REF!=\"Financial derivatives\",#REF!=\"Investment fund share/units issued by foreign institutions \"),#REF!,0)","v":{"$error":"#REF!"}},null,{"$f":"#REF!","v":{"$error":"#REF!"}},null,null,null,null,null,null,null,null,null,null,null,null,null,"-",{"$error":"#REF!"},null,41]
[{"$error":"#REF!"},{"$error":"#REF!"},6,{"$error":"#REF!"},{"$error":"#REF!"},{"$error":"#REF!"},{"$f":"IF(#REF!=\"\",0,VLOOKUP(#REF!,#REF!,2,FALSE))","v":{"$error":"#REF!"}},{"$f":"IF(#REF!=\"\",0,VLOOKUP(#REF!,#REF!,2,FALSE))","v":{"$error":"#REF!"}},{"$f":"IF(#REF!=\"\",\"#LK\",VLOOKUP(#REF!,#REF!,2,FALSE))","v":{"$error":"#REF!"}},"00","DPM",{"$f":"#REF!","v":{"$error":"#REF!"}},{"$f":"#REF!","v":{"$error":"#REF!"}},{"$f":"#REF!","v":{"$error":"#REF!"}},{"$f":"IF(OR(#REF!=\"Bank Deposits held with foreign banks\",#REF!=\"Receivables from non-residents\"),#REF!,0)","v":{"$error":"#REF!"}},{"$f":"IF(OR(#REF!=\"Debt securities issued by non-residents\",#REF!=\"Equities issued by non-residents\",#REF!=\"Financial derivatives\",#REF!=\"Investment fund share/units issued by foreign institutions \"),#REF!,0)","v":{"$error":"#REF!"}},null,{"$f":"#REF!","v":{"$error":"#REF!"}},null,null,null,null,null,null,null,null,null,null,null,null,null,"-",{"$error":"#REF!"},null,42]
[{"$error":"#REF!"},{"$error":"#REF!"},6,{"$error":"#REF!"},{"$error":"#REF!"},{"$error":"#REF!"},{"$f":"IF(#REF!<>\"\",9990,0)","v":{"$error":"#REF!"}},{"$f":"IF(#REF!=\"\",0,VLOOKUP(#REF!,#REF!,2,FALSE))","v":{"$error":"#REF!"}},"#LK","00","DPM",{"$f":"#REF!","v":{"$error":"#REF!"}},{"$f":"#REF!","v":{"$error":"#REF!"}},{"$f":"#REF!","v":{"$error":"#REF!"}},null,{"$f":"#REF!","v":{"$error":"#REF!"}},null,{"$f":"#REF!","v":{"$error":"#REF!"}},null,null,null,null,null,null,null,null,null,null,null,null,null,{"$f":"IF(#REF!<>\"\",#REF!,\"-\")","v":{"$error":"#REF!"}},{"$error":"#REF!"},null,47]
[{"$error":"#REF!"},{"$error":"#REF!"},6,{"$error":"#REF!"},{"$error":"#REF!"},{"$error":"#REF!"},{"$f":"IF(#REF!<>\"\",9990,0)","v":{"$error":"#REF!"}},{"$f":"IF(#REF!=\"\",0,VLOOKUP(#REF!,#REF!,2,FALSE))","v":{"$error":"#REF!"}},"#LK","00","DPM",{"$f":"#REF!","v":{"$error":"#REF!"}},{"$f":"#REF!","v":{"$error":"#REF!"}},{"$f":"#REF!","v":{"$error":"#REF!"}},null,{"$f":"#REF!","v":{"$error":"#REF!"}},null,{"$f":"#REF!","v":{"$error":"#REF!"}},null,null,null,null,null,null,null,null,null,null,null,null,null,{"$f":"IF(#REF!<>\"\",#REF!,\"-\")","v":{"$error":"#REF!"}},{"$error":"#REF!"},null,48]
[{"$error":"#REF!"},{"$error":"#REF!"},6,{"$error":"#REF!"},{"$error":"#REF!"},{"$error":"#REF!"},{"$f":"IF(#REF!<>\"\",9990,0)","v":{"$error":"#REF!"}},{"$f":"IF(#REF!=\"\",0,VLOOKUP(#REF!,#REF!,2,FALSE))","v":{"$error":"#REF!"}},"#LK","00","DPM",{"$f":"#REF!","v":{"$error":"#REF!"}},{"$f":"#REF!","v":{"$error":"#REF!"}},{"$f":"#REF!","v":{"$error":"#REF!"}},null,{"$f":"#REF!","v":{"$error":"#REF!"}},null,{"$f":"#REF!","v":{"$error":"#REF!"}},null,null,null,null,null,null,null,null,null,null,null,null,null,{"$f":"IF(#REF!<>\"\",#REF!,\"-\")","v":{"$error":"#REF!"}},{"$error":"#REF!"},null,49]
[{"$error":"#REF!"},{"$error":"#REF!"},6,{"$error":"#REF!"},{"$error":"#REF!"},{"$error":"#REF!"},{"$f":"IF(#REF!<>\"\",9990,0)","v":{"$error":"#REF!"}},{"$f":"IF(#REF!=\"\",0,VLOOKUP(#REF!,#REF!,2,FALSE))","v":{"$error":"#REF!"}},"#LK","00","DPM",{"$f":"#REF!","v":{"$error":"#REF!"}},{"$f":"#REF!","v":{"$error":"#REF!"}},{"$f":"#REF!","v":{"$error":"#REF!"}},null,{"$f":"#REF!","v":{"$error":"#REF!"}},null,{"$f":"#REF!","v":{"$error":"#REF!"}},null,null,null,null,null,null,null,null,null,null,null,null,null,{"$f":"IF(#REF!<>\"\",#REF!,\"-\")","v":{"$error":"#REF!"}},{"$error":"#REF!"},null,50]
[{"$error":"#REF!"},{"$error":"#REF!"},6,{"$error":"#REF!"},{"$error":"#REF!"},{"$error":"#REF!"},{"$f":"IF(#REF!<>\"\",9990,0)","v":{"$error":"#REF!"}},{"$f":"IF(#REF!=\"\",0,VLOOKUP(#REF!,#REF!,2,FALSE))","v":{"$error":"#REF!"}},"#LK","00","DPM",{"$f":"#REF!","v":{"$error":"#REF!"}},{"$f":"#REF!","v":{"$error":"#REF!"}},{"$f":"#REF!","v":{"$error":"#REF!"}},null,{"$f":"#REF!","v":{"$error":"#REF!"}},null,{"$f":"#REF!","v":{"$error":"#REF!"}},null,null,null,null,null,null,null,null,null,null,null,null,null,{"$f":"IF(#REF!<>\"\",#REF!,\"-\")","v":{"$error":"#REF!"}},{"$error":"#REF!"},null,51]
[{"$error":"#REF!"},{"$error":"#REF!"},6,{"$error":"#REF!"},{"$error":"#REF!"},{"$error":"#REF!"},{"$f":"IF(#REF!<>\"\",9990,0)","v":{"$error":"#REF!"}},{"$f":"IF(#REF!=\"\",0,VLOOKUP(#REF!,#REF!,2,FALSE))","v":{"$error":"#REF!"}},"#LK","00","DPM",{"$f":"#REF!","v":{"$error":"#REF!"}},{"$f":"#REF!","v":{"$error":"#REF!"}},{"$f":"#REF!","v":{"$error":"#REF!"}},null,{"$f":"#REF!","v":{"$error":"#REF!"}},null,{"$f":"#REF!","v":{"$error":"#REF!"}},null,null,null,null,null,null,null,null,null,null,null,null,null,{"$f":"IF(#REF!<>\"\",#REF!,\"-\")","v":{"$error":"#REF!"}},{"$error":"#REF!"},null,52]
[{"$error":"#REF!"},{"$error":"#REF!"},6,{"$error":"#REF!"},{"$error":"#REF!"},{"$error":"#REF!"},{"$f":"IF(#REF!<>\"\",9990,0)","v":{"$error":"#REF!"}},{"$f":"IF(#REF!=\"\",0,VLOOKUP(#REF!,#REF!,2,FALSE))","v":{"$error":"#REF!"}},"#LK","00","DPM",{"$f":"#REF!","v":{"$error":"#REF!"}},{"$f":"#REF!","v":{"$error":"#REF!"}},{"$f":"#REF!","v":{"$error":"#REF!"}},null,{"$f":"#REF!","v":{"$error":"#REF!"}},null,{"$f":"#REF!","v":{"$error":"#REF!"}},null,null,null,null,null,null,null,null,null,null,null,null,null,{"$f":"IF(#REF!<>\"\",#REF!,\"-\")","v":{"$error":"#REF!"}},{"$error":"#REF!"},null,53]
[{"$error":"#REF!"},{"$error":"#REF!"},6,{"$error":"#REF!"},{"$error":"#REF!"},{"$error":"#REF!"},{"$f":"IF(#REF!<>\"\",9990,0)","v":{"$error":"#REF!"}},{"$f":"IF(#REF!=\"\",0,VLOOKUP(#REF!,#REF!,2,FALSE))","v":{"$error":"#REF!"}},"#LK","00","DPM",{"$f":"#REF!","v":{"$error":"#REF!"}},{"$f":"#REF!","v":{"$error":"#REF!"}},{"$f":"#REF!","v":{"$error":"#REF!"}},null,{"$f":"#REF!","v":{"$error":"#REF!"}},null,{"$f":"#REF!","v":{"$error":"#REF!"}},null,null,null,null,null,null,null,null,null,null,null,null,null,{"$f":"IF(#REF!<>\"\",#REF!,\"-\")","v":{"$error":"#REF!"}},{"$error":"#REF!"},null,54]
[{"$error":"#REF!"},{"$error":"#REF!"},6,{"$error":"#REF!"},{"$error":"#REF!"},{"$error":"#REF!"},{"$f":"IF(#REF!<>\"\",9990,0)","v":{"$error":"#REF!"}},{"$f":"IF(#REF!=\"\",0,VLOOKUP(#REF!,#REF!,2,FALSE))","v":{"$error":"#REF!"}},"#LK","00","DPM",{"$f":"#REF!","v":{"$error":"#REF!"}},{"$f":"#REF!","v":{"$error":"#REF!"}},{"$f":"#REF!","v":{"$error":"#REF!"}},null,{"$f":"#REF!","v":{"$error":"#REF!"}},null,{"$f":"#REF!","v":{"$error":"#REF!"}},null,null,null,null,null,null,null,null,null,null,null,null,null,{"$f":"IF(#REF!<>\"\",#REF!,\"-\")","v":{"$error":"#REF!"}},{"$error":"#REF!"},null,55]
[{"$error":"#REF!"},{"$error":"#REF!"},6,{"$error":"#REF!"},{"$error":"#REF!"},{"$error":"#REF!"},{"$f":"IF(#REF!<>\"\",9990,0)","v":{"$error":"#REF!"}},{"$f":"IF(#REF!=\"\",0,VLOOKUP(#REF!,#REF!,2,FALSE))","v":{"$error":"#REF!"}},"#LK","00","DPM",{"$f":"#REF!","v":{"$error":"#REF!"}},{"$f":"#REF!","v":{"$error":"#REF!"}},{"$f":"#REF!","v":{"$error":"#REF!"}},null,{"$f":"#REF!","v":{"$error":"#REF!"}},null,{"$f":"#REF!","v":{"$error":"#REF!"}},null,null,null,null,null,null,null,null,null,null,null,null,null,{"$f":"IF(#REF!<>\"\",#REF!,\"-\")","v":{"$error":"#REF!"}},{"$error":"#REF!"},null,56]
[{"$error":"#REF!"},{"$error":"#REF!"},7,{"$error":"#REF!"},{"$error":"#REF!"},{"$error":"#REF!"},{"$f":"IF(#REF!=\"\",0,VLOOKUP(#REF!,#REF!,2,FALSE))","v":{"$error":"#REF!"}},{"$f":"IF(#REF!=\"\",0,VLOOKUP(#REF!,#REF!,2,FALSE))","v":{"$error":"#REF!"}},"#LK","00","DPM",{"$f":"#REF!","v":{"$error":"#REF!"}},{"$f":"#REF!","v":{"$error":"#REF!"}},{"$f":"#REF!","v":{"$error":"#REF!"}},null,{"$f":"#REF!","v":{"$error":"#REF!"}},null,{"$f":"#REF!","v":{"$error":"#REF!"}},null,null,null,null,null,null,null,null,null,null,null,null,null,"-",{"$error":"#REF!"},"Sheet 25 External Balance Sheet'!F62 / G62 / H62 / I62 / J62",62]
[{"$error":"#REF!"},{"$error":"#REF!"},7,{"$error":"#REF!"},{"$error":"#REF!"},{"$error":"#REF!"},{"$f":"IF(#REF!=\"\",0,VLOOKUP(#REF!,#REF!,2,FALSE))","v":{"$error":"#REF!"}},{"$f":"IF(#REF!=\"\",0,VLOOKUP(#REF!,#REF!,2,FALSE))","v":{"$error":"#REF!"}},"#LK","00","DPM",{"$f":"#REF!","v":{"$error":"#REF!"}},{"$f":"#REF!","v":{"$error":"#REF!"}},{"$f":"#REF!","v":{"$error":"#REF!"}},null,{"$f":"#REF!","v":{"$error":"#REF!"}},null,{"$f":"#REF!","v":{"$error":"#REF!"}},null,null,null,null,null,null,null,null,null,null,null,null,null,"-",{"$error":"#REF!"},null,63]
[{"$error":"#REF!"},{"$error":"#REF!"},7,{"$error":"#REF!"},{"$error":"#REF!"},{"$error":"#REF!"},{"$f":"IF(#REF!=\"\",0,VLOOKUP(#REF!,#REF!,2,FALSE))","v":{"$error":"#REF!"}},{"$f":"IF(#REF!=\"\",0,VLOOKUP(#REF!,#REF!,2,FALSE))","v":{"$error":"#REF!"}},"#LK","00","DPM",{"$f":"#REF!","v":{"$error":"#REF!"}},{"$f":"#REF!","v":{"$error":"#REF!"}},{"$f":"#REF!","v":{"$error":"#REF!"}},null,{"$f":"#REF!","v":{"$error":"#REF!"}},null,{"$f":"#REF!","v":{"$error":"#REF!"}},null,null,null,null,null,null,null,null,null,null,null,null,null,"-",{"$error":"#REF!"},null,64]
[{"$error":"#REF!"},{"$error":"#REF!"},7,{"$error":"#REF!"},{"$error":"#REF!"},{"$error":"#REF!"},{"$f":"IF(#REF!=\"\",0,VLOOKUP(#REF!,#REF!,2,FALSE))","v":{"$error":"#REF!"}},{"$f":"IF(#REF!=\"\",0,VLOOKUP(#REF!,#REF!,2,FALSE))","v":{"$error":"#REF!"}},"#LK","00","DPM",{"$f":"#REF!","v":{"$error":"#REF!"}},{"$f":"#REF!","v":{"$error":"#REF!"}},{"$f":"#REF!","v":{"$error":"#REF!"}},null,{"$f":"#REF!","v":{"$error":"#REF!"}},null,{"$f":"#REF!","v":{"$error":"#REF!"}},null,null,null,null,null,null,null,null,null,null,null,null,null,"-",{"$error":"#REF!"},null,65]
[{"$error":"#REF!"},{"$error":"#REF!"},7,{"$error":"#REF!"},{"$error":"#REF!"},{"$error":"#REF!"},{"$f":"IF(#REF!=\"\",0,VLOOKUP(#REF!,#REF!,2,FALSE))","v":{"$error":"#REF!"}},{"$f":"IF(#REF!=\"\",0,VLOOKUP(#REF!,#REF!,2,FALSE))","v":{"$error":"#REF!"}},"#LK","00","DPM",{"$f":"#REF!","v":{"$error":"#REF!"}},{"$f":"#REF!","v":{"$error":"#REF!"}},{"$f":"#REF!","v":{"$error":"#REF!"}},null,{"$f":"#REF!","v":{"$error":"#REF!"}},null,{"$f":"#REF!","v":{"$error":"#REF!"}},null,null,null,null,null,null,null,null,null,null,null,null,null,"-",{"$error":"#REF!"},null,66]
[{"$error":"#REF!"},{"$error":"#REF!"},7,{"$error":"#REF!"},{"$error":"#REF!"},{"$error":"#REF!"},{"$f":"IF(#REF!=\"\",0,VLOOKUP(#REF!,#REF!,2,FALSE))","v":{"$error":"#REF!"}},{"$f":"IF(#REF!=\"\",0,VLOOKUP(#REF!,#REF!,2,FALSE))","v":{"$error":"#REF!"}},"#LK","00","DPM",{"$f":"#REF!","v":{"$error":"#REF!"}},{"$f":"#REF!","v":{"$error":"#REF!"}},{"$f":"#REF!","v":{"$error":"#REF!"}},null,{"$f":"#REF!","v":{"$error":"#REF!"}},null,{"$f":"#REF!","v":{"$error":"#REF!"}},null,null,null,null,null,null,null,null,null,null,null,null,null,"-",{"$error":"#REF!"},null,67]
[{"$error":"#REF!"},{"$error":"#REF!"},7,{"$error":"#REF!"},{"$error":"#REF!"},{"$error":"#REF!"},{"$f":"IF(#REF!=\"\",0,VLOOKUP(#REF!,#REF!,2,FALSE))","v":{"$error":"#REF!"}},{"$f":"IF(#REF!=\"\",0,VLOOKUP(#REF!,#REF!,2,FALSE))","v":{"$error":"#REF!"}},"#LK","00","DPM",{"$f":"#REF!","v":{"$error":"#REF!"}},{"$f":"#REF!","v":{"$error":"#REF!"}},{"$f":"#REF!","v":{"$error":"#REF!"}},null,{"$f":"#REF!","v":{"$error":"#REF!"}},null,{"$f":"#REF!","v":{"$error":"#REF!"}},null,null,null,null,null,null,null,null,null,null,null,null,null,"-",{"$error":"#REF!"},null,68]
[{"$error":"#REF!"},{"$error":"#REF!"},7,{"$error":"#REF!"},{"$error":"#REF!"},{"$error":"#REF!"},{"$f":"IF(#REF!=\"\",0,VLOOKUP(#REF!,#REF!,2,FALSE))","v":{"$error":"#REF!"}},{"$f":"IF(#REF!=\"\",0,VLOOKUP(#REF!,#REF!,2,FALSE))","v":{"$error":"#REF!"}},"#LK","00","DPM",{"$f":"#REF!","v":{"$error":"#REF!"}},{"$f":"#REF!","v":{"$error":"#REF!"}},{"$f":"#REF!","v":{"$error":"#REF!"}},null,{"$f":"#REF!","v":{"$error":"#REF!"}},null,{"$f":"#REF!","v":{"$error":"#REF!"}},null,null,null,null,null,null,null,null,null,null,null,null,null,"-",{"$error":"#REF!"},null,69]
[{"$error":"#REF!"},{"$error":"#REF!"},7,{"$error":"#REF!"},{"$error":"#REF!"},{"$error":"#REF!"},{"$f":"IF(#REF!=\"\",0,VLOOKUP(#REF!,#REF!,2,FALSE))","v":{"$error":"#REF!"}},{"$f":"IF(#REF!=\"\",0,VLOOKUP(#REF!,#REF!,2,FALSE))","v":{"$error":"#REF!"}},"#LK","00","DPM",{"$f":"#REF!","v":{"$error":"#REF!"}},{"$f":"#REF!","v":{"$error":"#REF!"}},{"$f":"#REF!","v":{"$error":"#REF!"}},null,{"$f":"#REF!","v":{"$error":"#REF!"}},null,{"$f":"#REF!","v":{"$error":"#REF!"}},null,null,null,null,null,null,null,null,null,null,null,null,null,"-",{"$error":"#REF!"},null,70]
[{"$error":"#REF!"},{"$error":"#REF!"},7,{"$error":"#REF!"},{"$error":"#REF!"},{"$error":"#REF!"},{"$f":"IF(#REF!=\"\",0,VLOOKUP(#REF!,#REF!,2,FALSE))","v":{"$error":"#REF!"}},{"$f":"IF(#REF!=\"\",0,VLOOKUP(#REF!,#REF!,2,FALSE))","v":{"$error":"#REF!"}},"#LK","00","DPM",{"$f":"#REF!","v":{"$error":"#REF!"}},{"$f":"#REF!","v":{"$error":"#REF!"}},{"$f":"#REF!","v":{"$error":"#REF!"}},null,{"$f":"#REF!","v":{"$error":"#REF!"}},null,{"$f":"#REF!","v":{"$error":"#REF!"}},null,null,null,null,null,null,null,null,null,null,null,null,null,"-",{"$error":"#REF!"},null,71]
[{"$error":"#REF!"},{"$error":"#REF!"},7,{"$error":"#REF!"},{"$error":"#REF!"},{"$error":"#REF!"},{"$f":"IF(#REF!=\"\",0,VLOOKUP(#REF!,#REF!,2,FALSE))","v":{"$error":"#REF!"}},{"$f":"IF(#REF!=\"\",0,VLOOKUP(#REF!,#REF!,2,FALSE))","v":{"$error":"#REF!"}},"#LK","00","DPM",{"$f":"#REF!","v":{"$error":"#REF!"}},{"$f":"#REF!","v":{"$error":"#REF!"}},{"$f":"#REF!","v":{"$error":"#REF!"}},null,{"$f":"#REF!","v":{"$error":"#REF!"}},null,{"$f":"#REF!","v":{"$error":"#REF!"}},null,null,null,null,null,null,null,null,null,null,null,null,null,"-",{"$error":"#REF!"},null,72]
[{"$error":"#REF!"},{"$error":"#REF!"},7,{"$error":"#REF!"},{"$error":"#REF!"},{"$error":"#REF!"},{"$f":"IF(#REF!=\"\",0,VLOOKUP(#REF!,#REF!,2,FALSE))","v":{"$error":"#REF!"}},{"$f":"IF(#REF!=\"\",0,VLOOKUP(#REF!,#REF!,2,FALSE))","v":{"$error":"#REF!"}},"#LK","00","DPM",{"$f":"#REF!","v":{"$error":"#REF!"}},{"$f":"#REF!","v":{"$error":"#REF!"}},{"$f":"#REF!","v":{"$error":"#REF!"}},null,{"$f":"#REF!","v":{"$error":"#REF!"}},null,{"$f":"#REF!","v":{"$error":"#REF!"}},null,null,null,null,null,null,null,null,null,null,null,null,null,"-",{"$error":"#REF!"},null,73]
[{"$error":"#REF!"},{"$error":"#REF!"},7,{"$error":"#REF!"},{"$error":"#REF!"},{"$error":"#REF!"},{"$f":"IF(#REF!=\"\",0,VLOOKUP(#REF!,#REF!,2,FALSE))","v":{"$error":"#REF!"}},{"$f":"IF(#REF!=\"\",0,VLOOKUP(#REF!,#REF!,2,FALSE))","v":{"$error":"#REF!"}},"#LK","00","DPM",{"$f":"#REF!","v":{"$error":"#REF!"}},{"$f":"#REF!","v":{"$error":"#REF!"}},{"$f":"#REF!","v":{"$error":"#REF!"}},null,{"$f":"#REF!","v":{"$error":"#REF!"}},null,{"$f":"#REF!","v":{"$error":"#REF!"}},null,null,null,null,null,null,null,null,null,null,null,null,null,"-",{"$error":"#REF!"},null,74]
[{"$error":"#REF!"},{"$error":"#REF!"},7,{"$error":"#REF!"},{"$error":"#REF!"},{"$error":"#REF!"},{"$f":"IF(#REF!=\"\",0,VLOOKUP(#REF!,#REF!,2,FALSE))","v":{"$error":"#REF!"}},{"$f":"IF(#REF!=\"\",0,VLOOKUP(#REF!,#REF!,2,FALSE))","v":{"$error":"#REF!"}},"#LK","00","DPM",{"$f":"#REF!","v":{"$error":"#REF!"}},{"$f":"#REF!","v":{"$error":"#REF!"}},{"$f":"#REF!","v":{"$error":"#REF!"}},null,{"$f":"#REF!","v":{"$error":"#REF!"}},null,{"$f":"#REF!","v":{"$error":"#REF!"}},null,null,null,null,null,null,null,null,null,null,null,null,null,"-",{"$error":"#REF!"},null,75]
[{"$error":"#REF!"},{"$error":"#REF!"},7,{"$error":"#REF!"},{"$error":"#REF!"},{"$error":"#REF!"},{"$f":"IF(#REF!=\"\",0,VLOOKUP(#REF!,#REF!,2,FALSE))","v":{"$error":"#REF!"}},{"$f":"IF(#REF!=\"\",0,VLOOKUP(#REF!,#REF!,2,FALSE))","v":{"$error":"#REF!"}},"#LK","00","DPM",{"$f":"#REF!","v":{"$error":"#REF!"}},{"$f":"#REF!","v":{"$error":"#REF!"}},{"$f":"#REF!","v":{"$error":"#REF!"}},null,{"$f":"#REF!","v":{"$error":"#REF!"}},null,{"$f":"#REF!","v":{"$error":"#REF!"}},null,null,null,null,null,null,null,null,null,null,null,null,null,"-",{"$error":"#REF!"},null,76]
[{"$error":"#REF!"},{"$error":"#REF!"},7,{"$error":"#REF!"},{"$error":"#REF!"},{"$error":"#REF!"},{"$f":"IF(#REF!=\"\",0,VLOOKUP(#REF!,#REF!,2,FALSE))","v":{"$error":"#REF!"}},{"$f":"IF(#REF!=\"\",0,VLOOKUP(#REF!,#REF!,2,FALSE))","v":{"$error":"#REF!"}},"#LK","00","DPM",{"$f":"#REF!","v":{"$error":"#REF!"}},{"$f":"#REF!","v":{"$error":"#REF!"}},{"$f":"#REF!","v":{"$error":"#REF!"}},null,{"$f":"#REF!","v":{"$error":"#REF!"}},null,{"$f":"#REF!","v":{"$error":"#REF!"}},null,null,null,null,null,null,null,null,null,null,null,null,null,"-",{"$error":"#REF!"},null,77]
[{"$error":"#REF!"},{"$error":"#REF!"},7,{"$error":"#REF!"},{"$error":"#REF!"},{"$error":"#REF!"},{"$f":"IF(#REF!=\"\",0,VLOOKUP(#REF!,#REF!,2,FALSE))","v":{"$error":"#REF!"}},{"$f":"IF(#REF!=\"\",0,VLOOKUP(#REF!,#REF!,2,FALSE))","v":{"$error":"#REF!"}},"#LK","00","DPM",{"$f":"#REF!","v":{"$error":"#REF!"}},{"$f":"#REF!","v":{"$error":"#REF!"}},{"$f":"#REF!","v":{"$error":"#REF!"}},null,{"$f":"#REF!","v":{"$error":"#REF!"}},null,{"$f":"#REF!","v":{"$error":"#REF!"}},null,null,null,null,null,null,null,null,null,null,null,null,null,"-",{"$error":"#REF!"},null,78]
[{"$error":"#REF!"},{"$error":"#REF!"},7,{"$error":"#REF!"},{"$error":"#REF!"},{"$error":"#REF!"},{"$f":"IF(#REF!=\"\",0,VLOOKUP(#REF!,#REF!,2,FALSE))","v":{"$error":"#REF!"}},{"$f":"IF(#REF!=\"\",0,VLOOKUP(#REF!,#REF!,2,FALSE))","v":{"$error":"#REF!"}},"#LK","00","DPM",{"$f":"#REF!","v":{"$error":"#REF!"}},{"$f":"#REF!","v":{"$error":"#REF!"}},{"$f":"#REF!","v":{"$error":"#REF!"}},null,{"$f":"#REF!","v":{"$error":"#REF!"}},null,{"$f":"#REF!","v":{"$error":"#REF!"}},null,null,null,null,null,null,null,null,null,null,null,null,null,"-",{"$error":"#REF!"},null,79]
[{"$error":"#REF!"},{"$error":"#REF!"},7,{"$error":"#REF!"},{"$error":"#REF!"},{"$error":"#REF!"},{"$f":"IF(#REF!=\"\",0,VLOOKUP(#REF!,#REF!,2,FALSE))","v":{"$error":"#REF!"}},{"$f":"IF(#REF!=\"\",0,VLOOKUP(#REF!,#REF!,2,FALSE))","v":{"$error":"#REF!"}},"#LK","00","DPM",{"$f":"#REF!","v":{"$error":"#REF!"}},{"$f":"#REF!","v":{"$error":"#REF!"}},{"$f":"#REF!","v":{"$error":"#REF!"}},null,{"$f":"#REF!","v":{"$error":"#REF!"}},null,{"$f":"#REF!","v":{"$error":"#REF!"}},null,null,null,null,null,null,null,null,null,null,null,null,null,"-",{"$error":"#REF!"},null,80]
[{"$error":"#REF!"},{"$error":"#REF!"},7,{"$error":"#REF!"},{"$error":"#REF!"},{"$error":"#REF!"},{"$f":"IF(#REF!=\"\",0,VLOOKUP(#REF!,#REF!,2,FALSE))","v":{"$error":"#REF!"}},{"$f":"IF(#REF!=\"\",0,VLOOKUP(#REF!,#REF!,2,FALSE))","v":{"$error":"#REF!"}},"#LK","00","DPM",{"$f":"#REF!","v":{"$error":"#REF!"}},{"$f":"#REF!","v":{"$error":"#REF!"}},{"$f":"#REF!","v":{"$error":"#REF!"}},null,{"$f":"#REF!","v":{"$error":"#REF!"}},null,{"$f":"#REF!","v":{"$error":"#REF!"}},null,null,null,null,null,null,null,null,null,null,null,null,null,"-",{"$error":"#REF!"},null,81]
[{"$error":"#REF!"},{"$error":"#REF!"},7,{"$error":"#REF!"},{"$error":"#REF!"},{"$error":"#REF!"},{"$f":"IF(#REF!=\"\",0,VLOOKUP(#REF!,#REF!,2,FALSE))","v":{"$error":"#REF!"}},{"$f":"IF(#REF!=\"\",0,VLOOKUP(#REF!,#REF!,2,FALSE))","v":{"$error":"#REF!"}},"#LK","00","DPM",{"$f":"#REF!","v":{"$error":"#REF!"}},{"$f":"#REF!","v":{"$error":"#REF!"}},{"$f":"#REF!","v":{"$error":"#REF!"}},null,{"$f":"#REF!","v":{"$error":"#REF!"}},null,{"$f":"#REF!","v":{"$error":"#REF!"}},null,null,null,null,null,null,null,null,null,null,null,null,null,"-",{"$error":"#REF!"},null,82]
[{"$error":"#REF!"},{"$error":"#REF!"},7,{"$error":"#REF!"},{"$error":"#REF!"},{"$error":"#REF!"},{"$f":"IF(#REF!=\"\",0,VLOOKUP(#REF!,#REF!,2,FALSE))","v":{"$error":"#REF!"}},{"$f":"IF(#REF!=\"\",0,VLOOKUP(#REF!,#REF!,2,FALSE))","v":{"$error":"#REF!"}},"#LK","00","DPM",{"$f":"#REF!","v":{"$error":"#REF!"}},{"$f":"#REF!","v":{"$error":"#REF!"}},{"$f":"#REF!","v":{"$error":"#REF!"}},null,{"$f":"#REF!","v":{"$error":"#REF!"}},null,{"$f":"#REF!","v":{"$error":"#REF!"}},null,null,null,null,null,null,null,null,null,null,null,null,null,"-",{"$error":"#REF!"},null,83]
[{"$error":"#REF!"},{"$error":"#REF!"},7,{"$error":"#REF!"},{"$error":"#REF!"},{"$error":"#REF!"},{"$f":"IF(#REF!=\"\",0,VLOOKUP(#REF!,#REF!,2,FALSE))","v":{"$error":"#REF!"}},{"$f":"IF(#REF!=\"\",0,VLOOKUP(#REF!,#REF!,2,FALSE))","v":{"$error":"#REF!"}},"#LK","00","DPM",{"$f":"#REF!","v":{"$error":"#REF!"}},{"$f":"#REF!","v":{"$error":"#REF!"}},{"$f":"#REF!","v":{"$error":"#REF!"}},null,{"$f":"#REF!","v":{"$error":"#REF!"}},null,{"$f":"#REF!","v":{"$error":"#REF!"}},null,null,null,null,null,null,null,null,null,null,null,null,null,"-",{"$error":"#REF!"},null,84]
[{"$error":"#REF!"},{"$error":"#REF!"},7,{"$error":"#REF!"},{"$error":"#REF!"},{"$error":"#REF!"},{"$f":"IF(#REF!=\"\",0,VLOOKUP(#REF!,#REF!,2,FALSE))","v":{"$error":"#REF!"}},{"$f":"IF(#REF!=\"\",0,VLOOKUP(#REF!,#REF!,2,FALSE))","v":{"$error":"#REF!"}},"#LK","00","DPM",{"$f":"#REF!","v":{"$error":"#REF!"}},{"$f":"#REF!","v":{"$error":"#REF!"}},{"$f":"#REF!","v":{"$error":"#REF!"}},null,{"$f":"#REF!","v":{"$error":"#REF!"}},null,{"$f":"#REF!","v":{"$error":"#REF!"}},null,null,null,null,null,null,null,null,null,null,null,null,null,"-",{"$error":"#REF!"},null,85]
[{"$error":"#REF!"},{"$error":"#REF!"},7,{"$error":"#REF!"},{"$error":"#REF!"},{"$error":"#REF!"},{"$f":"IF(#REF!=\"\",0,VLOOKUP(#REF!,#REF!,2,FALSE))","v":{"$error":"#REF!"}},{"$f":"IF(#REF!=\"\",0,VLOOKUP(#REF!,#REF!,2,FALSE))","v":{"$error":"#REF!"}},"#LK","00","DPM",{"$f":"#REF!","v":{"$error":"#REF!"}},{"$f":"#REF!","v":{"$error":"#REF!"}},{"$f":"#REF!","v":{"$error":"#REF!"}},null,{"$f":"#REF!","v":{"$error":"#REF!"}},null,{"$f":"#REF!","v":{"$error":"#REF!"}},null,null,null,null,null,null,null,null,null,null,null,null,null,"-",{"$error":"#REF!"},null,86]
[{"$error":"#REF!"},{"$error":"#REF!"},7,{"$error":"#REF!"},{"$error":"#REF!"},{"$error":"#REF!"},{"$f":"IF(#REF!=\"\",0,VLOOKUP(#REF!,#REF!,2,FALSE))","v":{"$error":"#REF!"}},{"$f":"IF(#REF!=\"\",0,VLOOKUP(#REF!,#REF!,2,FALSE))","v":{"$error":"#REF!"}},"#LK","00","DPM",{"$f":"#REF!","v":{"$error":"#REF!"}},{"$f":"#REF!","v":{"$error":"#REF!"}},{"$f":"#REF!","v":{"$error":"#REF!"}},null,{"$f":"#REF!","v":{"$error":"#REF!"}},null,{"$f":"#REF!","v":{"$error":"#REF!"}},null,null,null,null,null,null,null,null,null,null,null,null,null,"-",{"$error":"#REF!"},null,87]
[{"$error":"#REF!"},{"$error":"#REF!"},7,{"$error":"#REF!"},{"$error":"#REF!"},{"$error":"#REF!"},{"$f":"IF(#REF!=\"\",0,VLOOKUP(#REF!,#REF!,2,FALSE))","v":{"$error":"#REF!"}},{"$f":"IF(#REF!=\"\",0,VLOOKUP(#REF!,#REF!,2,FALSE))","v":{"$error":"#REF!"}},"#LK","00","DPM",{"$f":"#REF!","v":{"$error":"#REF!"}},{"$f":"#REF!","v":{"$error":"#REF!"}},{"$f":"#REF!","v":{"$error":"#REF!"}},null,{"$f":"#REF!","v":{"$error":"#REF!"}},null,{"$f":"#REF!","v":{"$error":"#REF!"}},null,null,null,null,null,null,null,null,null,null,null,null,null,"-",{"$error":"#REF!"},null,88]
[{"$error":"#REF!"},{"$error":"#REF!"},7,{"$error":"#REF!"},{"$error":"#REF!"},{"$error":"#REF!"},{"$f":"IF(#REF!=\"\",0,VLOOKUP(#REF!,#REF!,2,FALSE))","v":{"$error":"#REF!"}},{"$f":"IF(#REF!=\"\",0,VLOOKUP(#REF!,#REF!,2,FALSE))","v":{"$error":"#REF!"}},"#LK","00","DPM",{"$f":"#REF!","v":{"$error":"#REF!"}},{"$f":"#REF!","v":{"$error":"#REF!"}},{"$f":"#REF!","v":{"$error":"#REF!"}},null,{"$f":"#REF!","v":{"$error":"#REF!"}},null,{"$f":"#REF!","v":{"$error":"#REF!"}},null,null,null,null,null,null,null,null,null,null,null,null,null,"-",{"$error":"#REF!"},null,89]
[{"$error":"#REF!"},{"$error":"#REF!"},7,{"$error":"#REF!"},{"$error":"#REF!"},{"$error":"#REF!"},{"$f":"IF(#REF!=\"\",0,VLOOKUP(#REF!,#REF!,2,FALSE))","v":{"$error":"#REF!"}},{"$f":"IF(#REF!=\"\",0,VLOOKUP(#REF!,#REF!,2,FALSE))","v":{"$error":"#REF!"}},"#LK","00","DPM",{"$f":"#REF!","v":{"$error":"#REF!"}},{"$f":"#REF!","v":{"$error":"#REF!"}},{"$f":"#REF!","v":{"$error":"#REF!"}},null,{"$f":"#REF!","v":{"$error":"#REF!"}},null,{"$f":"#REF!","v":{"$error":"#REF!"}},null,null,null,null,null,null,null,null,null,null,null,null,null,"-",{"$error":"#REF!"},null,90]
[{"$error":"#REF!"},{"$error":"#REF!"},7,{"$error":"#REF!"},{"$error":"#REF!"},{"$error":"#REF!"},{"$f":"IF(#REF!=\"\",0,VLOOKUP(#REF!,#REF!,2,FALSE))","v":{"$error":"#REF!"}},{"$f":"IF(#REF!=\"\",0,VLOOKUP(#REF!,#REF!,2,FALSE))","v":{"$error":"#REF!"}},"#LK","00","DPM",{"$f":"#REF!","v":{"$error":"#REF!"}},{"$f":"#REF!","v":{"$error":"#REF!"}},{"$f":"#REF!","v":{"$error":"#REF!"}},null,{"$f":"#REF!","v":{"$error":"#REF!"}},null,{"$f":"#REF!","v":{"$error":"#REF!"}},null,null,null,null,null,null,null,null,null,null,null,null,null,"-",{"$error":"#REF!"},null,91]
[{"$error":"#REF!"},{"$error":"#REF!"},7,{"$error":"#REF!"},{"$error":"#REF!"},{"$error":"#REF!"},{"$f":"IF(#REF!>\"\",9990,0)","v":{"$error":"#REF!"}},{"$f":"IF(#REF!=\"\",0,VLOOKUP(#REF!,#REF!,2,FALSE))","v":{"$error":"#REF!"}},"#LK","00","DPM",{"$f":"#REF!","v":{"$error":"#REF!"}},{"$f":"#REF!","v":{"$error":"#REF!"}},{"$f":"#REF!","v":{"$error":"#REF!"}},null,{"$f":"#REF!","v":{"$error":"#REF!"}},null,{"$f":"#REF!","v":{"$error":"#REF!"}},null,null,null,null,null,null,null,null,null,null,null,null,null,{"$f":"IF(#REF!<>\"\",#REF!,\"-\")","v":{"$error":"#REF!"}},{"$error":"#REF!"},null,96]
[{"$error":"#REF!"},{"$error":"#REF!"},7,{"$error":"#REF!"},{"$error":"#REF!"},{"$error":"#REF!"},{"$f":"IF(#REF!>\"\",9990,0)","v":{"$error":"#REF!"}},{"$f":"IF(#REF!=\"\",0,VLOOKUP(#REF!,#REF!,2,FALSE))","v":{"$error":"#REF!"}},"#LK","00","DPM",{"$f":"#REF!","v":{"$error":"#REF!"}},{"$f":"#REF!","v":{"$error":"#REF!"}},{"$f":"#REF!","v":{"$error":"#REF!"}},null,{"$f":"#REF!","v":{"$error":"#REF!"}},null,{"$f":"#REF!","v":{"$error":"#REF!"}},null,null,null,null,null,null,null,null,null,null,null,null,null,{"$f":"IF(#REF!<>\"\",#REF!,\"-\")","v":{"$error":"#REF!"}},{"$error":"#REF!"},null,97]
[{"$error":"#REF!"},{"$error":"#REF!"},7,{"$error":"#REF!"},{"$error":"#REF!"},{"$error":"#REF!"},{"$f":"IF(#REF!>\"\",9990,0)","v":{"$error":"#REF!"}},{"$f":"IF(#REF!=\"\",0,VLOOKUP(#REF!,#REF!,2,FALSE))","v":{"$error":"#REF!"}},"#LK","00","DPM",{"$f":"#REF!","v":{"$error":"#REF!"}},{"$f":"#REF!","v":{"$error":"#REF!"}},{"$f":"#REF!","v":{"$error":"#REF!"}},null,{"$f":"#REF!","v":{"$error":"#REF!"}},null,{"$f":"#REF!","v":{"$error":"#REF!"}},null,null,null,null,null,null,null,null,null,null,null,null,null,{"$f":"IF(#REF!<>\"\",#REF!,\"-\")","v":{"$error":"#REF!"}},{"$f":"IF(OR(ABS(L322)>=0.55,ABS(M322)>=0.55,ABS(N322)>=0.55,ABS(O322)>=0.55,ABS(P322)>=0.55,ABS(Q322)>=0.55,ABS(R322)>=0.55,ABS(S322)>=0.55,ABS(T322)>=0.55,ABS(U322)>=0.55,ABS(V322)>=0.55,ABS(W322)>=0.55,ABS(X322)>=0.55,ABS(Y322)>=0.55,ABS(Z322)>=0.55,ABS(AA322)>=0.55,ABS(AB322)>=0.55,ABS(AC322)>=0.55,ABS(AD322)>=0.55,ABS(AE322)>=0.55),0,1)","v":{"$error":"#REF!"}},null,98]
[{"$f":"$A$2","v":{"$error":"#REF!"}},{"$f":"$B$2","v":{"$error":"#REF!"}},7,{"$f":"$D$2","v":{"$error":"#REF!"}},{"$f":"$E$2","v":{"$error":"#REF!"}},{"$f":"$F$2","v":{"$error":"#REF!"}},{"$f":"IF(#REF!>\"\",9990,0)","v":{"$error":"#REF!"}},{"$f":"IF(#REF!=\"\",0,VLOOKUP(#REF!,#REF!,2,FALSE))","v":{"$error":"#REF!"}},"#LK","00","DPM",{"$f":"#REF!","v":{"$error":"#REF!"}},{"$f":"#REF!","v":{"$error":"#REF!"}},{"$f":"#REF!","v":{"$error":"#REF!"}},null,{"$f":"#REF!","v":{"$error":"#REF!"}},null,{"$f":"#REF!","v":{"$error":"#REF!"}},null,null,null,null,null,null,null,null,null,null,null,null,null,{"$f":"IF(#REF!<>\"\",#REF!,\"-\")","v":{"$error":"#REF!"}},{"$error":"#REF!"},null,99]
[{"$error":"#REF!"},{"$error":"#REF!"},7,{"$error":"#REF!"},{"$error":"#REF!"},{"$error":"#REF!"},{"$f":"IF(#REF!>\"\",9990,0)","v":{"$error":"#REF!"}},{"$f":"IF(#REF!=\"\",0,VLOOKUP(#REF!,#REF!,2,FALSE))","v":{"$error":"#REF!"}},"#LK","00","DPM",{"$f":"#REF!","v":{"$error":"#REF!"}},{"$f":"#REF!","v":{"$error":"#REF!"}},{"$f":"#REF!","v":{"$error":"#REF!"}},null,{"$f":"#REF!","v":{"$error":"#REF!"}},null,{"$f":"#REF!","v":{"$error":"#REF!"}},null,null,null,null,null,null,null,null,null,null,null,null,null,{"$f":"IF(#REF!<>\"\",#REF!,\"-\")","v":{"$error":"#REF!"}},{"$error":"#REF!"},null,100]
[{"$error":"#REF!"},{"$error":"#REF!"},7,{"$error":"#REF!"},{"$error":"#REF!"},{"$error":"#REF!"},{"$f":"IF(#REF!>\"\",9990,0)","v":{"$error":"#REF!"}},{"$f":"IF(#REF!=\"\",0,VLOOKUP(#REF!,#REF!,2,FALSE))","v":{"$error":"#REF!"}},"#LK","00","DPM",{"$f":"#REF!","v":{"$error":"#REF!"}},{"$f":"#REF!","v":{"$error":"#REF!"}},{"$f":"#REF!","v":{"$error":"#REF!"}},null,{"$f":"#REF!","v":{"$error":"#REF!"}},null,{"$f":"#REF!","v":{"$error":"#REF!"}},null,null,null,null,null,null,null,null,null,null,null,null,null,{"$f":"IF(#REF!<>\"\",#REF!,\"-\")","v":{"$error":"#REF!"}},{"$error":"#REF!"},null,101]
[{"$error":"#REF!"},{"$error":"#REF!"},7,{"$error":"#REF!"},{"$error":"#REF!"},{"$error":"#REF!"},{"$f":"IF(#REF!>\"\",9990,0)","v":{"$error":"#REF!"}},{"$f":"IF(#REF!=\"\",0,VLOOKUP(#REF!,#REF!,2,FALSE))","v":{"$error":"#REF!"}},"#LK","00","DPM",{"$f":"#REF!","v":{"$error":"#REF!"}},{"$f":"#REF!","v":{"$error":"#REF!"}},{"$f":"#REF!","v":{"$error":"#REF!"}},null,{"$f":"#REF!","v":{"$error":"#REF!"}},null,{"$f":"#REF!","v":{"$error":"#REF!"}},null,null,null,null,null,null,null,null,null,null,null,null,null,{"$f":"IF(#REF!<>\"\",#REF!,\"-\")","v":{"$error":"#REF!"}},{"$error":"#REF!"},null,102]
[{"$error":"#REF!"},{"$error":"#REF!"},7,{"$error":"#REF!"},{"$error":"#REF!"},{"$error":"#REF!"},{"$f":"IF(#REF!>\"\",9990,0)","v":{"$error":"#REF!"}},{"$f":"IF(#REF!=\"\",0,VLOOKUP(#REF!,#REF!,2,FALSE))","v":{"$error":"#REF!"}},"#LK","00","DPM",{"$f":"#REF!","v":{"$error":"#REF!"}},{"$f":"#REF!","v":{"$error":"#REF!"}},{"$f":"#REF!","v":{"$error":"#REF!"}},null,{"$f":"#REF!","v":{"$error":"#REF!"}},null,{"$f":"#REF!","v":{"$error":"#REF!"}},null,null,null,null,null,null,null,null,null,null,null,null,null,{"$f":"IF(#REF!<>\"\",#REF!,\"-\")","v":{"$error":"#REF!"}},{"$error":"#REF!"},null,103]
[{"$error":"#REF!"},{"$error":"#REF!"},7,{"$error":"#REF!"},{"$error":"#REF!"},{"$error":"#REF!"},{"$f":"IF(#REF!>\"\",9990,0)","v":{"$error":"#REF!"}},{"$f":"IF(#REF!=\"\",0,VLOOKUP(#REF!,#REF!,2,FALSE))","v":{"$error":"#REF!"}},"#LK","00","DPM",{"$f":"#REF!","v":{"$error":"#REF!"}},{"$f":"#REF!","v":{"$error":"#REF!"}},{"$f":"#REF!","v":{"$error":"#REF!"}},null,{"$f":"#REF!","v":{"$error":"#REF!"}},null,{"$f":"#REF!","v":{"$error":"#REF!"}},null,null,null,null,null,null,null,null,null,null,null,null,null,{"$f":"IF(#REF!<>\"\",#REF!,\"-\")","v":{"$error":"#REF!"}},{"$error":"#REF!"},null,104]
[{"$error":"#REF!"},{"$error":"#REF!"},7,{"$error":"#REF!"},{"$error":"#REF!"},{"$error":"#REF!"},{"$f":"IF(#REF!>\"\",9990,0)","v":{"$error":"#REF!"}},{"$f":"IF(#REF!=\"\",0,VLOOKUP(#REF!,#REF!,2,FALSE))","v":{"$error":"#REF!"}},"#LK","00","DPM",{"$f":"#REF!","v":{"$error":"#REF!"}},{"$f":"#REF!","v":{"$error":"#REF!"}},{"$f":"#REF!","v":{"$error":"#REF!"}},null,{"$f":"#REF!","v":{"$error":"#REF!"}},null,{"$f":"#REF!","v":{"$error":"#REF!"}},null,null,null,null,null,null,null,null,null,null,null,null,null,{"$f":"IF(#REF!<>\"\",#REF!,\"-\")","v":{"$error":"#REF!"}},{"$error":"#REF!"},null,105]
[{"$error":"#REF!"},{"$error":"#REF!"},8,{"$error":"#REF!"},{"$error":"#REF!"},{"$error":"#REF!"},{"$f":"IF(#REF!=\"\",0,VLOOKUP(#REF!,#REF!,2,FALSE))","v":{"$error":"#REF!"}},{"$f":"IF(#REF!=\"\",0,VLOOKUP(#REF!,#REF!,2,FALSE))","v":{"$error":"#REF!"}},"#LK","00","DPM",{"$f":"#REF!","v":{"$error":"#REF!"}},{"$f":"#REF!","v":{"$error":"#REF!"}},null,null,null,null,null,null,null,null,null,null,null,null,null,null,null,null,null,null,"-",{"$error":"#REF!"},"Sheet 24 Income & services'!E21 / F21",21]
[{"$error":"#REF!"},{"$error":"#REF!"},8,{"$error":"#REF!"},{"$error":"#REF!"},{"$error":"#REF!"},{"$f":"IF(#REF!=\"\",0,VLOOKUP(#REF!,#REF!,2,FALSE))","v":{"$error":"#REF!"}},{"$f":"IF(#REF!=\"\",0,VLOOKUP(#REF!,#REF!,2,FALSE))","v":{"$error":"#REF!"}},"#LK","00","DPM",{"$f":"#REF!","v":{"$error":"#REF!"}},{"$f":"#REF!","v":{"$error":"#REF!"}},null,null,null,null,null,null,null,null,null,null,null,null,null,null,null,null,null,null,"-",{"$error":"#REF!"},null,22]
[{"$error":"#REF!"},{"$error":"#REF!"},8,{"$error":"#REF!"},{"$error":"#REF!"},{"$error":"#REF!"},{"$f":"IF(#REF!=\"\",0,VLOOKUP(#REF!,#REF!,2,FALSE))","v":{"$error":"#REF!"}},{"$f":"IF(#REF!=\"\",0,VLOOKUP(#REF!,#REF!,2,FALSE))","v":{"$error":"#REF!"}},"#LK","00","DPM",{"$f":"#REF!","v":{"$error":"#REF!"}},{"$f":"#REF!","v":{"$error":"#REF!"}},null,null,null,null,null,null,null,null,null,null,null,null,null,null,null,null,null,null,"-",{"$error":"#REF!"},null,23]
[{"$error":"#REF!"},{"$error":"#REF!"},8,{"$error":"#REF!"},{"$error":"#REF!"},{"$error":"#REF!"},{"$f":"IF(#REF!=\"\",0,VLOOKUP(#REF!,#REF!,2,FALSE))","v":{"$error":"#REF!"}},{"$f":"IF(#REF!=\"\",0,VLOOKUP(#REF!,#REF!,2,FALSE))","v":{"$error":"#REF!"}},"#LK","00","DPM",{"$f":"#REF!","v":{"$error":"#REF!"}},{"$f":"#REF!","v":{"$error":"#REF!"}},null,null,null,null,null,null,null,null,null,null,null,null,null,null,null,null,null,null,"-",{"$error":"#REF!"},null,24]
[{"$error":"#REF!"},{"$error":"#REF!"},8,{"$error":"#REF!"},{"$error":"#REF!"},{"$error":"#REF!"},{"$f":"IF(#REF!=\"\",0,VLOOKUP(#REF!,#REF!,2,FALSE))","v":{"$error":"#REF!"}},{"$f":"IF(#REF!=\"\",0,VLOOKUP(#REF!,#REF!,2,FALSE))","v":{"$error":"#REF!"}},"#LK","00","DPM",{"$f":"#REF!","v":{"$error":"#REF!"}},{"$f":"#REF!","v":{"$error":"#REF!"}},null,null,null,null,null,null,null,null,null,null,null,null,null,null,null,null,null,null,"-",{"$error":"#REF!"},null,25]
[{"$error":"#REF!"},{"$error":"#REF!"},8,{"$error":"#REF!"},{"$error":"#REF!"},{"$error":"#REF!"},{"$f":"IF(#REF!=\"\",0,VLOOKUP(#REF!,#REF!,2,FALSE))","v":{"$error":"#REF!"}},{"$f":"IF(#REF!=\"\",0,VLOOKUP(#REF!,#REF!,2,FALSE))","v":{"$error":"#REF!"}},"#LK","00","DPM",{"$f":"#REF!","v":{"$error":"#REF!"}},{"$f":"#REF!","v":{"$error":"#REF!"}},null,null,null,null,null,null,null,null,null,null,null,null,null,null,null,null,null,null,"-",{"$error":"#REF!"},null,26]
[{"$error":"#REF!"},{"$error":"#REF!"},8,{"$error":"#REF!"},{"$error":"#REF!"},{"$error":"#REF!"},{"$f":"IF(#REF!=\"\",0,VLOOKUP(#REF!,#REF!,2,FALSE))","v":{"$error":"#REF!"}},{"$f":"IF(#REF!=\"\",0,VLOOKUP(#REF!,#REF!,2,FALSE))","v":{"$error":"#REF!"}},"#LK","00","DPM",{"$f":"#REF!","v":{"$error":"#REF!"}},{"$f":"#REF!","v":{"$error":"#REF!"}},null,null,null,null,null,null,null,null,null,null,null,null,null,null,null,null,null,null,"-",{"$error":"#REF!"},null,27]
[{"$error":"#REF!"},{"$error":"#REF!"},8,{"$error":"#REF!"},{"$error":"#REF!"},{"$error":"#REF!"},{"$f":"IF(#REF!=\"\",0,VLOOKUP(#REF!,#REF!,2,FALSE))","v":{"$error":"#REF!"}},{"$f":"IF(#REF!=\"\",0,VLOOKUP(#REF!,#REF!,2,FALSE))","v":{"$error":"#REF!"}},"#LK","00","DPM",{"$f":"#REF!","v":{"$error":"#REF!"}},{"$f":"#REF!","v":{"$error":"#REF!"}},null,null,null,null,null,null,null,null,null,null,null,null,null,null,null,null,null,null,"-",{"$error":"#REF!"},null,28]
[{"$error":"#REF!"},{"$error":"#REF!"},8,{"$error":"#REF!"},{"$error":"#REF!"},{"$error":"#REF!"},{"$f":"IF(#REF!=\"\",0,VLOOKUP(#REF!,#REF!,2,FALSE))","v":{"$error":"#REF!"}},{"$f":"IF(#REF!=\"\",0,VLOOKUP(#REF!,#REF!,2,FALSE))","v":{"$error":"#REF!"}},"#LK","00","DPM",{"$f":"#REF!","v":{"$error":"#REF!"}},{"$f":"#REF!","v":{"$error":"#REF!"}},null,null,null,null,null,null,null,null,null,null,null,null,null,null,null,null,null,null,"-",{"$error":"#REF!"},null,29]
[{"$error":"#REF!"},{"$error":"#REF!"},8,{"$error":"#REF!"},{"$error":"#REF!"},{"$error":"#REF!"},{"$f":"IF(#REF!=\"\",0,VLOOKUP(#REF!,#REF!,2,FALSE))","v":{"$error":"#REF!"}},{"$f":"IF(#REF!=\"\",0,VLOOKUP(#REF!,#REF!,2,FALSE))","v":{"$error":"#REF!"}},"#LK","00","DPM",{"$f":"#REF!","v":{"$error":"#REF!"}},{"$f":"#REF!","v":{"$error":"#REF!"}},null,null,null,null,null,null,null,null,null,null,null,null,null,null,null,null,null,null,"-",{"$error":"#REF!"},null,30]
[{"$error":"#REF!"},{"$error":"#REF!"},8,{"$error":"#REF!"},{"$error":"#REF!"},{"$error":"#REF!"},{"$f":"IF(#REF!=\"\",0,VLOOKUP(#REF!,#REF!,2,FALSE))","v":{"$error":"#REF!"}},{"$f":"IF(#REF!=\"\",0,VLOOKUP(#REF!,#REF!,2,FALSE))","v":{"$error":"#REF!"}},"#LK","00","DPM",{"$f":"#REF!","v":{"$error":"#REF!"}},{"$f":"#REF!","v":{"$error":"#REF!"}},null,null,null,null,null,null,null,null,null,null,null,null,null,null,null,null,null,null,"-",{"$error":"#REF!"},null,31]
[{"$error":"#REF!"},{"$error":"#REF!"},8,{"$error":"#REF!"},{"$error":"#REF!"},{"$error":"#REF!"},{"$f":"IF(#REF!=\"\",0,VLOOKUP(#REF!,#REF!,2,FALSE))","v":{"$error":"#REF!"}},{"$f":"IF(#REF!=\"\",0,VLOOKUP(#REF!,#REF!,2,FALSE))","v":{"$error":"#REF!"}},"#LK","00","DPM",{"$f":"#REF!","v":{"$error":"#REF!"}},{"$f":"#REF!","v":{"$error":"#REF!"}},null,null,null,null,null,null,null,null,null,null,null,null,null,null,null,null,null,null,"-",{"$error":"#REF!"},null,32]
[{"$error":"#REF!"},{"$error":"#REF!"},8,{"$error":"#REF!"},{"$error":"#REF!"},{"$error":"#REF!"},{"$f":"IF(#REF!=\"\",0,VLOOKUP(#REF!,#REF!,2,FALSE))","v":{"$error":"#REF!"}},{"$f":"IF(#REF!=\"\",0,VLOOKUP(#REF!,#REF!,2,FALSE))","v":{"$error":"#REF!"}},"#LK","00","DPM",{"$f":"#REF!","v":{"$error":"#REF!"}},{"$f":"#REF!","v":{"$error":"#REF!"}},null,null,null,null,null,null,null,null,null,null,null,null,null,null,null,null,null,null,"-",{"$error":"#REF!"},null,33]
[{"$error":"#REF!"},{"$error":"#REF!"},8,{"$error":"#REF!"},{"$error":"#REF!"},{"$error":"#REF!"},{"$f":"IF(#REF!=\"\",0,VLOOKUP(#REF!,#REF!,2,FALSE))","v":{"$error":"#REF!"}},{"$f":"IF(#REF!=\"\",0,VLOOKUP(#REF!,#REF!,2,FALSE))","v":{"$error":"#REF!"}},"#LK","00","DPM",{"$f":"#REF!","v":{"$error":"#REF!"}},{"$f":"#REF!","v":{"$error":"#REF!"}},null,null,null,null,null,null,null,null,null,null,null,null,null,null,null,null,null,null,"-",{"$error":"#REF!"},null,34]
[{"$error":"#REF!"},{"$error":"#REF!"},8,{"$error":"#REF!"},{"$error":"#REF!"},{"$error":"#REF!"},{"$f":"IF(#REF!=\"\",0,VLOOKUP(#REF!,#REF!,2,FALSE))","v":{"$error":"#REF!"}},{"$f":"IF(#REF!=\"\",0,VLOOKUP(#REF!,#REF!,2,FALSE))","v":{"$error":"#REF!"}},"#LK","00","DPM",{"$f":"#REF!","v":{"$error":"#REF!"}},{"$f":"#REF!","v":{"$error":"#REF!"}},null,null,null,null,null,null,null,null,null,null,null,null,null,null,null,null,null,null,"-",{"$error":"#REF!"},null,35]
[{"$error":"#REF!"},{"$error":"#REF!"},8,{"$error":"#REF!"},{"$error":"#REF!"},{"$error":"#REF!"},{"$f":"IF(#REF!=\"\",0,VLOOKUP(#REF!,#REF!,2,FALSE))","v":{"$error":"#REF!"}},{"$f":"IF(#REF!=\"\",0,VLOOKUP(#REF!,#REF!,2,FALSE))","v":{"$error":"#REF!"}},"#LK","00","DPM",{"$f":"#REF!","v":{"$error":"#REF!"}},{"$f":"#REF!","v":{"$error":"#REF!"}},null,null,null,null,null,null,null,null,null,null,null,null,null,null,null,null,null,null,"-",{"$error":"#REF!"},null,36]
[{"$error":"#REF!"},{"$error":"#REF!"},8,{"$error":"#REF!"},{"$error":"#REF!"},{"$error":"#REF!"},{"$f":"IF(#REF!=\"\",0,VLOOKUP(#REF!,#REF!,2,FALSE))","v":{"$error":"#REF!"}},{"$f":"IF(#REF!=\"\",0,VLOOKUP(#REF!,#REF!,2,FALSE))","v":{"$error":"#REF!"}},"#LK","00","DPM",{"$f":"#REF!","v":{"$error":"#REF!"}},{"$f":"#REF!","v":{"$error":"#REF!"}},null,null,null,null,null,null,null,null,null,null,null,null,null,null,null,null,null,null,"-",{"$error":"#REF!"},null,37]
[{"$error":"#REF!"},{"$error":"#REF!"},8,{"$error":"#REF!"},{"$error":"#REF!"},{"$error":"#REF!"},{"$f":"IF(#REF!=\"\",0,VLOOKUP(#REF!,#REF!,2,FALSE))","v":{"$error":"#REF!"}},{"$f":"IF(#REF!=\"\",0,VLOOKUP(#REF!,#REF!,2,FALSE))","v":{"$error":"#REF!"}},"#LK","00","DPM",{"$f":"#REF!","v":{"$error":"#REF!"}},{"$f":"#REF!","v":{"$error":"#REF!"}},null,null,null,null,null,null,null,null,null,null,null,null,null,null,null,null,null,null,"-",{"$error":"#REF!"},null,38]
[{"$error":"#REF!"},{"$error":"#REF!"},8,{"$error":"#REF!"},{"$error":"#REF!"},{"$error":"#REF!"},{"$f":"IF(#REF!=\"\",0,VLOOKUP(#REF!,#REF!,2,FALSE))","v":{"$error":"#REF!"}},{"$f":"IF(#REF!=\"\",0,VLOOKUP(#REF!,#REF!,2,FALSE))","v":{"$error":"#REF!"}},"#LK","00","DPM",{"$f":"#REF!","v":{"$error":"#REF!"}},{"$f":"#REF!","v":{"$error":"#REF!"}},null,null,null,null,null,null,null,null,null,null,null,null,null,null,null,null,null,null,"-",{"$error":"#REF!"},null,39]
[{"$error":"#REF!"},{"$error":"#REF!"},8,{"$error":"#REF!"},{"$error":"#REF!"},{"$error":"#REF!"},{"$f":"IF(#REF!=\"\",0,VLOOKUP(#REF!,#REF!,2,FALSE))","v":{"$error":"#REF!"}},{"$f":"IF(#REF!=\"\",0,VLOOKUP(#REF!,#REF!,2,FALSE))","v":{"$error":"#REF!"}},"#LK","00","DPM",{"$f":"#REF!","v":{"$error":"#REF!"}},{"$f":"#REF!","v":{"$error":"#REF!"}},null,null,null,null,null,null,null,null,null,null,null,null,null,null,null,null,null,null,"-",{"$error":"#REF!"},null,40]
[{"$error":"#REF!"},{"$error":"#REF!"},8,{"$error":"#REF!"},{"$error":"#REF!"},{"$error":"#REF!"},{"$f":"IF(#REF!=\"\",0,VLOOKUP(#REF!,#REF!,2,FALSE))","v":{"$error":"#REF!"}},{"$f":"IF(#REF!=\"\",0,VLOOKUP(#REF!,#REF!,2,FALSE))","v":{"$error":"#REF!"}},"#LK","00","DPM",{"$f":"#REF!","v":{"$error":"#REF!"}},{"$f":"#REF!","v":{"$error":"#REF!"}},null,null,null,null,null,null,null,null,null,null,null,null,null,null,null,null,null,null,"-",{"$error":"#REF!"},null,41]
[{"$error":"#REF!"},{"$error":"#REF!"},8,{"$error":"#REF!"},{"$error":"#REF!"},{"$error":"#REF!"},{"$f":"IF(#REF!=\"\",0,VLOOKUP(#REF!,#REF!,2,FALSE))","v":{"$error":"#REF!"}},{"$f":"IF(#REF!=\"\",0,VLOOKUP(#REF!,#REF!,2,FALSE))","v":{"$error":"#REF!"}},"#LK","00","DPM",{"$f":"#REF!","v":{"$error":"#REF!"}},{"$f":"#REF!","v":{"$error":"#REF!"}},null,null,null,null,null,null,null,null,null,null,null,null,null,null,null,null,null,null,"-",{"$error":"#REF!"},null,42]
[{"$error":"#REF!"},{"$error":"#REF!"},8,{"$error":"#REF!"},{"$error":"#REF!"},{"$error":"#REF!"},{"$f":"IF(#REF!=\"\",0,VLOOKUP(#REF!,#REF!,2,FALSE))","v":{"$error":"#REF!"}},{"$f":"IF(#REF!=\"\",0,VLOOKUP(#REF!,#REF!,2,FALSE))","v":{"$error":"#REF!"}},"#LK","00","DPM",{"$f":"#REF!","v":{"$error":"#REF!"}},{"$f":"#REF!","v":{"$error":"#REF!"}},null,null,null,null,null,null,null,null,null,null,null,null,null,null,null,null,null,null,"-",{"$error":"#REF!"},null,43]
[{"$error":"#REF!"},{"$error":"#REF!"},8,{"$error":"#REF!"},{"$error":"#REF!"},{"$error":"#REF!"},{"$f":"IF(#REF!=\"\",0,VLOOKUP(#REF!,#REF!,2,FALSE))","v":{"$error":"#REF!"}},{"$f":"IF(#REF!=\"\",0,VLOOKUP(#REF!,#REF!,2,FALSE))","v":{"$error":"#REF!"}},"#LK","00","DPM",{"$f":"#REF!","v":{"$error":"#REF!"}},{"$f":"#REF!","v":{"$error":"#REF!"}},null,null,null,null,null,null,null,null,null,null,null,null,null,null,null,null,null,null,"-",{"$error":"#REF!"},null,44]
[{"$error":"#REF!"},{"$error":"#REF!"},8,{"$error":"#REF!"},{"$error":"#REF!"},{"$error":"#REF!"},{"$f":"IF(#REF!=\"\",0,VLOOKUP(#REF!,#REF!,2,FALSE))","v":{"$error":"#REF!"}},{"$f":"IF(#REF!=\"\",0,VLOOKUP(#REF!,#REF!,2,FALSE))","v":{"$error":"#REF!"}},"#LK","00","DPM",{"$f":"#REF!","v":{"$error":"#REF!"}},{"$f":"#REF!","v":{"$error":"#REF!"}},null,null,null,null,null,null,null,null,null,null,null,null,null,null,null,null,null,null,"-",{"$error":"#REF!"},null,45]
[{"$error":"#REF!"},{"$error":"#REF!"},8,{"$error":"#REF!"},{"$error":"#REF!"},{"$error":"#REF!"},{"$f":"IF(#REF!=\"\",0,VLOOKUP(#REF!,#REF!,2,FALSE))","v":{"$error":"#REF!"}},{"$f":"IF(#REF!=\"\",0,VLOOKUP(#REF!,#REF!,2,FALSE))","v":{"$error":"#REF!"}},"#LK","00","DPM",{"$f":"#REF!","v":{"$error":"#REF!"}},{"$f":"#REF!","v":{"$error":"#REF!"}},null,null,null,null,null,null,null,null,null,null,null,null,null,null,null,null,null,null,"-",{"$error":"#REF!"},null,46]
[{"$error":"#REF!"},{"$error":"#REF!"},8,{"$error":"#REF!"},{"$error":"#REF!"},{"$error":"#REF!"},{"$f":"IF(#REF!=\"\",0,VLOOKUP(#REF!,#REF!,2,FALSE))","v":{"$error":"#REF!"}},{"$f":"IF(#REF!=\"\",0,VLOOKUP(#REF!,#REF!,2,FALSE))","v":{"$error":"#REF!"}},"#LK","00","DPM",{"$f":"#REF!","v":{"$error":"#REF!"}},{"$f":"#REF!","v":{"$error":"#REF!"}},null,null,null,null,null,null,null,null,null,null,null,null,null,null,null,null,null,null,"-",{"$error":"#REF!"},null,47]
[{"$error":"#REF!"},{"$error":"#REF!"},8,{"$error":"#REF!"},{"$error":"#REF!"},{"$error":"#REF!"},{"$f":"IF(#REF!=\"\",0,VLOOKUP(#REF!,#REF!,2,FALSE))","v":{"$error":"#REF!"}},{"$f":"IF(#REF!=\"\",0,VLOOKUP(#REF!,#REF!,2,FALSE))","v":{"$error":"#REF!"}},"#LK","00","DPM",{"$f":"#REF!","v":{"$error":"#REF!"}},{"$f":"#REF!","v":{"$error":"#REF!"}},null,null,null,null,null,null,null,null,null,null,null,null,null,null,null,null,null,null,"-",{"$error":"#REF!"},null,48]
[{"$error":"#REF!"},{"$error":"#REF!"},8,{"$error":"#REF!"},{"$error":"#REF!"},{"$error":"#REF!"},{"$f":"IF(#REF!=\"\",0,VLOOKUP(#REF!,#REF!,2,FALSE))","v":{"$error":"#REF!"}},{"$f":"IF(#REF!=\"\",0,VLOOKUP(#REF!,#REF!,2,FALSE))","v":{"$error":"#REF!"}},"#LK","00","DPM",{"$f":"#REF!","v":{"$error":"#REF!"}},{"$f":"#REF!","v":{"$error":"#REF!"}},null,null,null,null,null,null,null,null,null,null,null,null,null,null,null,null,null,null,"-",{"$error":"#REF!"},null,49]
[{"$error":"#REF!"},{"$error":"#REF!"},8,{"$error":"#REF!"},{"$error":"#REF!"},{"$error":"#REF!"},{"$f":"IF(#REF!=\"\",0,VLOOKUP(#REF!,#REF!,2,FALSE))","v":{"$error":"#REF!"}},{"$f":"IF(#REF!=\"\",0,VLOOKUP(#REF!,#REF!,2,FALSE))","v":{"$error":"#REF!"}},"#LK","00","DPM",{"$f":"#REF!","v":{"$error":"#REF!"}},{"$f":"#REF!","v":{"$error":"#REF!"}},null,null,null,null,null,null,null,null,null,null,null,null,null,null,null,null,null,null,"-",{"$error":"#REF!"},null,50]
[{"$error":"#REF!"},{"$error":"#REF!"},8,{"$error":"#REF!"},{"$error":"#REF!"},{"$error":"#REF!"},{"$f":"IF(#REF!=\"\",0,VLOOKUP(#REF!,#REF!,2,FALSE))","v":{"$error":"#REF!"}},{"$f":"IF(#REF!=\"\",0,VLOOKUP(#REF!,#REF!,2,FALSE))","v":{"$error":"#REF!"}},"#LK","00","DPM",{"$f":"#REF!","v":{"$error":"#REF!"}},{"$f":"#REF!","v":{"$error":"#REF!"}},null,null,null,null,null,null,null,null,null,null,null,null,null,null,null,null,null,null,"-",{"$error":"#REF!"},null,51]
[{"$error":"#REF!"},{"$error":"#REF!"},8,{"$error":"#REF!"},{"$error":"#REF!"},{"$error":"#REF!"},{"$f":"IF(#REF!=\"\",0,VLOOKUP(#REF!,#REF!,2,FALSE))","v":{"$error":"#REF!"}},{"$f":"IF(#REF!=\"\",0,VLOOKUP(#REF!,#REF!,2,FALSE))","v":{"$error":"#REF!"}},"#LK","00","DPM",{"$f":"#REF!","v":{"$error":"#REF!"}},{"$f":"#REF!","v":{"$error":"#REF!"}},null,null,null,null,null,null,null,null,null,null,null,null,null,null,null,null,null,null,"-",{"$error":"#REF!"},null,52]
[{"$error":"#REF!"},{"$error":"#REF!"},8,{"$error":"#REF!"},{"$error":"#REF!"},{"$error":"#REF!"},{"$f":"IF(#REF!=\"\",0,VLOOKUP(#REF!,#REF!,2,FALSE))","v":{"$error":"#REF!"}},{"$f":"IF(#REF!=\"\",0,VLOOKUP(#REF!,#REF!,2,FALSE))","v":{"$error":"#REF!"}},"#LK","00","DPM",{"$f":"#REF!","v":{"$error":"#REF!"}},{"$f":"#REF!","v":{"$error":"#REF!"}},null,null,null,null,null,null,null,null,null,null,null,null,null,null,null,null,null,null,"-",{"$error":"#REF!"},null,53]
[{"$error":"#REF!"},{"$error":"#REF!"},8,{"$error":"#REF!"},{"$error":"#REF!"},{"$error":"#REF!"},{"$f":"IF(#REF!=\"\",0,VLOOKUP(#REF!,#REF!,2,FALSE))","v":{"$error":"#REF!"}},{"$f":"IF(#REF!=\"\",0,VLOOKUP(#REF!,#REF!,2,FALSE))","v":{"$error":"#REF!"}},"#LK","00","DPM",{"$f":"#REF!","v":{"$error":"#REF!"}},{"$f":"#REF!","v":{"$error":"#REF!"}},null,null,null,null,null,null,null,null,null,null,null,null,null,null,null,null,null,null,"-",{"$error":"#REF!"},null,54]
[{"$error":"#REF!"},{"$error":"#REF!"},8,{"$error":"#REF!"},{"$error":"#REF!"},{"$error":"#REF!"},{"$f":"IF(#REF!=\"\",0,VLOOKUP(#REF!,#REF!,2,FALSE))","v":{"$error":"#REF!"}},{"$f":"IF(#REF!=\"\",0,VLOOKUP(#REF!,#REF!,2,FALSE))","v":{"$error":"#REF!"}},"#LK","00","DPM",{"$f":"#REF!","v":{"$error":"#REF!"}},{"$f":"#REF!","v":{"$error":"#REF!"}},null,null,null,null,null,null,null,null,null,null,null,null,null,null,null,null,null,null,"-",{"$error":"#REF!"},null,55]
[{"$error":"#REF!"},{"$error":"#REF!"},8,{"$error":"#REF!"},{"$error":"#REF!"},{"$error":"#REF!"},{"$f":"IF(#REF!=\"\",0,VLOOKUP(#REF!,#REF!,2,FALSE))","v":{"$error":"#REF!"}},{"$f":"IF(#REF!=\"\",0,VLOOKUP(#REF!,#REF!,2,FALSE))","v":{"$error":"#REF!"}},"#LK","00","DPM",{"$f":"#REF!","v":{"$error":"#REF!"}},{"$f":"#REF!","v":{"$error":"#REF!"}},null,null,null,null,null,null,null,null,null,null,null,null,null,null,null,null,null,null,"-",{"$error":"#REF!"},null,56]
[{"$error":"#REF!"},{"$error":"#REF!"},8,{"$error":"#REF!"},{"$error":"#REF!"},{"$error":"#REF!"},{"$f":"IF(#REF!=\"\",0,VLOOKUP(#REF!,#REF!,2,FALSE))","v":{"$error":"#REF!"}},{"$f":"IF(#REF!=\"\",0,VLOOKUP(#REF!,#REF!,2,FALSE))","v":{"$error":"#REF!"}},"#LK","00","DPM",{"$f":"#REF!","v":{"$error":"#REF!"}},{"$f":"#REF!","v":{"$error":"#REF!"}},null,null,null,null,null,null,null,null,null,null,null,null,null,null,null,null,null,null,"-",{"$error":"#REF!"},null,57]
[{"$error":"#REF!"},{"$error":"#REF!"},8,{"$error":"#REF!"},{"$error":"#REF!"},{"$error":"#REF!"},{"$f":"IF(#REF!=\"\",0,VLOOKUP(#REF!,#REF!,2,FALSE))","v":{"$error":"#REF!"}},{"$f":"IF(#REF!=\"\",0,VLOOKUP(#REF!,#REF!,2,FALSE))","v":{"$error":"#REF!"}},"#LK","00","DPM",{"$f":"#REF!","v":{"$error":"#REF!"}},{"$f":"#REF!","v":{"$error":"#REF!"}},null,null,null,null,null,null,null,null,null,null,null,null,null,null,null,null,null,null,"-",{"$error":"#REF!"},null,58]
[{"$error":"#REF!"},{"$error":"#REF!"},8,{"$error":"#REF!"},{"$error":"#REF!"},{"$error":"#REF!"},{"$f":"IF(#REF!=\"\",0,VLOOKUP(#REF!,#REF!,2,FALSE))","v":{"$error":"#REF!"}},{"$f":"IF(#REF!=\"\",0,VLOOKUP(#REF!,#REF!,2,FALSE))","v":{"$error":"#REF!"}},"#LK","00","DPM",{"$f":"#REF!","v":{"$error":"#REF!"}},{"$f":"#REF!","v":{"$error":"#REF!"}},null,null,null,null,null,null,null,null,null,null,null,null,null,null,null,null,null,null,"-",{"$error":"#REF!"},null,59]
[{"$error":"#REF!"},{"$error":"#REF!"},8,{"$error":"#REF!"},{"$error":"#REF!"},{"$error":"#REF!"},{"$f":"IF(#REF!=\"\",0,VLOOKUP(#REF!,#REF!,2,FALSE))","v":{"$error":"#REF!"}},{"$f":"IF(#REF!=\"\",0,VLOOKUP(#REF!,#REF!,2,FALSE))","v":{"$error":"#REF!"}},"#LK","00","DPM",{"$f":"#REF!","v":{"$error":"#REF!"}},{"$f":"#REF!","v":{"$error":"#REF!"}},null,null,null,null,null,null,null,null,null,null,null,null,null,null,null,null,null,null,"-",{"$error":"#REF!"},null,60]
[{"$error":"#REF!"},{"$error":"#REF!"},8,{"$error":"#REF!"},{"$error":"#REF!"},{"$error":"#REF!"},{"$f":"IF(#REF!>\"\",9990,0)","v":{"$error":"#REF!"}},{"$f":"IF(#REF!=\"\",0,VLOOKUP(#REF!,#REF!,2,FALSE))","v":{"$error":"#REF!"}},"#LK","00","DPM",{"$f":"#REF!","v":{"$error":"#REF!"}},{"$f":"#REF!","v":{"$error":"#REF!"}},null,null,null,null,null,null,null,null,null,null,null,null,null,null,null,null,null,null,{"$f":"IF(#REF!<>\"\",#REF!,\"-\")","v":{"$error":"#REF!"}},{"$error":"#REF!"},null,65]
[{"$error":"#REF!"},{"$error":"#REF!"},8,{"$error":"#REF!"},{"$error":"#REF!"},{"$error":"#REF!"},{"$f":"IF(#REF!>\"\",9990,0)","v":{"$error":"#REF!"}},{"$f":"IF(#REF!=\"\",0,VLOOKUP(#REF!,#REF!,2,FALSE))","v":{"$error":"#REF!"}},"#LK","00","DPM",{"$f":"#REF!","v":{"$error":"#REF!"}},{"$f":"#REF!","v":{"$error":"#REF!"}},null,null,null,null,null,null,null,null,null,null,null,null,null,null,null,null,null,null,{"$f":"IF(#REF!<>\"\",#REF!,\"-\")","v":{"$error":"#REF!"}},{"$error":"#REF!"},null,66]
[{"$error":"#REF!"},{"$error":"#REF!"},8,{"$error":"#REF!"},{"$error":"#REF!"},{"$error":"#REF!"},{"$f":"IF(#REF!>\"\",9990,0)","v":{"$error":"#REF!"}},{"$f":"IF(#REF!=\"\",0,VLOOKUP(#REF!,#REF!,2,FALSE))","v":{"$error":"#REF!"}},"#LK","00","DPM",{"$f":"#REF!","v":{"$error":"#REF!"}},{"$f":"#REF!","v":{"$error":"#REF!"}},null,null,null,null,null,null,null,null,null,null,null,null,null,null,null,null,null,null,{"$f":"IF(#REF!<>\"\",#REF!,\"-\")","v":{"$error":"#REF!"}},{"$error":"#REF!"},null,67]
[{"$error":"#REF!"},{"$error":"#REF!"},8,{"$error":"#REF!"},{"$error":"#REF!"},{"$error":"#REF!"},{"$f":"IF(#REF!>\"\",9990,0)","v":{"$error":"#REF!"}},{"$f":"IF(#REF!=\"\",0,VLOOKUP(#REF!,#REF!,2,FALSE))","v":{"$error":"#REF!"}},"#LK","00","DPM",{"$f":"#REF!","v":{"$error":"#REF!"}},{"$f":"#REF!","v":{"$error":"#REF!"}},null,null,null,null,null,null,null,null,null,null,null,null,null,null,null,null,null,null,{"$f":"IF(#REF!<>\"\",#REF!,\"-\")","v":{"$error":"#REF!"}},{"$error":"#REF!"},null,68]
[{"$error":"#REF!"},{"$error":"#REF!"},8,{"$error":"#REF!"},{"$error":"#REF!"},{"$error":"#REF!"},{"$f":"IF(#REF!>\"\",9990,0)","v":{"$error":"#REF!"}},{"$f":"IF(#REF!=\"\",0,VLOOKUP(#REF!,#REF!,2,FALSE))","v":{"$error":"#REF!"}},"#LK","00","DPM",{"$f":"#REF!","v":{"$error":"#REF!"}},{"$f":"#REF!","v":{"$error":"#REF!"}},null,null,null,null,null,null,null,null,null,null,null,null,null,null,null,null,null,null,{"$f":"IF(#REF!<>\"\",#REF!,\"-\")","v":{"$error":"#REF!"}},{"$error":"#REF!"},null,69]
[{"$error":"#REF!"},{"$error":"#REF!"},8,{"$error":"#REF!"},{"$error":"#REF!"},{"$error":"#REF!"},{"$f":"IF(#REF!>\"\",9990,0)","v":{"$error":"#REF!"}},{"$f":"IF(#REF!=\"\",0,VLOOKUP(#REF!,#REF!,2,FALSE))","v":{"$error":"#REF!"}},"#LK","00","DPM",{"$f":"#REF!","v":{"$error":"#REF!"}},{"$f":"#REF!","v":{"$error":"#REF!"}},null,null,null,null,null,null,null,null,null,null,null,null,null,null,null,null,null,null,{"$f":"IF(#REF!<>\"\",#REF!,\"-\")","v":{"$error":"#REF!"}},{"$error":"#REF!"},null,70]
[{"$error":"#REF!"},{"$error":"#REF!"},8,{"$error":"#REF!"},{"$error":"#REF!"},{"$error":"#REF!"},{"$f":"IF(#REF!>\"\",9990,0)","v":{"$error":"#REF!"}},{"$f":"IF(#REF!=\"\",0,VLOOKUP(#REF!,#REF!,2,FALSE))","v":{"$error":"#REF!"}},"#LK","00","DPM",{"$f":"#REF!","v":{"$error":"#REF!"}},{"$f":"#REF!","v":{"$error":"#REF!"}},null,null,null,null,null,null,null,null,null,null,null,null,null,null,null,null,null,null,{"$f":"IF(#REF!<>\"\",#REF!,\"-\")","v":{"$error":"#REF!"}},{"$error":"#REF!"},null,71]
[{"$error":"#REF!"},{"$error":"#REF!"},8,{"$error":"#REF!"},{"$error":"#REF!"},{"$error":"#REF!"},{"$f":"IF(#REF!>\"\",9990,0)","v":{"$error":"#REF!"}},{"$f":"IF(#REF!=\"\",0,VLOOKUP(#REF!,#REF!,2,FALSE))","v":{"$error":"#REF!"}},"#LK","00","DPM",{"$f":"#REF!","v":{"$error":"#REF!"}},{"$f":"#REF!","v":{"$error":"#REF!"}},null,null,null,null,null,null,null,null,null,null,null,null,null,null,null,null,null,null,{"$f":"IF(#REF!<>\"\",#REF!,\"-\")","v":{"$error":"#REF!"}},{"$error":"#REF!"},null,72]
[{"$error":"#REF!"},{"$error":"#REF!"},8,{"$error":"#REF!"},{"$error":"#REF!"},{"$error":"#REF!"},{"$f":"IF(#REF!>\"\",9990,0)","v":{"$error":"#REF!"}},{"$f":"IF(#REF!=\"\",0,VLOOKUP(#REF!,#REF!,2,FALSE))","v":{"$error":"#REF!"}},"#LK","00","DPM",{"$f":"#REF!","v":{"$error":"#REF!"}},{"$f":"#REF!","v":{"$error":"#REF!"}},null,null,null,null,null,null,null,null,null,null,null,null,null,null,null,null,null,null,{"$f":"IF(#REF!<>\"\",#REF!,\"-\")","v":{"$error":"#REF!"}},{"$error":"#REF!"},null,73]
[{"$error":"#REF!"},{"$error":"#REF!"},8,{"$error":"#REF!"},{"$error":"#REF!"},{"$error":"#REF!"},{"$f":"IF(#REF!>\"\",9990,0)","v":{"$error":"#REF!"}},{"$f":"IF(#REF!=\"\",0,VLOOKUP(#REF!,#REF!,2,FALSE))","v":{"$error":"#REF!"}},"#LK","00","DPM",{"$f":"#REF!","v":{"$error":"#REF!"}},{"$f":"#REF!","v":{"$error":"#REF!"}},null,null,null,null,null,null,null,null,null,null,null,null,null,null,null,null,null,null,{"$f":"IF(#REF!<>\"\",#REF!,\"-\")","v":{"$error":"#REF!"}},{"$error":"#REF!"},null,74]
[{"$error":"#REF!"},{"$error":"#REF!"},8,{"$error":"#REF!"},{"$error":"#REF!"},{"$error":"#REF!"},{"$f":"IF(#REF!>\"\",9990,0)","v":{"$error":"#REF!"}},{"$f":"IF(#REF!=\"\",0,VLOOKUP(#REF!,#REF!,2,FALSE))","v":{"$error":"#REF!"}},"#LK","00","DPM",{"$f":"#REF!","v":{"$error":"#REF!"}},{"$f":"#REF!","v":{"$error":"#REF!"}},null,null,null,null,null,null,null,null,null,null,null,null,null,null,null,null,null,null,{"$f":"IF(#REF!<>\"\",#REF!,\"-\")","v":{"$error":"#REF!"}},{"$error":"#REF!"},null,75]
[{"$error":"#REF!"},{"$error":"#REF!"},8,{"$error":"#REF!"},{"$error":"#REF!"},{"$error":"#REF!"},{"$f":"IF(#REF!>\"\",9990,0)","v":{"$error":"#REF!"}},{"$f":"IF(#REF!=\"\",0,VLOOKUP(#REF!,#REF!,2,FALSE))","v":{"$error":"#REF!"}},"#LK","00","DPM",{"$f":"#REF!","v":{"$error":"#REF!"}},{"$f":"#REF!","v":{"$error":"#REF!"}},null,null,null,null,null,null,null,null,null,null,null,null,null,null,null,null,null,null,{"$f":"IF(#REF!<>\"\",#REF!,\"-\")","v":{"$error":"#REF!"}},{"$error":"#REF!"},null,76]
[{"$error":"#REF!"},{"$error":"#REF!"},8,{"$error":"#REF!"},{"$error":"#REF!"},{"$error":"#REF!"},{"$f":"IF(#REF!>\"\",9990,0)","v":{"$error":"#REF!"}},{"$f":"IF(#REF!=\"\",0,VLOOKUP(#REF!,#REF!,2,FALSE))","v":{"$error":"#REF!"}},"#LK","00","DPM",{"$f":"#REF!","v":{"$error":"#REF!"}},{"$f":"#REF!","v":{"$error":"#REF!"}},null,null,null,null,null,null,null,null,null,null,null,null,null,null,null,null,null,null,{"$f":"IF(#REF!<>\"\",#REF!,\"-\")","v":{"$error":"#REF!"}},{"$error":"#REF!"},null,77]
[{"$error":"#REF!"},{"$error":"#REF!"},8,{"$error":"#REF!"},{"$error":"#REF!"},{"$error":"#REF!"},{"$f":"IF(#REF!>\"\",9990,0)","v":{"$error":"#REF!"}},{"$f":"IF(#REF!=\"\",0,VLOOKUP(#REF!,#REF!,2,FALSE))","v":{"$error":"#REF!"}},"#LK","00","DPM",{"$f":"#REF!","v":{"$error":"#REF!"}},{"$f":"#REF!","v":{"$error":"#REF!"}},null,null,null,null,null,null,null,null,null,null,null,null,null,null,null,null,null,null,{"$f":"IF(#REF!<>\"\",#REF!,\"-\")","v":{"$error":"#REF!"}},{"$error":"#REF!"},null,78]
[{"$error":"#REF!"},{"$error":"#REF!"},8,{"$error":"#REF!"},{"$error":"#REF!"},{"$error":"#REF!"},{"$f":"IF(#REF!>\"\",9990,0)","v":{"$error":"#REF!"}},{"$f":"IF(#REF!=\"\",0,VLOOKUP(#REF!,#REF!,2,FALSE))","v":{"$error":"#REF!"}},"#LK","00","DPM",{"$f":"#REF!","v":{"$error":"#REF!"}},{"$f":"#REF!","v":{"$error":"#REF!"}},null,null,null,null,null,null,null,null,null,null,null,null,null,null,null,null,null,null,{"$f":"IF(#REF!<>\"\",#REF!,\"-\")","v":{"$error":"#REF!"}},{"$error":"#REF!"},null,79]
[{"$error":"#REF!"},{"$error":"#REF!"},8,{"$error":"#REF!"},{"$error":"#REF!"},{"$error":"#REF!"},{"$f":"IF(#REF!>\"\",9990,0)","v":{"$error":"#REF!"}},{"$f":"IF(#REF!=\"\",0,VLOOKUP(#REF!,#REF!,2,FALSE))","v":{"$error":"#REF!"}},"#LK","00","DPM",{"$f":"#REF!","v":{"$error":"#REF!"}},{"$f":"#REF!","v":{"$error":"#REF!"}},null,null,null,null,null,null,null,null,null,null,null,null,null,null,null,null,null,null,{"$f":"IF(#REF!<>\"\",#REF!,\"-\")","v":{"$error":"#REF!"}},{"$error":"#REF!"},null,80]
[{"$error":"#REF!"},{"$error":"#REF!"},8,{"$error":"#REF!"},{"$error":"#REF!"},{"$error":"#REF!"},{"$f":"IF(#REF!>\"\",9990,0)","v":{"$error":"#REF!"}},{"$f":"IF(#REF!=\"\",0,VLOOKUP(#REF!,#REF!,2,FALSE))","v":{"$error":"#REF!"}},"#LK","00","DPM",{"$f":"#REF!","v":{"$error":"#REF!"}},{"$f":"#REF!","v":{"$error":"#REF!"}},null,null,null,null,null,null,null,null,null,null,null,null,null,null,null,null,null,null,{"$f":"IF(#REF!<>\"\",#REF!,\"-\")","v":{"$error":"#REF!"}},{"$error":"#REF!"},null,81]
[{"$error":"#REF!"},{"$error":"#REF!"},8,{"$error":"#REF!"},{"$error":"#REF!"},{"$error":"#REF!"},{"$f":"IF(#REF!>\"\",9990,0)","v":{"$error":"#REF!"}},{"$f":"IF(#REF!=\"\",0,VLOOKUP(#REF!,#REF!,2,FALSE))","v":{"$error":"#REF!"}},"#LK","00","DPM",{"$f":"#REF!","v":{"$error":"#REF!"}},{"$f":"#REF!","v":{"$error":"#REF!"}},null,null,null,null,null,null,null,null,null,null,null,null,null,null,null,null,null,null,{"$f":"IF(#REF!<>\"\",#REF!,\"-\")","v":{"$error":"#REF!"}},{"$error":"#REF!"},null,82]
[{"$error":"#REF!"},{"$error":"#REF!"},8,{"$error":"#REF!"},{"$error":"#REF!"},{"$error":"#REF!"},{"$f":"IF(#REF!>\"\",9990,0)","v":{"$error":"#REF!"}},{"$f":"IF(#REF!=\"\",0,VLOOKUP(#REF!,#REF!,2,FALSE))","v":{"$error":"#REF!"}},"#LK","00","DPM",{"$f":"#REF!","v":{"$error":"#REF!"}},{"$f":"#REF!","v":{"$error":"#REF!"}},null,null,null,null,null,null,null,null,null,null,null,null,null,null,null,null,null,null,{"$f":"IF(#REF!<>\"\",#REF!,\"-\")","v":{"$error":"#REF!"}},{"$error":"#REF!"},null,83]
[{"$error":"#REF!"},{"$error":"#REF!"},8,{"$error":"#REF!"},{"$error":"#REF!"},{"$error":"#REF!"},{"$f":"IF(#REF!>\"\",9990,0)","v":{"$error":"#REF!"}},{"$f":"IF(#REF!=\"\",0,VLOOKUP(#REF!,#REF!,2,FALSE))","v":{"$error":"#REF!"}},"#LK","00","DPM",{"$f":"#REF!","v":{"$error":"#REF!"}},{"$f":"#REF!","v":{"$error":"#REF!"}},null,null,null,null,null,null,null,null,null,null,null,null,null,null,null,null,null,null,{"$f":"IF(#REF!<>\"\",#REF!,\"-\")","v":{"$error":"#REF!"}},{"$error":"#REF!"},null,84]

{"sheet":"CSV_final","index":4,"n_rows":0,"n_cols":0,"rows_kept":0,"cut":false,"hidden":true,"merged":[]}

{"sheet":"Sheet 1","index":5,"n_rows":1105,"n_cols":523,"rows_kept":1105,"cut":false,"hidden":false,"merged":[[37,1,37,2],[38,1,38,2],[137,1,137,2],[138,1,138,2],[139,1,139,2],[140,1,140,2],[141,1,141,2],[142,1,142,2],[168,1,168,2],[110,1,110,2],[111,1,111,2],[112,1,112,2],[114,1,114,2],[115,1,115,2],[108,1,108,2],[120,1,120,2],[121,1,121,2],[122,1,122,2],[124,1,124,2],[123,1,123,2],[118,1,118,2],[119,1,119,2],[109,1,109,2],[131,1,131,2],[179,1,179,2],[173,1,173,2],[174,1,174,2],[175,1,175,2],[177,1,177,2],[154,1,154,2],[156,1,156,2],[134,1,134,2],[135,1,135,2],[136,1,136,2],[155,1,155,2],[410,5,410,7],[203,1,203,2],[181,1,181,2],[215,1,215,2],[216,1,216,2],[217,1,217,2],[182,1,182,2],[183,1,183,2],[191,1,191,2],[192,1,192,2],[193,1,193,2],[196,1,196,2],[198,1,198,2],[199,1,199,2],[200,1,200,2],[201,1,201,2],[350,5,350,11],[185,1,185,2],[206,1,206,2],[221,1,221,2],[245,1,245,2],[246,1,246,2],[202,1,202,2],[220,1,220,2],[5,6,5,7],[35,4,35,6],[82,4,82,6],[84,4,84,6],[157,1,157,2],[158,1,158,2],[159,1,159,2],[78,5,78,6],[143,1,143,2],[144,1,144,2],[145,1,145,2],[153,1,153,2],[95,1,95,2],[96,1,96,2],[81,5,81,6],[79,5,79,6],[113,1,113,2],[146,1,146,2],[152,1,152,2],[125,1,125,2],[126,1,126,2],[127,1,127,2],[116,1,116,2],[117,1,117,2],[247,1,247,2],[223,1,223,2],[224,1,224,2],[225,1,225,2],[226,1,226,2],[227,1,227,2],[228,1,228,2],[234,1,234,2],[229,1,229,2],[230,1,230,2],[231,1,231,2],[235,1,235,2],[238,1,238,2],[244,1,244,2],[282,1,282,2],[388,4,390,7],[386,4,387,7],[304,5,304,6],[305,5,305,6],[328,7,328,11],[287,1,287,2],[381,4,382,7],[383,4,385,7],[292,3,293,3],[293,1,293,2],[299,1,299,2],[306,6,307,6],[314,1,314,2],[319,7,319,11],[312,8,312,9],[283,1,283,2],[286,1,286,2],[285,1,285,2],[284,1,284,2],[197,1,197,2],[208,1,208,2],[233,1,233,2],[189,1,189,2],[190,1,190,2],[204,1,204,2],[205,1,205,2],[207,1,207,2],[219,1,219,2],[279,1,279,2],[250,1,250,2],[257,1,257,2],[264,1,264,2],[251,1,251,2],[252,1,252,2],[253,1,253,2],[254,1,254,2],[255,1,255,2],[259,1,259,2],[276,1,276,2],[277,1,277,2],[256,1,256,2],[274,1,274,2],[275,1,275,2],[267,1,267,2],[263,1,263,2],[180,1,180,2],[169,1,169,2],[147,1,147,2],[148,1,148,2],[149,1,149,2],[150,1,150,2],[151,1,151,2],[194,1,194,2],[195,1,195,2],[160,1,160,2],[187,1,187,2],[188,1,188,2],[178,1,178,2],[170,1,170,2],[171,1,171,2],[176,1,176,2],[172,1,172,2],[165,1,165,2],[161,1,161,2],[166,1,166,2],[167,1,167,2],[162,1,162,2],[164,1,164,2],[163,1,163,2],[399,5,399,7],[232,1,232,2],[239,1,239,2],[240,1,240,2],[241,1,241,2],[242,1,242,2],[243,1,243,2],[222,1,222,2],[184,1,184,2],[186,1,186,2],[218,1,218,2],[209,1,209,2],[210,1,210,2],[211,1,211,2],[212,1,212,2],[213,1,213,2],[214,1,214,2],[280,1,280,2],[236,1,236,2],[237,1,237,2],[248,1,248,2],[249,1,249,2],[278,1,278,2],[270,1,270,2],[132,1,132,2],[133,1,133,2],[87,5,87,7],[100,1,100,2],[101,1,101,2],[102,1,102,2],[103,1,103,2],[104,1,104,2],[105,1,105,2],[106,1,106,2],[107,1,107,2],[90,5,90,7],[97,1,97,2],[98,1,98,2],[99,1,99,2],[94,1,94,2],[91,5,91,11],[1104,1,1105,2],[413,5,416,8],[418,5,426,8],[423,1,426,3],[80,5,80,9],[86,5,86,7],[291,1,291,2],[258,1,258,2],[268,1,268,2],[271,1,271,2],[272,1,272,2],[273,1,273,2],[288,1,288,2],[289,1,289,2],[290,1,290,2],[269,1,269,2],[260,1,260,2],[261,1,261,2],[262,1,262,2],[265,1,265,2],[266,1,266,2],[128,1,128,2],[129,1,129,2],[130,1,130,2]]}
[]
[]
[]
[null,"INPUT SHEET"]
[]
[null,"For the period from ",{"$f":"'COVER SHEET'!C28","v":"00:00:00"}," to ",null,null,{"$f":"'COVER SHEET'!C29","v":"00:00:00"}]
[]
[null,null,"Amounts included on the credit should be -ve "]
[null,null,"Amounts included on the debit should be +ve "]
[null,null,null,"As per Trial Balance"]
[]
[null,"1) Income"]
[null,"a) Dealing Profit or (Loss) - Trading"]
[null,"b) Dealing Profit or (Loss) - Long Term Investments"]
[null,"c) Commissions received on transactions in :"]
[null,"i) locally based schemes"]
[null,"ii) foreign based schemes "]
[null,"1) listed on a Recognised Investment Exchange"]
[null,"2) not listed on a Recognised Investment Exchange"]
[null,"iii) unit linked products"]
[null,"iv) other commissions (equities, debt instruments etc...)"]
[null,"d) Investment Management and Administration Fees"]
[null,"i) Retail clients"]
[null,"ii) Professional clients"]
[null,"iii) Collective Investment Schemes"]
[null,"iv) Other (e.g. connected companies)"]
[null,"e) Investment Advisory Fees"]
[null,"i) Retail clients",null,null,null,{"$f":"IF(OR(D28<>0, D29<>0, D30<>0, D31<>0), \"Kindly ensure that the values inputted are under the correct sub-heading\",\"\")","v":""}]
[null,"ii) Professional clients"]
[null,"iii) Collective Investment Schemes"]
[null,"iv) Other (e.g. connected companies)"]
[null,"f) Other ISA related revenue"]
[null,"g) Non-ISA related revenue"]
[null,"h) Finance Income"]
[null,"i) Fair value changes in Profit or Loss"]
[null,null,null,null,{"$f":"SUM(D13:D33)","v":0}]
[null,"2) Expenditure"]
[null,"a) Commissions that are directly related to the acqusition of gross revenue (derived from investment services activities), paid or payable to third parties; and/ or"]
[null,"    i) Fees, brokerage and other charges paid to clearing houses, exchanges and intermediate brokers for the purpse of executing, registering or clearing transactions"]
[null,"    ii) Fees to tied agents",null,null,null,null,null,{"$f":"SUM(D38:D40)","v":0}]
[null,"b) Other Commissions payable (not related to investment services activities)"]
[null,"c) Exceptional Items of expenditure"]
[null,"i) Allowed by MFSA"]
[null,"ii) Other"]
[null,"d) Depreciation"]
[null,"e) Directors Remuneration"]
[null,"f) Salaries"]
[null,"g) Staff bonuses"]
[null,"h) Other appropriations of profits and other variable remuneration"]
[null,"i) Shared commission and fees payable which are directly related to commission"]
[null,"and fees receivable which are included within total revenue, and where the"]
[null,"payment of the commission and fees payable is contingent upon the actual"]
[" ","receipt of the commission and fees receivable"]
[null,"j) Employees' and directors' shares in profits"]
[null,"k) Investor Compensation Scheme"]
[null,"l) Professional fees"]
[null,"m) Audit fees"]
[null,"n) Registration and Other fees"]
[null,"o) Bank Charges"]
[null,"p) Rental Expenses"]
[null,"q) Travel Expenses"]
[null,"r) Insurance Expenses"]
[null,"s) Advertising Expense"]
[null,"t) Interest charges in respect of borrowing made to finance the "]
[null,"acquisition of  readily realisable investments"]
[null,"u) Interest paid to clients on clients' money"]
[null,"v) Interest paid to counterparties"]
[null,"w) Other interest payable "]
[null,"x) Foreign exchange losses"]
[null,"y) Non-recurring expenses from non-ordinary activities"]
[null,"z) Other administrative expenses"]
[null,"aa) Taxation for the year"]
[]
[null,"Movement effected through the statement of changes in Equity "]
[null,"a) Dividends "]
[null,"i) Paid"]
[null,"ii) Proposed but not paid"]
[]
[null,"Statement of Other Comprehensive Income",null,null,null,{"$f":"IF(OR(D80<>0,D82<>0),\"Qualify as P/L or OCI\",\"\")","v":""}]
[null,"a) Fair value movements on Intangible Assets",null,null,"P/L",null,null,"P/L","OCI",null,null,{"$f":"IF(K81=\"Yes\",\"Amount\",\"\")","v":""}]
[null,"b) Gain/Loss on revaulation of available for sale Financial Assets",null,null,null,{"$f":"IF(D81<>0,\"Does this amount include exposures to central governments classified in the AFS category of EU - endorsed IAS 39?\",\"\")","v":""}]
[null,"c)  Gain/Loss on revaluation of property",null,null,null,null,null,null,null,null,"Yes"]
[null,"d) Other items of income and expense included in other comprehensive income",null,null,null,null,null,null,null,null,"No"]
[null,"e) Tax income/expense relating to components of other comprehensive income"]
[null,null,null,null,{"$f":"-E36-E83","v":0}]
[null,"3) Assets"]
[null,"a) Intangible assets",null,null,null,"Type"]
[null,"i) Goodwill"]
[null,"ii) Other Intangible Assets",null,null,null,null,{"$f":"+D89+D88","v":0},null,{"$f":"+G89+G76","v":0}]
[null,"b) Property, Plant and Equipment"]
[null,"c) Investment Property"]
[null,"d) Defered Tax Asset",null,null,null,"Kindly Categorise amount in Table 4.1 (rows 20, 30 &40)",null,null,null,null,null,null,null,null,null,null,null,null,null,null,null,null,null,null,null,null,null,null,null,null,null,null,null,null,null,"CURRENCY","MARKET"]
[null,"e) Inventories",null,null,null,null,null,null,{"$f":"+D93","v":0},null,null,null,null,null,null,null,null,null,null,null,null,null,null,null,null,null,null,null,null,null,null,null,null,null,null,"ALL","Albania"]
[null,"f) Financial Instruments (Short Positions are to be included as trading book positions only.)",null,null,null,null,null,null,null,null,null,null,null,null,null,null,null,null,null,null,null,null,null,null,null,null,null,null,null,null,"Total",null,null,null,null,"BGN","Austria"]
[null,"i) Exposures to Central Governments or Central Banks",null,null,null,null,null,null,null,null,null,null,null,null,null,null,null,null,null,null,null,null,null,null,null,null,null,null,null,null,null,null,null,null,null,"CHF","Belgium"]
[null,null,null,null,null,null,null,null,null,null,null,null,null,null,null,null,null,null,null,null,null,null,null,null,null,null,null,null,null,null,{"$f":"IF(D96>0,D96,0)","v":0},{"$f":"IF(D96<0,D96,0)","v":0},null,null,null,"CZK","Bulgaria"]
[null,null,null,null,null,null,null,null,null,null,null,null,null,null,null,null,null,null,null,null,null,null,null,null,null,null,null,null,null,null,{"$f":"IF(D97>0,D97,0)","v":0},{"$f":"IF(D97<0,D97,0)","v":0},null,null,null,"DKK","Cyprus"]
[null,null,null,null,null,null,null,null,null,null,null,null,null,null,null,null,null,null,null,null,null,null,null,1,null,null,null,null,null,null,0,0,null,null,null,"EUR","Czech Republic"]
[null,null,null,null,null,null,null,null,null,null,null,null,null,null,null,null,null,null,null,null,null,null,null,2,null,null,null,null,null,null,0,0,null,null,null,"EGP","Denmark"]
[null,null,null,null,null,null,null,null,null,null,null,null,null,null,null,null,null,null,null,null,null,null,null,3,null,null,null,null,null,null,0,0,null,null,null,"GBP","Estonia"]
[null,null,null,null,null,null,null,null,null,null,null,null,null,null,null,null,null,null,null,null,null,null,null,4,null,null,null,null,null,null,0,0,null,null,null,"HUF","Finland"]
[null,null,null,null,null,null,null,null,null,null,null,null,null,null,null,null,null,null,null,null,null,null,null,5,null,null,null,null,null,null,0,0,null,null,null,"ISK","France"]
[null,null,null,null,null,null,null,null,null,null,null,null,null,null,null,null,null,null,null,null,null,null,null,6,null,null,null,null,null,null,0,0,null,null,null,"JPY","Germany"]
[null,null,null,null,null,null,null,null,null,null,null,null,null,null,null,null,null,null,null,null,null,null,null,"unrated",null,null,null,null,null,null,0,0,null,null,null,"LIE","Greece"]
[null,null,null,null,null,null,null,null,null,null,null,null,null,null,null,null,null,null,null,null,null,null,null,"0 %",null,null,null,null,null,null,{"$f":"IF(D105>0,D105,0)","v":0},{"$f":"IF(D105<0,D105,0)","v":0},null,null,null,"LTL","Hungary"]
[null,null,null,null,null,null,null,null,null,null,null,null,null,null,null,null,null,null,null,null,null,null,null,0.2,null,null,null,null,null,null,0,0,null,null,null,"LVL","Ireland"]
[null,null,null,null,null,null,null,null,null,null,null,null,null,null,null,null,null,null,null,null,null,null,null,null,null,null,null,null,null,null,0,0,null,null,null,"MKD","Italy"]
[null,null,null,null,null,null,null,null,null,null,null,null,null,null,null,null,null,null,null,null,null,null,null,null,null,null,null,null,null,null,0,0,null,null,null,"PLN","Japan"]
[null,null,null,null,null,null,null,null,null,null,null,null,null,null,null,null,null,null,null,null,null,null,null,null,null,null,null,null,null,null,0,0,null,null,null,"RON","Latvia"]
[null,null,null,null,null,null,null,null,null,null,null,null,null,null,null,null,null,null,null,null,null,null,null,null,null,null,null,null,null,null,0,0,null,null,null,"RSD","Lithuania"]
[null,null,null,null,null,null,null,null,null,null,null,null,null,null,null,null,null,null,null,null,null,null,null,null,null,null,null,null,null,null,0,0,null,null,null,"RUB","Luxembourg"]
[null,null,null,null,null,null,null,null,null,null,null,null,null,null,null,null,null,null,null,null,null,null,null,null,null,null,null,null,null,null,0,0,null,null,null,"SEK","Macedonia"]
[null,null,null,null,null,null,null,null,null,null,null,null,null,null,null,null,null,null,null,null,null,null,null,null,null,null,null,null,null,null,0,0,null,null,null,"TRY","Malta"]
[null,null,null,null,null,null,null,null,null,null,null,null,null,null,null,null,null,null,null,null,null,null,null,null,null,null,null,null,null,null,0,0,null,null,null,"UAH","Netherlands"]
[null,null,null,null,null,null,null,null,null,null,null,null,null,null,null,null,null,null,null,null,null,null,null,null,null,null,null,null,null,null,0,0,null,null,null,"USD","Poland"]
[null,null,null,null,null,null,null,null,null,null,null,null,null,null,null,null,null,null,null,null,null,null,null,null,null,null,null,null,null,null,0,0,null,null,null,"Other","Portugal",null,null,null,null,null,null,null,null,null,null,null,null,null,null,null,null,null,null,null,null,null,null,null,null,null,null,null,null,null,null,null,null,null,null,null,null,null,null,null,null,null,null,null,null,null,null,null,null,null,null,null,null,null,null,null,null,null,null,null,null,null,null,null,null,null,null,null,null,null,null,null,null,null,null,null,null,null,null,null,null,null,null,null,null,null,null,null,null,null,null,null,null,null,null,null,null,null,null,null,null,null,null,null,null,null,null,null,null,null,null,null,null,null,null,null,null,null,null,null,null,null,null,null,null,null,null,null,null,null,null,null,null,null,null,null,null,null,null,null,null,null,null,null,null,null,null,null,null,null,null,null,null,null,null,null,null,null,null,null,null,null,null,null,null,null,null,null,null,null,null,null,null,null,null,null,null,null,null,null,null,null,null,null,null,null,null,null,null,null,null,null,null,null,null,null,null,null,null,null,null,null,null,null,null,null,null,null,null,null,null,null,null,null,null,null,null,null,null,null,null,null,null,null,null,null,null,null,null,null,null,null,null,null,null,null,null,null,null,null,null,null,null,null,null,null,null,null,null,null,null,null,null,null,null,null,null,null,null,null,null,null,null,null,null,null,null,null,null,null,null,null,null,null,null,null,null,null,null,null,null,null,null,null,null,null,null,null,null,null,null,null,null,null,null,null,null,null,null,null,null,null,null,null,null,null,null,null,null,null,null,null,null,null,null,null,null,null,null,null,null,null,null,null,null,null,null,null,null,null,null,null,null,null,null,null,null,null,null,null,null,null,null,null,null,null,null,null,null,null,null,null,null,null,null,null,null,null,null,null,null,null,null,null,null,null,null,null,null,null,null,null,null,null,null,null,null,null,null,null,null,null,null,null,null,null,null,null,null,null,null,null,null,null,null,null,null,null,null,null,null,null,null,null,null,null,null,null,null,null,null,null,null,null,null,null,null,null,null,null,null,null,null,null,null,null,null,null,null,null,null,null,null,null,null,null,null,null,null,null,null,null,null,null,null,null,null,null,null,null,null,null,null,null,null,null,null,null,null,null,null,null,null,null,null,null,null,null,null,null,null,null,null,null,null,null,null,"JUST FOR MULTILATERAL DEVELOPMENT BANKS WORKING IS IN INPUT SHEET"]
[null,null,null,null,null,null,null,null,null,null,null,null,null,null,null,null,null,null,null,null,null,null,null,null,null,null,null,null,null,null,0,0,null,null,null,null,"Romania"]
[null,null,null,null,null,null,null,null,null,null,null,null,null,null,null,null,null,null,null,null,null,null,null,null,null,null,null,null,null,null,0,0,null,null,null,null,"Russian Federation",null,null,null,null,null,null,null,null,null,null,null,null,null,null,null,null,null,null,null,null,null,null,null,null,null,null,null,null,null,null,null,null,null,null,null,null,null,null,null,null,null,null,null,null,null,null,null,null,null,null,null,null,null,null,null,null,null,null,null,null,null,null,null,null,null,null,null,null,null,null,null,null,null,null,null,null,null,null,null,null,null,null,null,null,null,null,null,null,null,null,null,null,null,null,null,null,null,null,null,null,null,null,null,null,null,null,null,null,null,null,null,null,null,null,null,null,null,null,null,null,null,null,null,null,null,null,null,null,null,null,null,null,null,null,null,null,null,null,null,null,null,null,null,null,null,null,null,null,null,null,null,null,null,null,null,null,null,null,null,null,null,null,null,null,null,null,null,null,null,null,null,null,null,null,null,null,null,null,null,null,null,null,null,null,null,null,null,null,null,null,null,null,null,null,null,null,null,null,null,null,null,null,null,null,null,null,null,null,null,null,null,null,null,null,null,null,null,null,null,null,null,null,null,null,null,null,null,null,null,null,null,null,null,null,null,null,null,null,null,null,null,null,null,null,null,null,null,null,null,null,null,null,null,null,null,null,null,null,null,null,null,null,null,null,null,null,null,null,null,null,null,null,null,null,null,null,null,null,null,null,null,null,null,null,null,null,null,null,null,null,null,null,null,null,null,null,null,null,null,null,null,null,null,null,null,null,null,null,null,null,null,null,null,null,null,null,null,null,null,null,null,null,null,null,null,null,null,null,null,null,null,null,null,null,null,null,null,null,null,null,null,null,null,null,null,null,null,null,null,null,null,null,null,null,null,null,null,null,null,null,null,null,null,null,null,null,null,null,null,null,null,null,null,null,null,null,null,null,null,null,null,null,null,null,null,null,null,null,null,null,null,null,null,null,null,null,null,null,null,null,null,null,null,null,null,null,null,null,null,null,null,null,null,null,null,null,null,null,null,null,null,null,null,null,null,null,null,null,null,null,null,null,null,null,null,null,null,null,null,null,null,null,null,null,null,null,null,null,null,null,null,null,null,null,null,null,null,null,null,null,null,null,null,null,null,null,null,null,null,null,null,null,null,null,null,null,null,null,"Type of Multilateral Development Bank"]
[null,null,null,null,null,null,null,null,null,null,null,null,null,null,null,null,null,null,null,null,null,null,null,null,null,null,null,null,null,null,0,0,null,null,null,null,"Serbia",null,null,null,null,null,null,null,null,null,null,null,null,null,null,null,null,null,null,null,null,null,null,null,null,null,null,null,null,null,null,null,null,null,null,null,null,null,null,null,null,null,null,null,null,null,null,null,null,null,null,null,null,null,null,null,null,null,null,null,null,null,null,null,null,null,null,null,null,null,null,null,null,null,null,null,null,null,null,null,null,null,null,null,null,null,null,null,null,null,null,null,null,null,null,null,null,null,null,null,null,null,null,null,null,null,null,null,null,null,null,null,null,null,null,null,null,null,null,null,null,null,null,null,null,null,null,null,null,null,null,null,null,null,null,null,null,null,null,null,null,null,null,null,null,null,null,null,null,null,null,null,null,null,null,null,null,null,null,null,null,null,null,null,null,null,null,null,null,null,null,null,null,null,null,null,null,null,null,null,null,null,null,null,null,null,null,null,null,null,null,null,null,null,null,null,null,null,null,null,null,null,null,null,null,null,null,null,null,null,null,null,null,null,null,null,null,null,null,null,null,null,null,null,null,null,null,null,null,null,null,null,null,null,null,null,null,null,null,null,null,null,null,null,null,null,null,null,null,null,null,null,null,null,null,null,null,null,null,null,null,null,null,null,null,null,null,null,null,null,null,null,null,null,null,null,null,null,null,null,null,null,null,null,null,null,null,null,null,null,null,null,null,null,null,null,null,null,null,null,null,null,null,null,null,null,null,null,null,null,null,null,null,null,null,null,null,null,null,null,null,null,null,null,null,null,null,null,null,null,null,null,null,null,null,null,null,null,null,null,null,null,null,null,null,null,null,null,null,null,null,null,null,null,null,null,null,null,null,null,null,null,null,null,null,null,null,null,null,null,null,null,null,null,null,null,null,null,null,null,null,null,null,null,null,null,null,null,null,null,null,null,null,null,null,null,null,null,null,null,null,null,null,null,null,null,null,null,null,null,null,null,null,null,null,null,null,null,null,null,null,null,null,null,null,null,null,null,null,null,null,null,null,null,null,null,null,null,null,null,null,null,null,null,null,null,null,null,null,null,null,null,null,null,null,null,null,null,null,null,null,null,null,null,null,null,null,null,null,null,null,null,null,null,null,null,null,null,null,"The Inter-American Investment Corporation","N/A"]
[null,null,null,null,null,null,null,null,null,null,null,null,null,null,null,null,null,null,null,null,null,null,null,null,null,null,null,null,null,null,0,0,null,null,null,null,"Slovakia",null,null,null,null,null,null,null,null,null,null,null,null,null,null,null,null,null,null,null,null,null,null,null,null,null,null,null,null,null,null,null,null,null,null,null,null,null,null,null,null,null,null,null,null,null,null,null,null,null,null,null,null,null,null,null,null,null,null,null,null,null,null,null,null,null,null,null,null,null,null,null,null,null,null,null,null,null,null,null,null,null,null,null,null,null,null,null,null,null,null,null,null,null,null,null,null,null,null,null,null,null,null,null,null,null,null,null,null,null,null,null,null,null,null,null,null,null,null,null,null,null,null,null,null,null,null,null,null,null,null,null,null,null,null,null,null,null,null,null,null,null,null,null,null,null,null,null,null,null,null,null,null,null,null,null,null,null,null,null,null,null,null,null,null,null,null,null,null,null,null,null,null,null,null,null,null,null,null,null,null,null,null,null,null,null,null,null,null,null,null,null,null,null,null,null,null,null,null,null,null,null,null,null,null,null,null,null,null,null,null,null,null,null,null,null,null,null,null,null,null,null,null,null,null,null,null,null,null,null,null,null,null,null,null,null,null,null,null,null,null,null,null,null,null,null,null,null,null,null,null,null,null,null,null,null,null,null,null,null,null,null,null,null,null,null,null,null,null,null,null,null,null,null,null,null,null,null,null,null,null,null,null,null,null,null,null,null,null,null,null,null,null,null,null,null,null,null,null,null,null,null,null,null,null,null,null,null,null,null,null,null,null,null,null,null,null,null,null,null,null,null,null,null,null,null,null,null,null,null,null,null,null,null,null,null,null,null,null,null,null,null,null,null,null,null,null,null,null,null,null,null,null,null,null,null,null,null,null,null,null,null,null,null,null,null,null,null,null,null,null,null,null,null,null,null,null,null,null,null,null,null,null,null,null,null,null,null,null,null,null,null,null,null,null,null,null,null,null,null,null,null,null,null,null,null,null,null,null,null,null,null,null,null,null,null,null,null,null,null,null,null,null,null,null,null,null,null,null,null,null,null,null,null,null,null,null,null,null,null,null,null,null,null,null,null,null,null,null,null,null,null,null,null,null,null,null,null,null,null,null,null,null,null,null,null,null,null,null,null,null,null,null,null,null,null,null,null,null,"The Black Sea Trade and Development Bank","N/A"]
[null,null,null,null,null,null,null,null,null,null,null,null,null,null,null,null,null,null,null,null,null,null,null,null,null,null,null,null,null,null,0,0,null,null,null,null,"Slovenia",null,null,null,null,null,null,null,null,null,null,null,null,null,null,null,null,null,null,null,null,null,null,null,null,null,null,null,null,null,null,null,null,null,null,null,null,null,null,null,null,null,null,null,null,null,null,null,null,null,null,null,null,null,null,null,null,null,null,null,null,null,null,null,null,null,null,null,null,null,null,null,null,null,null,null,null,null,null,null,null,null,null,null,null,null,null,null,null,null,null,null,null,null,null,null,null,null,null,null,null,null,null,null,null,null,null,null,null,null,null,null,null,null,null,null,null,null,null,null,null,null,null,null,null,null,null,null,null,null,null,null,null,null,null,null,null,null,null,null,null,null,null,null,null,null,null,null,null,null,null,null,null,null,null,null,null,null,null,null,null,null,null,null,null,null,null,null,null,null,null,null,null,null,null,null,null,null,null,null,null,null,null,null,null,null,null,null,null,null,null,null,null,null,null,null,null,null,null,null,null,null,null,null,null,null,null,null,null,null,null,null,null,null,null,null,null,null,null,null,null,null,null,null,null,null,null,null,null,null,null,null,null,null,null,null,null,null,null,null,null,null,null,null,null,null,null,null,null,null,null,null,null,null,null,null,null,null,null,null,null,null,null,null,null,null,null,null,null,null,null,null,null,null,null,null,null,null,null,null,null,null,null,null,null,null,null,null,null,null,null,null,null,null,null,null,null,null,null,null,null,null,null,null,null,null,null,null,null,null,null,null,null,null,null,null,null,null,null,null,null,null,null,null,null,null,null,null,null,null,null,null,null,null,null,null,null,null,null,null,null,null,null,null,null,null,null,null,null,null,null,null,null,null,null,null,null,null,null,null,null,null,null,null,null,null,null,null,null,null,null,null,null,null,null,null,null,null,null,null,null,null,null,null,null,null,null,null,null,null,null,null,null,null,null,null,null,null,null,null,null,null,null,null,null,null,null,null,null,null,null,null,null,null,null,null,null,null,null,null,null,null,null,null,null,null,null,null,null,null,null,null,null,null,null,null,null,null,null,null,null,null,null,null,null,null,null,null,null,null,null,null,null,null,null,null,null,null,null,null,null,null,null,null,null,null,null,null,null,null,null,null,null,null,null,null,null,null,null,"The Central American Bank for Economic Integration","N/A"]
[null,null,null,null,null,null,null,null,null,null,null,null,null,null,null,null,null,null,null,null,null,null,null,null,null,null,null,null,null,null,0,0,null,null,null,null,"Spain",null,null,null,null,null,null,null,null,null,null,null,null,null,null,null,null,null,null,null,null,null,null,null,null,null,null,null,null,null,null,null,null,null,null,null,null,null,null,null,null,null,null,null,null,null,null,null,null,null,null,null,null,null,null,null,null,null,null,null,null,null,null,null,null,null,null,null,null,null,null,null,null,null,null,null,null,null,null,null,null,null,null,null,null,null,null,null,null,null,null,null,null,null,null,null,null,null,null,null,null,null,null,null,null,null,null,null,null,null,null,null,null,null,null,null,null,null,null,null,null,null,null,null,null,null,null,null,null,null,null,null,null,null,null,null,null,null,null,null,null,null,null,null,null,null,null,null,null,null,null,null,null,null,null,null,null,null,null,null,null,null,null,null,null,null,null,null,null,null,null,null,null,null,null,null,null,null,null,null,null,null,null,null,null,null,null,null,null,null,null,null,null,null,null,null,null,null,null,null,null,null,null,null,null,null,null,null,null,null,null,null,null,null,null,null,null,null,null,null,null,null,null,null,null,null,null,null,null,null,null,null,null,null,null,null,null,null,null,null,null,null,null,null,null,null,null,null,null,null,null,null,null,null,null,null,null,null,null,null,null,null,null,null,null,null,null,null,null,null,null,null,null,null,null,null,null,null,null,null,null,null,null,null,null,null,null,null,null,null,null,null,null,null,null,null,null,null,null,null,null,null,null,null,null,null,null,null,null,null,null,null,null,null,null,null,null,null,null,null,null,null,null,null,null,null,null,null,null,null,null,null,null,null,null,null,null,null,null,null,null,null,null,null,null,null,null,null,null,null,null,null,null,null,null,null,null,null,null,null,null,null,null,null,null,null,null,null,null,null,null,null,null,null,null,null,null,null,null,null,null,null,null,null,null,null,null,null,null,null,null,null,null,null,null,null,null,null,null,null,null,null,null,null,null,null,null,null,null,null,null,null,null,null,null,null,null,null,null,null,null,null,null,null,null,null,null,null,null,null,null,null,null,null,null,null,null,null,null,null,null,null,null,null,null,null,null,null,null,null,null,null,null,null,null,null,null,null,null,null,null,null,null,null,null,null,null,null,null,null,null,null,null,null,null,null,null,null,null,"The International Bank for Reconstruction and Development",0,null,null,"Unrated "]
[null,null,null,null,null,null,null,null,null,null,null,null,null,null,null,null,null,null,null,null,null,null,null,null,null,null,null,null,null,null,0,0,null,null,null,null,"Sweden",null,null,null,null,null,null,null,null,null,null,null,null,null,null,null,null,null,null,null,null,null,null,null,null,null,null,null,null,null,null,null,null,null,null,null,null,null,null,null,null,null,null,null,null,null,null,null,null,null,null,null,null,null,null,null,null,null,null,null,null,null,null,null,null,null,null,null,null,null,null,null,null,null,null,null,null,null,null,null,null,null,null,null,null,null,null,null,null,null,null,null,null,null,null,null,null,null,null,null,null,null,null,null,null,null,null,null,null,null,null,null,null,null,null,null,null,null,null,null,null,null,null,null,null,null,null,null,null,null,null,null,null,null,null,null,null,null,null,null,null,null,null,null,null,null,null,null,null,null,null,null,null,null,null,null,null,null,null,null,null,null,null,null,null,null,null,null,null,null,null,null,null,null,null,null,null,null,null,null,null,null,null,null,null,null,null,null,null,null,null,null,null,null,null,null,null,null,null,null,null,null,null,null,null,null,null,null,null,null,null,null,null,null,null,null,null,null,null,null,null,null,null,null,null,null,null,null,null,null,null,null,null,null,null,null,null,null,null,null,null,null,null,null,null,null,null,null,null,null,null,null,null,null,null,null,null,null,null,null,null,null,null,null,null,null,null,null,null,null,null,null,null,null,null,null,null,null,null,null,null,null,null,null,null,null,null,null,null,null,null,null,null,null,null,null,null,null,null,null,null,null,null,null,null,null,null,null,null,null,null,null,null,null,null,null,null,null,null,null,null,null,null,null,null,null,null,null,null,null,null,null,null,null,null,null,null,null,null,null,null,null,null,null,null,null,null,null,null,null,null,null,null,null,null,null,null,null,null,null,null,null,null,null,null,null,null,null,null,null,null,null,null,null,null,null,null,null,null,null,null,null,null,null,null,null,null,null,null,null,null,null,null,null,null,null,null,null,null,null,null,null,null,null,null,null,null,null,null,null,null,null,null,null,null,null,null,null,null,null,null,null,null,null,null,null,null,null,null,null,null,null,null,null,null,null,null,null,null,null,null,null,null,null,null,null,null,null,null,null,null,null,null,null,null,null,null,null,null,null,null,null,null,null,null,null,null,null,null,null,null,null,null,null,null,null,null,null,null,"The International Finance Corporation",0,null,null,{"$f":"#REF!","v":{"$error":"#REF!"}},null,"unrated with maturity less than 3"]
[null,null,null,null,null,null,null,null,null,null,null,null,null,null,null,null,null,null,null,null,null,null,null,null,null,null,null,null,null,null,0,0,null,null,null,null,"Switzerland",null,null,null,null,null,null,null,null,null,null,null,null,null,null,null,null,null,null,null,null,null,null,null,null,null,null,null,null,null,null,null,null,null,null,null,null,null,null,null,null,null,null,null,null,null,null,null,null,null,null,null,null,null,null,null,null,null,null,null,null,null,null,null,null,null,null,null,null,null,null,null,null,null,null,null,null,null,null,null,null,null,null,null,null,null,null,null,null,null,null,null,null,null,null,null,null,null,null,null,null,null,null,null,null,null,null,null,null,null,null,null,null,null,null,null,null,null,null,null,null,null,null,null,null,null,null,null,null,null,null,null,null,null,null,null,null,null,null,null,null,null,null,null,null,null,null,null,null,null,null,null,null,null,null,null,null,null,null,null,null,null,null,null,null,null,null,null,null,null,null,null,null,null,null,null,null,null,null,null,null,null,null,null,null,null,null,null,null,null,null,null,null,null,null,null,null,null,null,null,null,null,null,null,null,null,null,null,null,null,null,null,null,null,null,null,null,null,null,null,null,null,null,null,null,null,null,null,null,null,null,null,null,null,null,null,null,null,null,null,null,null,null,null,null,null,null,null,null,null,null,null,null,null,null,null,null,null,null,null,null,null,null,null,null,null,null,null,null,null,null,null,null,null,null,null,null,null,null,null,null,null,null,null,null,null,null,null,null,null,null,null,null,null,null,null,null,null,null,null,null,null,null,null,null,null,null,null,null,null,null,null,null,null,null,null,null,null,null,null,null,null,null,null,null,null,null,null,null,null,null,null,null,null,null,null,null,null,null,null,null,null,null,null,null,null,null,null,null,null,null,null,null,null,null,null,null,null,null,null,null,null,null,null,null,null,null,null,null,null,null,null,null,null,null,null,null,null,null,null,null,null,null,null,null,null,null,null,null,null,null,null,null,null,null,null,null,null,null,null,null,null,null,null,null,null,null,null,null,null,null,null,null,null,null,null,null,null,null,null,null,null,null,null,null,null,null,null,null,null,null,null,null,null,null,null,null,null,null,null,null,null,null,null,null,null,null,null,null,null,null,null,null,null,null,null,null,null,null,null,null,null,null,null,null,null,null,null,null,null,null,null,null,null,null,null,null,null,null,"The Inter-American Development Bank",0,null,null,1,{"$f":"SUMIF('Sheet 1'!K172:K179,'Sheet 1'!SZ124,'Sheet 1'!D172:D179)","v":0},{"$f":"IF(AND(H172=\"no\",I172<=3,J172=\"unrated\",K172=\"unrated\"),D172,\"0\")","v":"0"}]
[null,null,null,null,null,null,null,null,null,null,null,null,null,null,null,null,null,null,null,null,null,null,null,null,null,null,null,null,null,null,0,0,null,null,null,null,"Turkey",null,null,null,null,null,null,null,null,null,null,null,null,null,null,null,null,null,null,null,null,null,null,null,null,null,null,null,null,null,null,null,null,null,null,null,null,null,null,null,null,null,null,null,null,null,null,null,null,null,null,null,null,null,null,null,null,null,null,null,null,null,null,null,null,null,null,null,null,null,null,null,null,null,null,null,null,null,null,null,null,null,null,null,null,null,null,null,null,null,null,null,null,null,null,null,null,null,null,null,null,null,null,null,null,null,null,null,null,null,null,null,null,null,null,null,null,null,null,null,null,null,null,null,null,null,null,null,null,null,null,null,null,null,null,null,null,null,null,null,null,null,null,null,null,null,null,null,null,null,null,null,null,null,null,null,null,null,null,null,null,null,null,null,null,null,null,null,null,null,null,null,null,null,null,null,null,null,null,null,null,null,null,null,null,null,null,null,null,null,null,null,null,null,null,null,null,null,null,null,null,null,null,null,null,null,null,null,null,null,null,null,null,null,null,null,null,null,null,null,null,null,null,null,null,null,null,null,null,null,null,null,null,null,null,null,null,null,null,null,null,null,null,null,null,null,null,null,null,null,null,null,null,null,null,null,null,null,null,null,null,null,null,null,null,null,null,null,null,null,null,null,null,null,null,null,null,null,null,null,null,null,null,null,null,null,null,null,null,null,null,null,null,null,null,null,null,null,null,null,null,null,null,null,null,null,null,null,null,null,null,null,null,null,null,null,null,null,null,null,null,null,null,null,null,null,null,null,null,null,null,null,null,null,null,null,null,null,null,null,null,null,null,null,null,null,null,null,null,null,null,null,null,null,null,null,null,null,null,null,null,null,null,null,null,null,null,null,null,null,null,null,null,null,null,null,null,null,null,null,null,null,null,null,null,null,null,null,null,null,null,null,null,null,null,null,null,null,null,null,null,null,null,null,null,null,null,null,null,null,null,null,null,null,null,null,null,null,null,null,null,null,null,null,null,null,null,null,null,null,null,null,null,null,null,null,null,null,null,null,null,null,null,null,null,null,null,null,null,null,null,null,null,null,null,null,null,null,null,null,null,null,null,null,null,null,null,null,null,null,null,null,null,null,null,null,null,null,null,"The Asian Development Bank",0,null,null,2,{"$f":"SUMIF('Sheet 1'!K172:K179,'Sheet 1'!SZ125,'Sheet 1'!D172:D179)","v":0},{"$f":"IF(AND(H173=\"no\",I173<=3,J173=\"unrated\",K173=\"unrated\"),D173,\"0\")","v":"0"}]
[null,null,null,null,null,null,null,null,null,null,null,null,null,null,null,null,null,null,null,null,null,null,null,null,null,null,null,null,null,null,0,0,null,null,null,null,"Ukraine",null,null,null,null,null,null,null,null,null,null,null,null,null,null,null,null,null,null,null,null,null,null,null,null,null,null,null,null,null,null,null,null,null,null,null,null,null,null,null,null,null,null,null,null,null,null,null,null,null,null,null,null,null,null,null,null,null,null,null,null,null,null,null,null,null,null,null,null,null,null,null,null,null,null,null,null,null,null,null,null,null,null,null,null,null,null,null,null,null,null,null,null,null,null,null,null,null,null,null,null,null,null,null,null,null,null,null,null,null,null,null,null,null,null,null,null,null,null,null,null,null,null,null,null,null,null,null,null,null,null,null,null,null,null,null,null,null,null,null,null,null,null,null,null,null,null,null,null,null,null,null,null,null,null,null,null,null,null,null,null,null,null,null,null,null,null,null,null,null,null,null,null,null,null,null,null,null,null,null,null,null,null,null,null,null,null,null,null,null,null,null,null,null,null,null,null,null,null,null,null,null,null,null,null,null,null,null,null,null,null,null,null,null,null,null,null,null,null,null,null,null,null,null,null,null,null,null,null,null,null,null,null,null,null,null,null,null,null,null,null,null,null,null,null,null,null,null,null,null,null,null,null,null,null,null,null,null,null,null,null,null,null,null,null,null,null,null,null,null,null,null,null,null,null,null,null,null,null,null,null,null,null,null,null,null,null,null,null,null,null,null,null,null,null,null,null,null,null,null,null,null,null,null,null,null,null,null,null,null,null,null,null,null,null,null,null,null,null,null,null,null,null,null,null,null,null,null,null,null,null,null,null,null,null,null,null,null,null,null,null,null,null,null,null,null,null,null,null,null,null,null,null,null,null,null,null,null,null,null,null,null,null,null,null,null,null,null,null,null,null,null,null,null,null,null,null,null,null,null,null,null,null,null,null,null,null,null,null,null,null,null,null,null,null,null,null,null,null,null,null,null,null,null,null,null,null,null,null,null,null,null,null,null,null,null,null,null,null,null,null,null,null,null,null,null,null,null,null,null,null,null,null,null,null,null,null,null,null,null,null,null,null,null,null,null,null,null,null,null,null,null,null,null,null,null,null,null,null,null,null,null,null,null,null,null,null,null,null,null,null,null,null,null,null,null,null,null,null,"The African Development Bank",0,null,null,3,{"$f":"SUMIF('Sheet 1'!K172:K179,'Sheet 1'!SZ126,'Sheet 1'!D172:D179)","v":0},"0"]
[null,null,null,null,null,null,null,null,null,null,null,null,null,null,null,null,null,null,null,null,null,null,null,null,null,null,null,null,null,null,0,0,null,null,null,null,"United Kingdom",null,null,null,null,null,null,null,null,null,null,null,null,null,null,null,null,null,null,null,null,null,null,null,null,null,null,null,null,null,null,null,null,null,null,null,null,null,null,null,null,null,null,null,null,null,null,null,null,null,null,null,null,null,null,null,null,null,null,null,null,null,null,null,null,null,null,null,null,null,null,null,null,null,null,null,null,null,null,null,null,null,null,null,null,null,null,null,null,null,null,null,null,null,null,null,null,null,null,null,null,null,null,null,null,null,null,null,null,null,null,null,null,null,null,null,null,null,null,null,null,null,null,null,null,null,null,null,null,null,null,null,null,null,null,null,null,null,null,null,null,null,null,null,null,null,null,null,null,null,null,null,null,null,null,null,null,null,null,null,null,null,null,null,null,null,null,null,null,null,null,null,null,null,null,null,null,null,null,null,null,null,null,null,null,null,null,null,null,null,null,null,null,null,null,null,null,null,null,null,null,null,null,null,null,null,null,null,null,null,null,null,null,null,null,null,null,null,null,null,null,null,null,null,null,null,null,null,null,null,null,null,null,null,null,null,null,null,null,null,null,null,null,null,null,null,null,null,null,null,null,null,null,null,null,null,null,null,null,null,null,null,null,null,null,null,null,null,null,null,null,null,null,null,null,null,null,null,null,null,null,null,null,null,null,null,null,null,null,null,null,null,null,null,null,null,null,null,null,null,null,null,null,null,null,null,null,null,null,null,null,null,null,null,null,null,null,null,null,null,null,null,null,null,null,null,null,null,null,null,null,null,null,null,null,null,null,null,null,null,null,null,null,null,null,null,null,null,null,null,null,null,null,null,null,null,null,null,null,null,null,null,null,null,null,null,null,null,null,null,null,null,null,null,null,null,null,null,null,null,null,null,null,null,null,null,null,null,null,null,null,null,null,null,null,null,null,null,null,null,null,null,null,null,null,null,null,null,null,null,null,null,null,null,null,null,null,null,null,null,null,null,null,null,null,null,null,null,null,null,null,null,null,null,null,null,null,null,null,null,null,null,null,null,null,null,null,null,null,null,null,null,null,null,null,null,null,null,null,null,null,null,null,null,null,null,null,null,null,null,null,null,null,null,null,null,null,null,null,"The Council of Europe Development Bank",0,null,null,4,{"$f":"SUMIF('Sheet 1'!K172:K179,'Sheet 1'!SZ127,'Sheet 1'!D172:D179)","v":0},"0"]
[null,null,null,null,null,null,null,null,null,null,null,null,null,null,null,null,null,null,null,null,null,null,null,null,null,null,null,null,null,null,0,0,null,null,null,null,"USA",null,null,null,null,null,null,null,null,null,null,null,null,null,null,null,null,null,null,null,null,null,null,null,null,null,null,null,null,null,null,null,null,null,null,null,null,null,null,null,null,null,null,null,null,null,null,null,null,null,null,null,null,null,null,null,null,null,null,null,null,null,null,null,null,null,null,null,null,null,null,null,null,null,null,null,null,null,null,null,null,null,null,null,null,null,null,null,null,null,null,null,null,null,null,null,null,null,null,null,null,null,null,null,null,null,null,null,null,null,null,null,null,null,null,null,null,null,null,null,null,null,null,null,null,null,null,null,null,null,null,null,null,null,null,null,null,null,null,null,null,null,null,null,null,null,null,null,null,null,null,null,null,null,null,null,null,null,null,null,null,null,null,null,null,null,null,null,null,null,null,null,null,null,null,null,null,null,null,null,null,null,null,null,null,null,null,null,null,null,null,null,null,null,null,null,null,null,null,null,null,null,null,null,null,null,null,null,null,null,null,null,null,null,null,null,null,null,null,null,null,null,null,null,null,null,null,null,null,null,null,null,null,null,null,null,null,null,null,null,null,null,null,null,null,null,null,null,null,null,null,null,null,null,null,null,null,null,null,null,null,null,null,null,null,null,null,null,null,null,null,null,null,null,null,null,null,null,null,null,null,null,null,null,null,null,null,null,null,null,null,null,null,null,null,null,null,null,null,null,null,null,null,null,null,null,null,null,null,null,null,null,null,null,null,null,null,null,null,null,null,null,null,null,null,null,null,null,null,null,null,null,null,null,null,null,null,null,null,null,null,null,null,null,null,null,null,null,null,null,null,null,null,null,null,null,null,null,null,null,null,null,null,null,null,null,null,null,null,null,null,null,null,null,null,null,null,null,null,null,null,null,null,null,null,null,null,null,null,null,null,null,null,null,null,null,null,null,null,null,null,null,null,null,null,null,null,null,null,null,null,null,null,null,null,null,null,null,null,null,null,null,null,null,null,null,null,null,null,null,null,null,null,null,null,null,null,null,null,null,null,null,null,null,null,null,null,null,null,null,null,null,null,null,null,null,null,null,null,null,null,null,null,null,null,null,null,null,null,null,null,null,null,null,null,null,null,null,null,"The Nordic Investment Bank",0,null,null,5,{"$f":"SUMIF('Sheet 1'!K172:K179,'Sheet 1'!SZ128,'Sheet 1'!D172:D179)","v":0},"0"]
[null,null,null,null,null,null,null,null,null,null,null,null,null,null,null,null,null,null,null,null,null,null,null,null,null,null,null,null,null,null,0,0,null,null,null,null,"Other",null,null,null,null,null,null,null,null,null,null,null,null,null,null,null,null,null,null,null,null,null,null,null,null,null,null,null,null,null,null,null,null,null,null,null,null,null,null,null,null,null,null,null,null,null,null,null,null,null,null,null,null,null,null,null,null,null,null,null,null,null,null,null,null,null,null,null,null,null,null,null,null,null,null,null,null,null,null,null,null,null,null,null,null,null,null,null,null,null,null,null,null,null,null,null,null,null,null,null,null,null,null,null,null,null,null,null,null,null,null,null,null,null,null,null,null,null,null,null,null,null,null,null,null,null,null,null,null,null,null,null,null,null,null,null,null,null,null,null,null,null,null,null,null,null,null,null,null,null,null,null,null,null,null,null,null,null,null,null,null,null,null,null,null,null,null,null,null,null,null,null,null,null,null,null,null,null,null,null,null,null,null,null,null,null,null,null,null,null,null,null,null,null,null,null,null,null,null,null,null,null,null,null,null,null,null,null,null,null,null,null,null,null,null,null,null,null,null,null,null,null,null,null,null,null,null,null,null,null,null,null,null,null,null,null,null,null,null,null,null,null,null,null,null,null,null,null,null,null,null,null,null,null,null,null,null,null,null,null,null,null,null,null,null,null,null,null,null,null,null,null,null,null,null,null,null,null,null,null,null,null,null,null,null,null,null,null,null,null,null,null,null,null,null,null,null,null,null,null,null,null,null,null,null,null,null,null,null,null,null,null,null,null,null,null,null,null,null,null,null,null,null,null,null,null,null,null,null,null,null,null,null,null,null,null,null,null,null,null,null,null,null,null,null,null,null,null,null,null,null,null,null,null,null,null,null,null,null,null,null,null,null,null,null,null,null,null,null,null,null,null,null,null,null,null,null,null,null,null,null,null,null,null,null,null,null,null,null,null,null,null,null,null,null,null,null,null,null,null,null,null,null,null,null,null,null,null,null,null,null,null,null,null,null,null,null,null,null,null,null,null,null,null,null,null,null,null,null,null,null,null,null,null,null,null,null,null,null,null,null,null,null,null,null,null,null,null,null,null,null,null,null,null,null,null,null,null,null,null,null,null,null,null,null,null,null,null,null,null,null,null,null,null,null,null,null,null,null,"The Caribbean Development Bank",0,null,null,6,{"$f":"SUMIF('Sheet 1'!K172:K179,'Sheet 1'!SZ129,'Sheet 1'!D172:D179)","v":0},"0"]
[null,null,null,null,null,null,null,null,null,null,null,null,null,null,null,null,null,null,null,null,null,null,null,null,null,null,null,null,null,null,0,0,null,null,null,null,null,null,null,null,null,null,null,null,null,null,null,null,null,null,null,null,null,null,null,null,null,null,null,null,null,null,null,null,null,null,null,null,null,null,null,null,null,null,null,null,null,null,null,null,null,null,null,null,null,null,null,null,null,null,null,null,null,null,null,null,null,null,null,null,null,null,null,null,null,null,null,null,null,null,null,null,null,null,null,null,null,null,null,null,null,null,null,null,null,null,null,null,null,null,null,null,null,null,null,null,null,null,null,null,null,null,null,null,null,null,null,null,null,null,null,null,null,null,null,null,null,null,null,null,null,null,null,null,null,null,null,null,null,null,null,null,null,null,null,null,null,null,null,null,null,null,null,null,null,null,null,null,null,null,null,null,null,null,null,null,null,null,null,null,null,null,null,null,null,null,null,null,null,null,null,null,null,null,null,null,null,null,null,null,null,null,null,null,null,null,null,null,null,null,null,null,null,null,null,null,null,null,null,null,null,null,null,null,null,null,null,null,null,null,null,null,null,null,null,null,null,null,null,null,null,null,null,null,null,null,null,null,null,null,null,null,null,null,null,null,null,null,null,null,null,null,null,null,null,null,null,null,null,null,null,null,null,null,null,null,null,null,null,null,null,null,null,null,null,null,null,null,null,null,null,null,null,null,null,null,null,null,null,null,null,null,null,null,null,null,null,null,null,null,null,null,null,null,null,null,null,null,null,null,null,null,null,null,null,null,null,null,null,null,null,null,null,null,null,null,null,null,null,null,null,null,null,null,null,null,null,null,null,null,null,null,null,null,null,null,null,null,null,null,null,null,null,null,null,null,null,null,null,null,null,null,null,null,null,null,null,null,null,null,null,null,null,null,null,null,null,null,null,null,null,null,null,null,null,null,null,null,null,null,null,null,null,null,null,null,null,null,null,null,null,null,null,null,null,null,null,null,null,null,null,null,null,null,null,null,null,null,null,null,null,null,null,null,null,null,null,null,null,null,null,null,null,null,null,null,null,null,null,null,null,null,null,null,null,null,null,null,null,null,null,null,null,null,null,null,null,null,null,null,null,null,null,null,null,null,null,null,null,null,null,null,null,null,null,null,null,null,null,null,null,null,null,null,null,"The European Bank for Reconstruction and Development",0,null,null,"unrated",{"$f":"SUMIF('Sheet 1'!K172:K179,'Sheet 1'!SZ130,'Sheet 1'!D172:D179)-TC131","v":0},"0"]
[null,null,null,null,null,null,null,null,null,null,null,null,null,null,null,null,null,null,null,null,null,null,null,null,null,null,null,null,null,null,0,0,null,null,null,null,null,null,null,null,null,null,null,null,null,null,null,null,null,null,null,null,null,null,null,null,null,null,null,null,null,null,null,null,null,null,null,null,null,null,null,null,null,null,null,null,null,null,null,null,null,null,null,null,null,null,null,null,null,null,null,null,null,null,null,null,null,null,null,null,null,null,null,null,null,null,null,null,null,null,null,null,null,null,null,null,null,null,null,null,null,null,null,null,null,null,null,null,null,null,null,null,null,null,null,null,null,null,null,null,null,null,null,null,null,null,null,null,null,null,null,null,null,null,null,null,null,null,null,null,null,null,null,null,null,null,null,null,null,null,null,null,null,null,null,null,null,null,null,null,null,null,null,null,null,null,null,null,null,null,null,null,null,null,null,null,null,null,null,null,null,null,null,null,null,null,null,null,null,null,null,null,null,null,null,null,null,null,null,null,null,null,null,null,null,null,null,null,null,null,null,null,null,null,null,null,null,null,null,null,null,null,null,null,null,null,null,null,null,null,null,null,null,null,null,null,null,null,null,null,null,null,null,null,null,null,null,null,null,null,null,null,null,null,null,null,null,null,null,null,null,null,null,null,null,null,null,null,null,null,null,null,null,null,null,null,null,null,null,null,null,null,null,null,null,null,null,null,null,null,null,null,null,null,null,null,null,null,null,null,null,null,null,null,null,null,null,null,null,null,null,null,null,null,null,null,null,null,null,null,null,null,null,null,null,null,null,null,null,null,null,null,null,null,null,null,null,null,null,null,null,null,null,null,null,null,null,null,null,null,null,null,null,null,null,null,null,null,null,null,null,null,null,null,null,null,null,null,null,null,null,null,null,null,null,null,null,null,null,null,null,null,null,null,null,null,null,null,null,null,null,null,null,null,null,null,null,null,null,null,null,null,null,null,null,null,null,null,null,null,null,null,null,null,null,null,null,null,null,null,null,null,null,null,null,null,null,null,null,null,null,null,null,null,null,null,null,null,null,null,null,null,null,null,null,null,null,null,null,null,null,null,null,null,null,null,null,null,null,null,null,null,null,null,null,null,null,null,null,null,null,null,null,null,null,null,null,null,null,null,null,null,null,null,null,null,null,null,null,null,null,null,null,null,null,"The European Investment Bank",0,null,null,"unr and <3",{"$f":"TC131","v":0},"0",{"$f":"SUM(TB124:TB131)","v":0}]
[null,null,null,null,null,null,null,null,null,null,null,null,null,null,null,null,null,null,null,null,null,null,null,null,null,null,null,null,null,null,0,0,null,null,null,null,null,null,null,null,null,null,null,null,null,null,null,null,null,null,null,null,null,null,null,null,null,null,null,null,null,null,null,null,null,null,null,null,null,null,null,null,null,null,null,null,null,null,null,null,null,null,null,null,null,null,null,null,null,null,null,null,null,null,null,null,null,null,null,null,null,null,null,null,null,null,null,null,null,null,null,null,null,null,null,null,null,null,null,null,null,null,null,null,null,null,null,null,null,null,null,null,null,null,null,null,null,null,null,null,null,null,null,null,null,null,null,null,null,null,null,null,null,null,null,null,null,null,null,null,null,null,null,null,null,null,null,null,null,null,null,null,null,null,null,null,null,null,null,null,null,null,null,null,null,null,null,null,null,null,null,null,null,null,null,null,null,null,null,null,null,null,null,null,null,null,null,null,null,null,null,null,null,null,null,null,null,null,null,null,null,null,null,null,null,null,null,null,null,null,null,null,null,null,null,null,null,null,null,null,null,null,null,null,null,null,null,null,null,null,null,null,null,null,null,null,null,null,null,null,null,null,null,null,null,null,null,null,null,null,null,null,null,null,null,null,null,null,null,null,null,null,null,null,null,null,null,null,null,null,null,null,null,null,null,null,null,null,null,null,null,null,null,null,null,null,null,null,null,null,null,null,null,null,null,null,null,null,null,null,null,null,null,null,null,null,null,null,null,null,null,null,null,null,null,null,null,null,null,null,null,null,null,null,null,null,null,null,null,null,null,null,null,null,null,null,null,null,null,null,null,null,null,null,null,null,null,null,null,null,null,null,null,null,null,null,null,null,null,null,null,null,null,null,null,null,null,null,null,null,null,null,null,null,null,null,null,null,null,null,null,null,null,null,null,null,null,null,null,null,null,null,null,null,null,null,null,null,null,null,null,null,null,null,null,null,null,null,null,null,null,null,null,null,null,null,null,null,null,null,null,null,null,null,null,null,null,null,null,null,null,null,null,null,null,null,null,null,null,null,null,null,null,null,null,null,null,null,null,null,null,null,null,null,null,null,null,null,null,null,null,null,null,null,null,null,null,null,null,null,null,null,null,null,null,null,null,null,null,null,null,null,null,null,null,null,null,null,null,null,null,null,null,null,null,"The European Investment Fund",0]
[null,null,null,null,null,null,null,null,null,null,null,null,null,null,null,null,null,null,null,null,null,null,null,null,null,null,null,null,null,null,0,0,null,null,null,null,null,null,null,null,null,null,null,null,null,null,null,null,null,null,null,null,null,null,null,null,null,null,null,null,null,null,null,null,null,null,null,null,null,null,null,null,null,null,null,null,null,null,null,null,null,null,null,null,null,null,null,null,null,null,null,null,null,null,null,null,null,null,null,null,null,null,null,null,null,null,null,null,null,null,null,null,null,null,null,null,null,null,null,null,null,null,null,null,null,null,null,null,null,null,null,null,null,null,null,null,null,null,null,null,null,null,null,null,null,null,null,null,null,null,null,null,null,null,null,null,null,null,null,null,null,null,null,null,null,null,null,null,null,null,null,null,null,null,null,null,null,null,null,null,null,null,null,null,null,null,null,null,null,null,null,null,null,null,null,null,null,null,null,null,null,null,null,null,null,null,null,null,null,null,null,null,null,null,null,null,null,null,null,null,null,null,null,null,null,null,null,null,null,null,null,null,null,null,null,null,null,null,null,null,null,null,null,null,null,null,null,null,null,null,null,null,null,null,null,null,null,null,null,null,null,null,null,null,null,null,null,null,null,null,null,null,null,null,null,null,null,null,null,null,null,null,null,null,null,null,null,null,null,null,null,null,null,null,null,null,null,null,null,null,null,null,null,null,null,null,null,null,null,null,null,null,null,null,null,null,null,null,null,null,null,null,null,null,null,null,null,null,null,null,null,null,null,null,null,null,null,null,null,null,null,null,null,null,null,null,null,null,null,null,null,null,null,null,null,null,null,null,null,null,null,null,null,null,null,null,null,null,null,null,null,null,null,null,null,null,null,null,null,null,null,null,null,null,null,null,null,null,null,null,null,null,null,null,null,null,null,null,null,null,null,null,null,null,null,null,null,null,null,null,null,null,null,null,null,null,null,null,null,null,null,null,null,null,null,null,null,null,null,null,null,null,null,null,null,null,null,null,null,null,null,null,null,null,null,null,null,null,null,null,null,null,null,null,null,null,null,null,null,null,null,null,null,null,null,null,null,null,null,null,null,null,null,null,null,null,null,null,null,null,null,null,null,null,null,null,null,null,null,null,null,null,null,null,null,null,null,null,null,null,null,null,null,null,null,null,null,null,null,null,null,null,null,null,null,"The Multilateral Investment Guarantee Agency",0]
[null,null,null,null,null,null,null,null,null,null,null,null,null,null,null,null,null,null,null,null,null,null,null,null,null,null,null,null,null,null,0,0,null,null,null,null,null,null,null,null,null,null,null,null,null,null,null,null,null,null,null,null,null,null,null,null,null,null,null,null,null,null,null,null,null,null,null,null,null,null,null,null,null,null,null,null,null,null,null,null,null,null,null,null,null,null,null,null,null,null,null,null,null,null,null,null,null,null,null,null,null,null,null,null,null,null,null,null,null,null,null,null,null,null,null,null,null,null,null,null,null,null,null,null,null,null,null,null,null,null,null,null,null,null,null,null,null,null,null,null,null,null,null,null,null,null,null,null,null,null,null,null,null,null,null,null,null,null,null,null,null,null,null,null,null,null,null,null,null,null,null,null,null,null,null,null,null,null,null,null,null,null,null,null,null,null,null,null,null,null,null,null,null,null,null,null,null,null,null,null,null,null,null,null,null,null,null,null,null,null,null,null,null,null,null,null,null,null,null,null,null,null,null,null,null,null,null,null,null,null,null,null,null,null,null,null,null,null,null,null,null,null,null,null,null,null,null,null,null,null,null,null,null,null,null,null,null,null,null,null,null,null,null,null,null,null,null,null,null,null,null,null,null,null,null,null,null,null,null,null,null,null,null,null,null,null,null,null,null,null,null,null,null,null,null,null,null,null,null,null,null,null,null,null,null,null,null,null,null,null,null,null,null,null,null,null,null,null,null,null,null,null,null,null,null,null,null,null,null,null,null,null,null,null,null,null,null,null,null,null,null,null,null,null,null,null,null,null,null,null,null,null,null,null,null,null,null,null,null,null,null,null,null,null,null,null,null,null,null,null,null,null,null,null,null,null,null,null,null,null,null,null,null,null,null,null,null,null,null,null,null,null,null,null,null,null,null,null,null,null,null,null,null,null,null,null,null,null,null,null,null,null,null,null,null,null,null,null,null,null,null,null,null,null,null,null,null,null,null,null,null,null,null,null,null,null,null,null,null,null,null,null,null,null,null,null,null,null,null,null,null,null,null,null,null,null,null,null,null,null,null,null,null,null,null,null,null,null,null,null,null,null,null,null,null,null,null,null,null,null,null,null,null,null,null,null,null,null,null,null,null,null,null,null,null,null,null,null,null,null,null,null,null,null,null,null,null,null,null,null,null,null,null,null,null,"The International Finance Facility for Immunisation",0]
[null,null,null,null,null,null,null,null,null,null,null,null,null,null,null,null,null,null,null,null,null,null,null,null,null,null,null,null,null,null,0,0,null,null,null,null,null,null,null,null,null,null,null,null,null,null,null,null,null,null,null,null,null,null,null,null,null,null,null,null,null,null,null,null,null,null,null,null,null,null,null,null,null,null,null,null,null,null,null,null,null,null,null,null,null,null,null,null,null,null,null,null,null,null,null,null,null,null,null,null,null,null,null,null,null,null,null,null,null,null,null,null,null,null,null,null,null,null,null,null,null,null,null,null,null,null,null,null,null,null,null,null,null,null,null,null,null,null,null,null,null,null,null,null,null,null,null,null,null,null,null,null,null,null,null,null,null,null,null,null,null,null,null,null,null,null,null,null,null,null,null,null,null,null,null,null,null,null,null,null,null,null,null,null,null,null,null,null,null,null,null,null,null,null,null,null,null,null,null,null,null,null,null,null,null,null,null,null,null,null,null,null,null,null,null,null,null,null,null,null,null,null,null,null,null,null,null,null,null,null,null,null,null,null,null,null,null,null,null,null,null,null,null,null,null,null,null,null,null,null,null,null,null,null,null,null,null,null,null,null,null,null,null,null,null,null,null,null,null,null,null,null,null,null,null,null,null,null,null,null,null,null,null,null,null,null,null,null,null,null,null,null,null,null,null,null,null,null,null,null,null,null,null,null,null,null,null,null,null,null,null,null,null,null,null,null,null,null,null,null,null,null,null,null,null,null,null,null,null,null,null,null,null,null,null,null,null,null,null,null,null,null,null,null,null,null,null,null,null,null,null,null,null,null,null,null,null,null,null,null,null,null,null,null,null,null,null,null,null,null,null,null,null,null,null,null,null,null,null,null,null,null,null,null,null,null,null,null,null,null,null,null,null,null,null,null,null,null,null,null,null,null,null,null,null,null,null,null,null,null,null,null,null,null,null,null,null,null,null,null,null,null,null,null,null,null,null,null,null,null,null,null,null,null,null,null,null,null,null,null,null,null,null,null,null,null,null,null,null,null,null,null,null,null,null,null,null,null,null,null,null,null,null,null,null,null,null,null,null,null,null,null,null,null,null,null,null,null,null,null,null,null,null,null,null,null,null,null,null,null,null,null,null,null,null,null,null,null,null,null,null,null,null,null,null,null,null,null,null,null,null,null,null,null,null,"The Islamic Development Bank",0]
[null,null,null,null,null,null,null,null,null,null,null,null,null,null,null,null,null,null,null,null,null,null,null,null,null,null,null,null,null,null,0,0,null,null,null,null,null,null,null,null,null,null,null,null,null,null,null,null,null,null,null,null,null,null,null,null,null,null,null,null,null,null,null,null,null,null,null,null,null,null,null,null,null,null,null,null,null,null,null,null,null,null,null,null,null,null,null,null,null,null,null,null,null,null,null,null,null,null,null,null,null,null,null,null,null,null,null,null,null,null,null,null,null,null,null,null,null,null,null,null,null,null,null,null,null,null,null,null,null,null,null,null,null,null,null,null,null,null,null,null,null,null,null,null,null,null,null,null,null,null,null,null,null,null,null,null,null,null,null,null,null,null,null,null,null,null,null,null,null,null,null,null,null,null,null,null,null,null,null,null,null,null,null,null,null,null,null,null,null,null,null,null,null,null,null,null,null,null,null,null,null,null,null,null,null,null,null,null,null,null,null,null,null,null,null,null,null,null,null,null,null,null,null,null,null,null,null,null,null,null,null,null,null,null,null,null,null,null,null,null,null,null,null,null,null,null,null,null,null,null,null,null,null,null,null,null,null,null,null,null,null,null,null,null,null,null,null,null,null,null,null,null,null,null,null,null,null,null,null,null,null,null,null,null,null,null,null,null,null,null,null,null,null,null,null,null,null,null,null,null,null,null,null,null,null,null,null,null,null,null,null,null,null,null,null,null,null,null,null,null,null,null,null,null,null,null,null,null,null,null,null,null,null,null,null,null,null,null,null,null,null,null,null,null,null,null,null,null,null,null,null,null,null,null,null,null,null,null,null,null,null,null,null,null,null,null,null,null,null,null,null,null,null,null,null,null,null,null,null,null,null,null,null,null,null,null,null,null,null,null,null,null,null,null,null,null,null,null,null,null,null,null,null,null,null,null,null,null,null,null,null,null,null,null,null,null,null,null,null,null,null,null,null,null,null,null,null,null,null,null,null,null,null,null,null,null,null,null,null,null,null,null,null,null,null,null,null,null,null,null,null,null,null,null,null,null,null,null,null,null,null,null,null,null,null,null,null,null,null,null,null,null,null,null,null,null,null,null,null,null,null,null,null,null,null,null,null,null,null,null,null,null,null,null,null,null,null,null,null,null,null,null,null,null,null,null,null,null,null,null,null,null,null,null,null,"Other","N/A"]
[null,null,null,null,null,null,null,null,null,null,null,null,null,null,null,null,null,null,null,null,null,null,null,null,null,null,null,null,null,null,0,0]
[null,null,null,null,null,null,null,null,null,null,null,null,null,null,null,null,null,null,null,null,null,null,null,null,null,null,null,null,null,null,0,0]
[null,null,null,null,null,null,null,null,null,null,null,null,null,null,null,null,null,null,null,null,null,null,null,null,null,null,null,null,null,null,0,0]
[null,null,null,null,null,null,null,null,null,null,null,null,null,null,null,null,null,null,null,null,null,null,null,null,null,null,null,null,null,null,0,0]
[null,null,null,null,null,null,null,null,null,null,null,null,null,null,null,null,null,null,null,null,null,null,null,null,null,null,null,null,null,null,0,0]
[null,null,null,null,null,null,null,null,null,null,null,null,null,null,null,null,null,null,null,null,null,null,null,null,null,null,null,null,null,null,0,0]
[null,null,null,null,null,null,null,null,null,null,null,null,null,null,null,null,null,null,null,null,null,null,null,null,null,null,null,null,null,null,0,0]
[null,null,null,null,null,null,null,null,null,null,null,null,null,null,null,null,null,null,null,null,null,null,null,null,null,null,null,null,null,null,0,0]
[null,null,null,null,null,null,null,null,null,null,null,null,null,null,null,null,null,null,null,null,null,null,null,null,null,null,null,null,null,null,0,0]
[null,null,null,null,null,null,null,null,null,null,null,null,null,null,null,null,null,null,null,null,null,null,null,null,null,null,null,null,null,null,0,0]
[null,null,null,null,null,null,null,null,null,null,null,null,null,null,null,null,null,null,null,null,null,null,null,null,null,null,null,null,null,null,0,0]
[null,null,null,null,null,null,null,null,null,null,null,null,null,null,null,null,null,null,null,null,null,null,null,null,null,null,null,null,null,null,0,0]
[null,null,null,null,null,null,null,null,null,null,null,null,null,null,null,null,null,null,null,null,null,null,null,null,null,null,null,null,null,null,0,0]
[null,null,null,null,null,null,null,null,null,null,null,null,null,null,null,null,null,null,null,null,null,null,null,null,null,null,null,null,null,null,0,0]
[null,null,null,null,null,null,null,null,null,null,null,null,null,null,null,null,null,null,null,null,null,null,null,null,null,null,null,null,null,null,0,0]
[null,null,null,null,null,null,null,null,null,null,null,null,null,null,null,null,null,null,null,null,null,null,null,null,null,null,null,null,null,null,0,0]
[null,"ii) Exposures to Regional Governments or Local Authorities ",null,null,null,null,null,null,null,null,null,null,null,null,{"$f":"IF(G221<0,G221,0)","v":0},null,null,null,null,null,null,null,null,null,null,null,null,null,null,null,0,0]
[null,"Treated as Central Government",null,null,null,null,null,null,null,null,null,null,null,null,0,null,null,null,null,null,null,null,null,null,null,null,null,null,null,null,0,0]
[null,null,null,null,null,null,null,null,null,null,null,null,null,null,0,null,null,null,null,null,null,null,null,null,null,null,null,null,null,null,0,0]
[null,null,null,null,null,null,null,null,null,null,null,null,null,null,0,null,null,null,null,null,null,null,null,null,null,null,null,null,null,null,{"$f":"IF(D156>0,D156,0)","v":0},{"$f":"IF(D156<0,D156,0)","v":0}]
[null,null,null,null,null,null,null,null,null,null,null,null,null,null,0,null,null,null,null,null,null,null,null,null,null,null,null,null,null,null,0,0]
[null,"Treated as Institutions",null,null,null,null,null,null,null,null,null,null,null,null,0,null,null,null,null,null,null,null,null,null,null,null,null,null,null,null,0,0]
[null,null,null,null,null,null,null,null,null,null,null,null,null,null,0,null,null,null,null,null,null,null,null,null,null,null,null,null,null,null,0,0]
[null,null,null,null,null,null,null,null,null,null,null,null,null,null,0,null,null,null,null,null,null,null,null,null,null,null,null,null,null,null,0,0]
[null,null,null,null,null,null,null,null,null,null,null,null,null,null,null,null,null,null,null,null,null,null,null,null,null,null,null,null,null,null,0,0]
[null,"iii) Exposures to Public Sector Entities",null,null,null,null,null,null,null,null,null,null,null,null,{"$f":"IF(G230<0,G230,0)","v":0},null,null,null,null,null,null,null,null,null,null,null,null,null,null,null,0,0]
[null,null,null,null,null,null,null,null,null,null,null,null,null,null,{"$f":"IF(G231<0,G231,0)","v":0},null,null,null,null,null,null,null,null,null,null,null,null,null,null,null,0,0]
[null,null,null,null,null,null,null,null,null,null,null,null,null,null,{"$f":"IF(G232<0,G232,0)","v":0},null,null,null,null,null,null,null,null,null,null,null,null,null,null,null,0,0]
[null,null,null,null,null,null,null,null,null,null,null,null,null,null,{"$f":"IF(G233<0,G233,0)","v":0},null,null,null,null,null,null,null,null,null,null,null,null,null,null,null,0,0]
[null,null,null,null,null,null,null,null,null,null,null,null,null,null,{"$f":"IF(G234<0,G234,0)","v":0},null,null,null,null,null,null,null,null,null,null,null,null,null,null,null,0,0]
[null,null,null,null,null,null,null,null,null,null,null,null,null,null,null,null,null,null,null,null,null,null,null,null,null,null,null,null,null,null,0,0]
[null,null,null,null,null,null,null,null,null,null,null,null,null,null,null,null,null,null,null,null,null,null,null,null,null,null,null,null,null,null,0,0]
[null,null,null,null,null,null,null,null,null,null,null,null,null,null,null,null,null,null,null,null,null,null,null,null,null,null,null,null,null,null,0,0]
[null,null,null,null,null,null,null,null,null,null,null,null,null,null,null,null,null,null,null,null,null,null,null,null,null,null,null,null,null,null,0,0]
[null,"iv) Exposures to Multilateral Development Banks",null,null,null,null,null,null,null,null,null,null,null,null,null,null,null,null,null,null,null,null,null,null,null,null,null,null,null,null,0,0]
[null,null,null,null,null,null,null,null,null,null,null,null,null,null,null,null,null,null,null,null,null,null,null,null,null,null,null,null,null,null,0,0]
[null,null,null,null,null,null,null,null,null,null,null,null,null,null,null,null,null,null,null,null,null,null,null,null,null,null,null,null,null,null,0,0]
[null,null,null,null,null,null,null,null,null,null,null,null,null,null,null,null,null,null,null,null,null,null,null,null,null,null,null,null,null,null,0,0]
[null,null,null,null,null,null,null,null,null,null,null,null,null,null,null,null,null,null,null,null,null,null,null,null,null,null,null,null,null,null,0,0]
[null,null,null,null,null,null,null,null,null,null,null,null,null,null,null,null,null,null,null,null,null,null,null,null,null,null,null,null,null,null,0,0]
[null,null,null,null,null,null,null,null,null,null,null,null,null,null,null,null,null,null,null,null,null,null,null,null,null,null,null,null,null,null,0,0]
[null,null,null,null,null,null,null,null,null,null,null,null,null,null,null,null,null,null,null,null,null,null,null,null,null,null,null,null,null,null,0,0]
[null,null,null,null,null,null,null,null,null,null,null,null,null,null,null,null,null,null,null,null,null,null,null,null,null,null,null,null,null,null,0,0]
[null,"v) Exposures to International Organisations:",null,null,null,null,null,null,null,null,null,null,null,null,null,null,null,null,null,null,null,null,null,null,null,null,null,null,null,null,0,0]
[null,null,null,null,null,null,null,null,null,null,null,null,null,null,null,null,null,null,null,null,null,null,null,null,null,null,null,null,null,null,0,0]
[null,null,null,null,null,null,null,null,null,null,null,null,null,null,null,null,null,null,null,null,null,null,null,null,null,null,null,null,null,null,0,0]
[null,null,null,null,null,null,null,null,null,null,null,null,null,null,null,null,null,null,null,null,null,null,null,null,null,null,null,null,null,null,0,0]
[null,null,null,null,null,null,null,null,null,null,null,null,null,null,null,null,null,null,null,null,null,null,null,null,null,null,null,null,null,null,0,0]
[null,null,null,null,null,null,null,null,null,null,null,null,null,null,null,null,null,null,null,null,null,null,null,null,null,null,null,null,null,null,0,0]
[null,null,null,null,null,null,null,null,null,null,null,null,null,null,null,null,null,null,null,null,null,null,null,null,null,null,null,null,null,null,0,0]
[null,"vi) Exposures to Rated Institutions",null,null,null,null,null,null,null,null,null,null,null,null,null,null,null,null,null,null,null,null,null,null,null,null,null,null,null,null,0,0]
[null,null,null,null,null,null,null,null,null,null,null,null,null,null,null,null,null,null,null,null,null,null,null,null,null,null,null,null,null,null,0,0]
[null,null,null,null,null,null,null,null,null,null,null,null,null,null,null,null,null,null,null,null,null,null,null,null,null,null,null,null,null,null,0,0]
[null,null,null,null,null,null,null,null,null,null,null,null,null,null,null,null,null,null,null,null,null,null,null,null,null,null,null,null,null,null,0,0]
[null,null,null,null,null,null,null,null,null,null,null,null,null,null,null,null,null,null,null,null,null,null,null,null,null,null,null,null,null,null,0,0]
[null,null,null,null,null,null,null,null,null,null,null,null,null,null,null,null,null,null,null,null,null,null,null,null,null,null,null,null,null,null,0,0]
[null,null,null,null,null,null,null,null,null,null,null,null,null,null,null,null,null,null,null,null,null,null,null,null,null,null,null,null,null,null,0,0]
[null,null,null,null,null,null,null,null,null,null,null,null,null,null,null,null,null,null,null,null,null,null,null,null,null,null,null,null,null,null,0,0]
[null,null,null,null,null,null,null,null,null,null,null,null,null,null,null,null,null,null,null,null,null,null,null,null,null,null,null,null,null,null,0,0]
[null,null,null,null,null,null,null,null,null,null,null,null,null,null,{"$f":"IF(#REF!<0,#REF!,0)","v":{"$error":"#REF!"}},null,null,null,null,null,null,null,null,null,null,null,null,null,null,null,0,0]
[null,null,null,null,null,null,null,null,null,null,null,null,null,null,null,null,null,null,null,null,null,null,null,null,null,null,null,null,null,null,0,0]
[null,"vii) Exposures to Unrated Institutions",null,null,null,null,null,null,null,null,null,null,null,null,null,null,null,null,null,null,null,null,null,null,null,null,null,null,null,null,{"$f":"IF(D198>0,D198,0)","v":0},{"$f":"IF(D198<0,D198,0)","v":0}]
[null,null,null,null,null,null,null,null,null,null,null,null,null,null,null,null,null,null,null,null,null,null,null,null,null,null,null,null,null,null,0,0]
[null,null,null,null,null,null,null,null,null,null,null,null,null,null,null,null,null,null,null,null,null,null,null,null,null,null,null,null,null,null,0,0]
[null,null,null,null,null,null,null,null,null,null,null,null,null,null,null,null,null,null,null,null,null,null,null,null,null,null,null,null,null,null,0,0]
[null,null,null,null,null,null,null,null,null,null,null,null,null,null,null,null,null,null,null,null,null,null,null,null,null,null,null,null,null,null,0,0]
[null,null,null,null,null,null,null,null,null,null,null,null,null,null,null,null,null,null,null,null,null,null,null,null,null,null,null,null,null,null,0,0]
[null,null,null,null,null,null,null,null,null,null,null,null,null,null,null,null,null,null,null,null,null,null,null,null,null,null,null,null,null,null,0,0]
[null,null,null,null,null,null,null,null,null,null,null,null,null,null,null,null,null,null,null,null,null,null,null,null,null,null,null,null,null,null,0,0]
[null,null,null,null,null,null,null,null,null,null,null,null,null,null,null,null,null,null,null,null,null,null,null,null,null,null,null,null,null,null,0,0]
[null,null,null,null,null,null,null,null,null,null,null,null,null,null,null,null,null,null,null,null,null,null,null,null,null,null,null,null,null,null,0,0]
[null,null,null,null,null,null,null,null,null,null,null,null,null,null,null,null,null,null,null,null,null,null,null,null,null,null,null,null,null,null,0,0]
[null,"viii) Exposures to Corporates",null,null,null,null,null,null,null,null,null,null,null,null,null,null,null,null,null,null,null,null,null,null,null,null,null,null,null,null,{"$f":"IF(D209>0,D209,0)","v":0},{"$f":"IF(D209<0,D209,0)","v":0}]
[null,null,null,null,null,null,null,null,null,null,null,null,null,null,null,null,null,null,null,null,null,null,null,null,null,null,null,null,null,null,0,0]
[null,null,null,null,null,null,null,null,null,null,null,null,null,null,null,null,null,null,null,null,null,null,null,null,null,null,null,null,null,null,0,0]
[null,null,null,null,null,null,null,null,null,null,null,null,null,null,null,null,null,null,null,null,null,null,null,null,null,null,null,null,null,null,0,0]
[null,null,null,null,null,null,null,null,null,null,null,null,null,null,null,null,null,null,null,null,null,null,null,null,null,null,null,null,null,null,0,0]
[null,null,null,null,null,null,null,null,null,null,null,null,null,null,null,null,null,null,null,null,null,null,null,null,null,null,null,null,null,null,0,0]
[null,null,null,null,null,null,null,null,null,null,null,null,null,null,null,null,null,null,null,null,null,null,null,null,null,null,null,null,null,null,0,0]
[null,null,null,null,null,null,null,null,null,null,null,null,null,null,null,null,null,null,null,null,null,null,null,null,null,null,null,null,null,null,0,0]
[null,null,null,null,null,null,null,null,null,null,null,null,null,null,null,null,null,null,null,null,null,null,null,null,null,null,null,null,null,null,0,0]
[null,null,null,null,null,null,null,null,null,null,null,null,null,null,null,null,null,null,null,null,null,null,null,null,null,null,null,null,null,null,0,0]
[null,null,null,null,null,null,null,null,null,null,null,null,null,null,null,null,null,null,null,null,null,null,null,null,null,null,null,null,null,null,0,0]
[null,"ix) Retail Exposures",null,null,null,null,null,null,null,null,null,null,null,null,null,null,null,null,null,null,null,null,null,null,null,null,null,null,null,null,{"$f":"IF(D220>0,D220,0)","v":0},{"$f":"IF(D220<0,D220,0)","v":0}]
[null,null,null,null,null,null,null,null,null,null,null,null,null,null,null,null,null,null,null,null,null,null,null,null,null,null,null,null,null,null,0,0]
[null,null,null,null,null,null,null,null,null,null,null,null,null,null,null,null,null,null,null,null,null,null,null,null,null,null,null,null,null,null,0,0]
[null,null,null,null,null,null,null,null,null,null,null,null,null,null,null,null,null,null,null,null,null,null,null,null,null,null,null,null,null,null,0,0]
[null,null,null,null,null,null,null,null,null,null,null,null,null,null,null,null,null,null,null,null,null,null,null,null,null,null,null,null,null,null,0,0]
[null,null,null,null,null,null,null,null,null,null,null,null,null,null,null,null,null,null,null,null,null,null,null,null,null,null,null,null,null,null,0,0]
[null,null,null,null,null,null,null,null,null,null,null,null,null,null,null,null,null,null,null,null,null,null,null,null,null,null,null,null,null,null,0,0]
[null,null,null,null,null,null,null,null,null,null,null,null,null,null,null,null,null,null,null,null,null,null,null,null,null,null,null,null,null,null,0,0]
[null,null,null,null,null,null,null,null,null,null,null,null,null,null,null,null,null,null,null,null,null,null,null,null,null,null,null,null,null,null,0,0]
[null,"x) Exposures in Default",null,null,null,null,null,null,null,null,null,null,null,null,null,null,null,null,null,null,null,null,null,null,null,null,null,null,null,null,0,0]
[null,null,null,null,null,null,null,null,null,null,null,null,null,null,null,null,null,null,null,null,null,null,null,null,null,null,null,null,null,null,0,0]
[null,null,null,null,null,null,null,null,null,null,null,null,null,null,null,null,null,null,null,null,null,null,null,null,null,null,null,null,null,null,0,0]
[null,null,null,null,null,null,null,null,null,null,null,null,null,null,null,null,null,null,null,null,null,null,null,null,null,null,null,null,null,null,{"$f":"IF(D232>0,D232,0)","v":0},{"$f":"IF(D232<0,D232,0)","v":0}]
[null,null,null,null,null,null,null,null,null,null,null,null,null,null,null,null,null,null,null,null,null,null,null,null,null,null,null,null,null,null,0,0]
[null,null,null,null,null,null,null,null,null,null,null,null,null,null,null,null,null,null,null,null,null,null,null,null,null,null,null,null,null,null,0,0]
[null,null,null,null,null,null,null,null,null,null,null,null,null,null,null,null,null,null,null,null,null,null,null,null,null,null,null,null,null,null,0,0]
[null,null,null,null,null,null,null,null,null,null,null,null,null,null,null,null,null,null,null,null,null,null,null,null,null,null,null,null,null,null,0,0]
[null,null,null,null,null,null,null,null,null,null,null,null,null,null,null,null,null,null,null,null,null,null,null,null,null,null,null,null,null,null,0,0]
[null,"xi) Items associated with particularly High Risk",null,null,null,null,null,null,null,null,null,null,null,null,null,null,null,null,null,null,null,null,null,null,null,null,null,null,null,null,0,0]
[null,null,null,null,null,null,null,null,null,null,null,null,null,null,null,null,null,null,null,null,null,null,null,null,null,null,null,null,null,null,0,0]
[null,null,null,null,null,null,null,null,null,null,null,null,null,null,null,null,null,null,null,null,null,null,null,null,null,null,null,null,null,null,0,0]
[null,null,null,null,null,null,null,null,null,null,null,null,null,null,null,null,null,null,null,null,null,null,null,null,null,null,null,null,null,null,0,0]
[null,null,null,null,null,null,null,null,null,null,null,null,null,null,null,null,null,null,null,null,null,null,null,null,null,null,null,null,null,null,0,0]
[null,null,null,null,null,null,null,null,null,null,null,null,null,null,null,null,null,null,null,null,null,null,null,null,null,null,null,null,null,null,0,0]
[null,null,null,null,null,null,null,null,null,null,null,null,null,null,null,null,null,null,null,null,null,null,null,null,null,null,null,null,null,null,0,0]
[null,null,null,null,null,null,null,null,null,null,null,null,null,null,null,null,null,null,null,null,null,null,null,null,null,null,null,null,null,null,0,0]
[null,null,null,null,null,null,null,null,null,null,null,null,null,null,null,null,null,null,null,null,null,null,null,null,null,null,null,null,null,null,0,0]
[null,null,null,null,null,null,null,null,null,null,null,null,null,null,null,null,null,null,null,null,null,null,null,null,null,null,null,null,null,null,0,0]
[null,null,null,null,null,null,null,null,null,null,null,null,null,null,null,null,null,null,null,null,null,null,null,null,null,null,null,null,null,null,0,0]
[null,"xii) Exposures in the form of Covered Bonds",null,null,null,null,null,null,null,null,null,null,null,null,null,null,null,null,null,null,null,null,null,null,null,null,null,null,null,null,0,0]
[null,null,null,null,null,null,null,null,null,null,null,null,null,null,null,null,null,null,null,null,null,null,null,null,null,null,null,null,null,null,0,0]
[null,null,null,null,null,null,null,null,null,null,null,null,null,null,null,null,null,null,null,null,null,null,null,null,null,null,null,null,null,null,0,0]
[null,null,null,null,null,null,null,null,null,null,null,null,null,null,null,null,null,null,null,null,null,null,null,null,null,null,null,null,null,null,0,0]
[null,null,null,null,null,null,null,null,null,null,null,null,null,null,null,null,null,null,null,null,null,null,null,null,null,null,null,null,null,null,0,0]
[null,null,null,null,null,null,null,null,null,null,null,null,null,null,null,null,null,null,null,null,null,null,null,null,null,null,null,null,null,null,0,0]
[null,null,null,null,null,null,null,null,null,null,null,null,null,null,null,null,null,null,null,null,null,null,null,null,null,null,null,null,null,null,0,0]
[null,null,null,null,null,null,null,null,null,null,null,null,null,null,null,null,null,null,null,null,null,null,null,null,null,null,null,null,null,null,0,0]
[null,null,null,null,null,null,null,null,null,null,null,null,null,null,null,null,null,null,null,null,null,null,null,null,null,null,null,null,null,null,0,0]
[null,null,null,null,null,null,null,null,null,null,null,null,null,null,null,null,null,null,null,null,null,null,null,null,null,null,null,null,null,null,0,0]
[null,null,null,null,null,null,null,null,null,null,null,null,null,null,null,null,null,null,null,null,null,null,null,null,null,null,null,null,null,null,0,0]
[null,"xiii) Exposures to institutions and corporates with a short-term credit assessment",null,null,null,null,null,null,null,null,null,null,null,null,null,null,null,null,null,null,null,null,null,null,null,null,null,null,null,null,0,0]
[null,null,null,null,null,null,null,null,null,null,null,null,null,null,null,null,null,null,null,null,null,null,null,null,null,null,null,null,null,null,0,0]
[null,null,null,null,null,null,null,null,null,null,null,null,null,null,null,null,null,null,null,null,null,null,null,null,null,null,null,null,null,null,0,0]
[null,null,null,null,null,null,null,null,null,null,null,null,null,null,null,null,null,null,null,null,null,null,null,null,null,null,null,null,null,null,0,0]
[null,null,null,null,null,null,null,null,null,null,null,null,null,null,null,null,null,null,null,null,null,null,null,null,null,null,null,null,null,null,0,0]
[null,null,null,null,null,null,null,null,null,null,null,null,null,null,null,null,null,null,null,null,null,null,null,null,null,null,null,null,null,null,0,0]
[null,null,null,null,null,null,null,null,null,null,null,null,null,null,null,null,null,null,null,null,null,null,null,null,null,null,null,null,null,null,0,0]
[null,null,null,null,null,null,null,null,null,null,null,null,null,null,null,null,null,null,null,null,null,null,null,null,null,null,null,null,null,null,0,0]
[null,null,null,null,null,null,null,null,null,null,null,null,null,null,null,null,null,null,null,null,null,null,null,null,null,null,null,null,null,null,0,0]
[null,null,null,null,null,null,null,null,null,null,null,null,null,null,null,null,null,null,null,null,null,null,null,null,null,null,null,null,null,null,0,0]
[null,null,null,null,null,null,null,null,null,null,null,null,null,null,null,null,null,null,null,null,null,null,null,null,null,null,null,null,null,null,0,0]
[null,"xiv) Exposures in the form of units or shares in collective investment undertakings ",null,null,null,null,null,null,null,null,null,null,null,null,null,null,null,null,null,null,null,null,null,null,null,null,null,null,null,null,0,0]
[null,null,null,null,null,null,null,null,null,null,null,null,null,null,null,null,null,null,null,null,null,null,null,null,null,null,null,null,null,null,0,0]
[null,null,null,null,null,null,null,null,null,null,null,null,null,null,null,null,null,null,null,null,null,null,null,null,null,null,null,null,null,null,0,0]
[null,null,null,null,null,null,null,null,null,null,null,null,null,null,null,null,null,null,null,null,null,null,null,null,null,null,null,null,null,null,0,0]
[null,null,null,null,null,null,null,null,null,null,null,null,null,null,null,null,null,null,null,null,null,null,null,null,null,null,null,null,null,null,0,0]
[null,null,null,null,null,null,null,null,null,null,null,null,null,null,null,null,null,null,null,null,null,null,null,null,null,null,null,null,null,null,0,0]
[null,null,null,null,null,null,null,null,null,null,null,null,null,null,null,null,null,null,null,null,null,null,null,null,null,null,null,null,null,null,0,0]
[null,null,null,null,null,null,null,null,null,null,null,null,null,null,null,null,null,null,null,null,null,null,null,null,null,null,null,null,null,null,0,0]
[null,null,null,null,null,null,null,null,null,null,null,null,null,null,null,null,null,null,null,null,null,null,null,null,null,null,null,null,null,null,0,0]
[null,null,null,null,null,null,null,null,null,null,null,null,null,null,null,null,null,null,null,null,null,null,null,null,null,null,null,null,null,null,0,0]
[null,null,null,null,null,null,null,null,null,null,null,null,null,null,null,null,null,null,null,null,null,null,null,null,null,null,null,null,null,null,0,0]
[null,"xv) Equity Exposures",null,null,null,null,null,null,null,null,null,null,null,null,null,null,null,null,null,null,null,null,null,null,null,null,null,null,null,null,0,0]
[null,null,null,null,null,null,null,null,null,null,null,null,null,null,null,null,null,null,null,null,null,null,null,null,null,null,null,null,null,null,0,0]
[null,null,null,null,null,null,null,null,null,null,null,null,null,null,null,null,null,null,null,null,null,null,null,null,null,null,null,null,null,null,0,0]
[null,null,null,null,null,null,null,null,null,null,null,null,null,null,null,null,null,null,null,null,null,null,null,null,null,null,null,null,null,null,0,0]
[null,null,null,null,null,null,null,null,null,null,null,null,null,null,null,null,null,null,null,null,null,null,null,null,null,null,null,null,null,null,0,0]
[null,null,null,null,null,null,null,null,null,null,null,null,null,null,null,null,null,null,null,null,null,null,null,null,null,null,null,null,null,null,0,0]
[null,null,null,null,null,null,null,null,null,null,null,null,null,null,null,null,null,null,null,null,null,null,null,null,null,null,null,null,null,null,0,0]
[null,null,null,null,null,null,null,null,null,null,null,null,null,null,null,null,null,null,null,null,null,null,null,null,null,null,null,null,null,null,0,0]
[null,null,null,null,null,null,null,null,null,null,null,null,null,null,null,null,null,null,null,null,null,null,null,null,null,null,null,null,null,null,0,0]
[null,null,null,null,null,null,null,null,null,null,null,null,null,null,null,null,null,null,null,null,null,null,null,null,null,null,null,null,null,null,0,0]
[null,null,null,null,null,null,null,null,null,null,null,null,null,null,null,null,null,null,null,null,null,null,null,null,null,null,null,null,null,null,0,0]
[]
[null,"g)  i) unsettled securities transactions - cash against documents",null,null,null,"of which Trading Book","Of which Non Trading Book",null,null,null,null,null,null,null,null,null,null,null,null,null,null,null,null,null,null,null,null,null,null,null,{"$f":"SUM(AE96:AE292)","v":0},{"$f":"SUM(AF96:AF292)","v":0}]
[null,"0 - 4 working days",null,null,null,null,null,null,null,{"$f":"IF(D295=F295+G295,\"\",\"error\")","v":""}]
[null,"5 - 15 working days",null,null,null,null,null,null,null,{"$f":"IF(D296=F296+G296,\"\",\"error\")","v":""}]
[null,"16 - 30 working days",null,null,null,null,null,null,null,{"$f":"IF(D297=F297+G297,\"\",\"error\")","v":""}]
[null,"31 - 45 working days",null,null,null,null,null,null,null,{"$f":"IF(D298=F298+G298,\"\",\"error\")","v":""}]
[null,"46 or more working days",null,null,null,null,null,null,null,{"$f":"IF(D299=F299+G299,\"\",\"error\")","v":""}]
[null,"ii) unsettled securities transactions - free deliveries"]
[null,"a) if securities were delivered "]
[null,"1) Up to first contractual payment"]
[null,"2) From first contractual payment to four days after "]
[null,"second contractual payment."]
[null,"3) From 5 business days post contractual payment",null,null,null,"Calculation Method",null,null,null,"Deduct from Own Funds"]
[null,"until extinction of transaction",null,null,null,null,null,null,null,"Risk Weight"]
[]
[null,"b) if securities were paid for by the Licence Holder "]
[null,"1) Up to first contractual delivery lag"]
[null,"2) From first contractual delivery lag to four days after "]
[null,"second contractual delivery lag."]
[null,"3) From 5 business days post contractual delivery lag ",null,null,null,null,null,null,"Calculation Method"]
[null,"until extinction of transaction"]
[]
[null,"iii) Collective investment schemes"]
[null,"iv) Group debtors"]
[null,"   1) Amounts due from group companies"]
[null,"   2) Amounts due from other connected persons"]
[null,"v)  1)Trade receivables (i)"]
[null,"     2)Trade receivables (ii)"]
[null,"h) Prepayments"]
[null,"i) Accrued income"]
[null,"j) Amounts receivable from Government bodies"]
[null,"i) Amounts receivable within 90 days "]
[null,"ii) Amounts receivable after more than 90 days"]
[null,"k) Amounts receivable from Financial Institutions"]
[null,"i) Amounts receivable within 90 days "]
[null,"ii) Amounts receivable after more than 90 days"]
[null,"l) Other receivables"]
[null,"m) Bank and cash balances"]
[null,"i) Balances which can be withdrawn within 30 days"]
[null,"ii) Balances which can be withdrawn only after 30 days"]
[null,null,null,null,null,null,{"$f":"+SUM(D153:D333)","v":0},{"$f":"+$G$333+$I$93+$I$92","v":0}]
[null,"4) Liabilities"]
[null,"a) Tax liability "]
[null,"b) Overdrafts"]
[null,"c) Group creditors - due within 1 year"]
[null,"i) Amounts due to group companies"]
[null,"ii) Amounts due to other connected persons "]
[null,"d) Accruals"]
[null,"e) Other creditors"]
[null,"f) Loans: ",null,null,null,{"$f":"IF(OR(D344<0,D345<0),\"Date Issued\",\"\")","v":""},{"$f":"IF(OR(D344<0,D345<0),\"Maturity Date\",\"\")","v":""}]
[null,"i) Subordinated Loan (i) - Perpetual"]
[null,"ii) Subordinated Loan (ii) - Fixed Term"]
[null,"iii) Suboridnated Loan (iii) - Fixed Term"]
[null,"ii) other"]
[null,"g) Group creditors - due after more than 1 year"]
[null,"i) Amounts due to group companies"]
[null,"ii) Amounts due to other connected persons "]
[null,"h) Other Payables"]
[null,"i) Deferred Tax Liability",null,null,null,"Kindly Categorise amount in CA1 (rows 330,360 or 410) or CA4 (rows 80 or 90)"]
[null,"j) Other provisions for liabilities/ charges"]
[null,"k) Financial Liabilities"]
[]
[null,"5) Capital & Reserves "]
[null,"a) Called up ordinary share capital "]
[null,"b) i) Perpetual Non-Cumulative Preference Shares prior to 31/12/2011 (grandfathered)"]
[null,"    ii)Perpetual Non-Cumulative Preference Shares as from 01/01/2012"]
[null,"c) Perpetual Cumulative Preference Shares"]
[null,"d) Fixed term Non-cumulative Pref Shares with an original maturity of more than 5 years)"]
[null,"e) Fixed term Non-cumulative Pref Shares with an original maturity of less than 5 years"]
[null,"f) Fixed term Cumulative Pref Share Capital with an original maturity of more than 5 years"]
[null,"g) Fixed term Cumulative PrefShare Capital with an orignal maturity of less than 5 years"]
[null,"h) Investor Compensation Scheme Reserve"]
[null,"i) Share premium account"]
[null,"   i) Eligible as grandfathered Perpetual non-cumulative preference shares"]
[null,"ii) Eligible as CET1 Capital"]
[null,"iii) Eligible as AT1 Capital"]
[null,"iv) Eligible as T2 Capital"]
[null,"v) Other"]
[null,"j) Revenue reserves as per the previous year's audited financial statements",null,null,null,{"$f":"IF(D372<>0,\"Unrealised Loss\",\"\")","v":""},{"$f":"IF(D372<>0,\"Unrealised Gain\",\"\")","v":""}]
[null,"k)  OCI as per the previous year's audited financial statements",null,null,null,null,null,{"$f":"IF(D372=\"\",\"\",IF(OR(-G372-F372=D372,F372+G372=D372),\"ok\",\"error\"))","v":""}]
[null,"l) Other reserves"]
[null,"m) Minority Interest"]
[null,null,null,{"$f":"SUM(D13:D374)","v":0}]
[]
[]
[null,"6) Other"]
[null,null,null,"yes"]
[null,"a) Secured Liabilities",null,"no"]
[null,"i) Include the amount of secured liabilities ",null,null,null,null,"Liabilities secured on properties"]
[null,"- which are due within 1 year",null,null,{"$f":"IF(D382>(-D336-D338-D339-D340-D341),\"CHECK\",\"\")","v":""}]
[null,"ii) Include the amount of secured liabilities"]
[null,"-which are due within 1 year & secured by a charge on land & building",null,null,{"$f":"IF(D384>D382,\"CHECK: Cannot be greater than amount disclosed under (i) above\",\"\")","v":""}]
[]
[null,"iii) Include the amount of secured liabilities "]
[null,"- which are due after more than 1 year",null,null,{"$f":"IF(D387>(-D346-D348-D349-D350),\"CHECK\",\"\")","v":""}]
[null,"iv) Include in full the amount of secured liabilities"]
[null,"- which are due after more than 1 year & secured by a charge on land & building",null,null,{"$f":"IF(D389>D387,\"CHECK: Cannot be greater than amount disclosed under (iii) above\",\"\")","v":""}]
[]
[]
[null,"b) Contingent Liabilities"]
[null,"Insert the amount of any Contingent Liabilities "]
[]
[null,"c) Investment in Own Shares",null,null,null,"Capital Type","Holding Type","Amount",null,"CET 1","Direct"]
[null,"Does the Licence Holder hold Investments in Own CET 1,  AT1 or T2 Instruments?",null,null,null,null,null,null,null,"AT 1","Indirect"]
[null,null,null,null,null,null,null,null,null,"T2","Synthetic"]
[null,"d) Instruments of financial sector entities where the institution "]
[null,"has a significant investment"]
[null,"Does the Licence Holder hold (>10%) holding in credit/financial institution?",null,null,null,{"$f":"IF(D400=\"yes\",\"Please Inform MFSA\",\"\")","v":""}]
[]
[null,"e) Instruments of financial sector entities where the institution does not "]
[null,"have a significant investment",null,null,null,"Capital Type"]
[null,"Instruments of financial sector entities where institution has no significant investment"]
[]
[null,"f) Bank and/ or other third party guarantees approved by the MFSA"]
[null,"Include any Bank and/ or other third party guarantees approved by the MFSA"]
[]
[null,"g) Fixed Overheads"]
[null,"Has the change in the firm's business resulted in a material change in projected",null,null,null,""]
[null,"fixed overheads as stated in the Regulatory Technical Standards?",null,null,null,{"$f":"IF(D411=\"Yes\",\"Please Inform MFSA\",\"\")","v":""}]
[]
[null,"h) Total Funds under Management"]
[null,"Include the total funds under management",null,null,null,{"$f":"IF((OR(D414<>0, D417<>0)), \"\", \"Kindly ensure that either Total Funds under Management and/or Other Assets under Management are filled in.\")","v":"Kindly ensure that either Total Funds under Management and/or Other Assets under Management are filled in."}]
[]
[null,"i) Other Assets under Management"]
[null,"Include the total other assets under management"]
[]
[null,"j) The Financial Return is showing a Profit or Loss of:",null,{"$f":"'Sheet 2'!K92","v":0},null,{"$f":"IF(D421>0,\"Kindly ensure that the required verifications specificied in the MFSA circular dated 13 May 2015 have been undertaken and that the respective Auditor's Assurance Report is submitted together with the Appendix 2B.\",\"\")","v":""}]
[null,"Kindly input the profits which been verified by persons independent of the institution"]
[null," that are responsible for the auditing of the accounts of that institution"]
[null,null,null,{"$f":"IF(D421>0,1,0)","v":0}]
[null,"If the Total FUM and AUM are both nil kindly provide an explanation in the box below:"]
[]
[]
[]
[]
[]
[]
[]
[]
[]
[]
[]
[]
[]
[]
[]
[]
[]
[]
[]
[]
[]
[]
[]
[]
[]
[]
[]
[]
[]
[]
[]
[]
[]
[]
[]
[]
[]
[]
[]
[]
[]
[]
[]
[]
[]
[]
[]
[]
[]
[]
[]
[]
[]
[]
[]
[]
[]
[]
[]
[]
[]
[]
[]
[]
[]
[]
[]
[]
[]
[]
[]
[]
[]
[]
[]
[]
[]
[]
[]
[]
[]
[]
[]
[]
[]
[]
[]
[]
[]
[]
[]
[]
[]
[]
[]
[]
[]
[]
[]
[]
[]
[]
[]
[]
[]
[]
[]
[]
[]
[]
[]
[]
[]
[]
[]
[]
[]
[]
[]
[]
[]
[]
[]
[]
[]
[]
[]
[]
[]
[]
[]
[]
[]
[]
[]
[]
[]
[]
[]
[]
[]
[]
[]
[]
[]
[]
[]
[]
[]
[]
[]
[]
[]
[]
[]
[]
[]
[]
[]
[]
[]
[]
[]
[]
[]
[]
[]
[]
[]
[]
[]
[]
[]
[]
[]
[]
[]
[]
[]
[]
[]
[]
[]
[]
[]
[]
[]
[]
[]
[]
[]
[]
[]
[]
[]
[]
[]
[]
[]
[]
[]
[]
[]
[]
[]
[]
[]
[]
[]
[]
[]
[]
[]
[]
[]
[]
[]
[]
[]
[]
[]
[]
[]
[]
[]
[]
[]
[]
[]
[]
[]
[]
[]
[]
[]
[]
[]
[]
[]
[]
[]
[]
[]
[]
[]
[]
[]
[]
[]
[]
[]
[]
[]
[]
[]
[]
[]
[]
[]
[]
[]
[]
[]
[]
[]
[]
[]
[]
[]
[]
[]
[]
[]
[]
[]
[]
[]
[]
[]
[]
[]
[]
[]
[]
[]
[]
[]
[]
[]
[]
[]
[]
[]
[]
[]
[]
[]
[]
[]
[]
[]
[]
[]
[]
[]
[]
[]
[]
[]
[]
[]
[]
[]
[]
[]
[]
[]
[]
[]
[]
[]
[]
[]
[]
[]
[]
[]
[]
[]
[]
[]
[]
[]
[]
[]
[]
[]
[]
[]
[]
[]
[]
[]
[]
[]
[]
[]
[]
[]
[]
[]
[]
[]
[]
[]
[]
[]
[]
[]
[]
[]
[]
[]
[]
[]
[]
[]
[]
[]
[]
[]
[]
[]
[]
[]
[]
[]
[]
[]
[]
[]
[]
[]
[]
[]
[]
[]
[]
[]
[]
[]
[]
[]
[]
[]
[]
[]
[]
[]
[]
[]
[]
[]
[]
[]
[]
[]
[]
[]
[]
[]
[]
[]
[]
[]
[]
[]
[]
[]
[]
[]
[]
[]
[]
[]
[]
[]
[]
[]
[]
[]
[]
[]
[]
[]
[]
[]
[]
[]
[]
[]
[]
[]
[]
[]
[]
[]
[]
[]
[]
[]
[]
[]
[]
[]
[]
[]
[]
[]
[]
[]
[]
[]
[]
[]
[]
[]
[]
[]
[]
[]
[]
[]
[]
[]
[]
[]
[]
[]
[]
[]
[]
[]
[]
[]
[]
[]
[]
[]
[]
[]
[]
[]
[]
[]
[]
[]
[]
[]
[]
[]
[]
[]
[]
[]
[]
[]
[]
[]
[]
[]
[]
[]
[]
[]
[]
[]
[]
[]
[]
[]
[]
[]
[]
[]
[]
[]
[]
[]
[]
[]
[]
[]
[]
[]
[]
[]
[]
[]
[]
[]
[]
[]
[]
[]
[]
[]
[]
[]
[]
[]
[]
[]
[]
[]
[]
[]
[]
[]
[]
[]
[]
[]
[]
[]
[]
[]
[]
[]
[]
[]
[]
[]
[]
[]
[]
[]
[]
[]
[]
[]
[]
[]
[]
[]
[]
[]
[]
[]
[]
[]
[]
[]
[]
[]
[]
[]
[]
[]
[]
[]
[]
[]
[]
[]
[]
[]
[]
[]
[]
[]
[]
[]
[]
[]
[]
[]
[]
[]
[]
[]
[]
[]
[]
[]
[]
[]
[]
[]
[]
[]
[]
[]
[]
[]
[]
[]
[]
[]
[]
[]
[]
[]
[]
[]
[]
[]
[]
[]
[]
[]
[]
[]
[]
[]
[]
[]
[]
[]
[]
[]
[]
[]
[]
[]
[]
[]
[]
[]
[]
[]
[]
[]
[]
[]
[]
[]
[]
[null,"7) Employee Statistics"]
[]
[null,"a) Number of Employees:"]
[null,"Kindly input the total number of employees expressed as per Article 5 of the Annex to Commission Recommendation 2003/361/EC."]

{"sheet":"Sheet 2","index":6,"n_rows":107,"n_cols":14,"rows_kept":107,"cut":false,"hidden":false,"merged":[[62,1,62,5],[63,2,63,5]]}
[]
[null,null,null,null,null,null,null,null,null,"Initialled by the auditor for identification purposes only "]
[]
[null,"INCOME STATEMENT & ITEMS THROUGH STATEMENT OF CHANGES IN EQUITY"]
[]
[null,"For the period from ",null,{"$f":"'COVER SHEET'!C28","v":"00:00:00"}," to ",{"$f":"'COVER SHEET'!C29","v":"00:00:00"}]
[]
[null,null,null,null,null,null,{"$f":"IF('COVER SHEET'!C34=\"\",\"\",'COVER SHEET'!C34)","v":""},null,null,null,{"$f":"IF('COVER SHEET'!C34=\"\",\"\",'COVER SHEET'!C34)","v":""}]
[null,"Dealing Profit / (Loss)"]
[]
[1,"Dealing Profit or (Loss)"]
[null,"a) Dealing Profit or (Loss) - Trading",null,null,null,null,{"$f":"-'Sheet 1'!D13","v":0}]
[null,"b) Dealing Profit or (Loss) - Long Term Financial Instruments",null,null,null,null,{"$f":"-'Sheet 1'!D14","v":0},"Total Dealing Profit or (Loss)",null,null,{"$f":"+G12+G13","v":0}]
[]
[]
[null,"Revenue"]
[null,"ISA-related:"]
[]
[2,"Commissions Received "]
[null,"a) Commissions received on transactions in :"]
[null,"          i) locally based schemes",null,null,null,null,{"$f":"-'Sheet 1'!D16","v":0}]
[null,"          ii) foreign based schemes "]
[null,"- listed on an EU Regulated Market or the"]
[null,"  Regulated Market of a developed financial centre",null,null,null,{"$f":"-'Sheet 1'!D18","v":0}]
[null,"- listed in other markets",null,null,null,{"$f":"-'Sheet 1'!D19","v":0},{"$f":"+F25+F24","v":0}]
[null,"          iii) unit linked products",null,null,null,null,{"$f":"-'Sheet 1'!D20","v":0}]
[null,"b) Other commission (equities, debt instruments etc.)",null,null,null,null,{"$f":"-'Sheet 1'!D21","v":0},"Total commissions",null,null,{"$f":"SUM(G21:G27)","v":0}]
[]
[]
[3,"Investment Management and Administration Fees"]
[null,"a) Retail clients",null,null,null,null,{"$f":"-'Sheet 1'!D23","v":0}]
[null,"b) Professional clients",null,null,null,null,{"$f":"-'Sheet 1'!D24","v":0}]
[null,"c) Collective Investment Schemes",null,null,null,null,{"$f":"-'Sheet 1'!D25","v":0}]
[null,"d) Other (e.g. Connected companies)",null,null,null,null,{"$f":"-'Sheet 1'!D26","v":0},"Total investment management fees",null,null,{"$f":"SUM(G31:G34)","v":0}]
[]
[]
[4,"Investment Advisory Fees"]
[null,"a) Retail clients",null,null,null,null,{"$f":"-'Sheet 1'!D28","v":0}]
[null,"b) Professional clients",null,null,null,null,{"$f":"-'Sheet 1'!D29","v":0}]
[null,"c) Collective Investment Schemes",null,null,null,null,{"$f":"-'Sheet 1'!D30","v":0}]
[null,"d) Other (e.g. Connected companies)",null,null,null,null,{"$f":"-'Sheet 1'!D31","v":0},"Total investment advisory fees",null,null,{"$f":"SUM(G38:G41)","v":0}]
[]
[]
[5,"Other ISA related revenue*",null,null,null,null,null,null,null,null,{"$f":"-'Sheet 1'!D32","v":0}]
[]
[]
[6,"Non-ISA related revenue",null,null,null,null,null,null,null,null,{"$f":"-'Sheet 1'!D33","v":0}]
[]
[]
[7,"Total Revenue",null,null,null,null,null,null,null,null,{"$f":"SUM(K13:K47)","v":0}]
[]
[]
[8,"* Details of 'Other ISA related revenue' and/or Any other details or comments:"]
[]
[]
[]
[]
[]
[]
[null,"Operating Expenses"]
[]
[9,"Commissions and fees"]
[null,"a) Commissions that are directly related to the acqusition of gross revenue (derived from investment services activities), paid or payable to third parties; and/ or",null,null,null,null,{"$f":"'Sheet 1'!D38","v":0}]
[null,null," i) Fees, brokerage and other charges paid to clearing houses, exchanges and intermediate brokers for the purpse of executing, registering or clearing transactions",null,null,null,{"$f":"'Sheet 1'!D39","v":0}]
[null,null," ii) Fees to tied agents",null,null,null,{"$f":"'Sheet 1'!D40","v":0}]
[null,"b) Other Commissions payable (not related to investment services activities)",null,null,null,null,{"$f":"'Sheet 1'!D41","v":0},"Total Commissions and Fees",null,null,{"$f":"SUM(G63:G66)","v":0}]
[]
[]
[10,"Exceptional Items of expenditure"]
[null,"a) Allowed by MFSA*",null,null,null,null,{"$f":"'Sheet 1'!D43","v":0}]
[null,"b) Other",null,null,null,null,{"$f":"'Sheet 1'!D44","v":0},"Total Exceptional items",null,null,{"$f":"SUM(G70:G71)","v":0}]
[]
[11,"Total Operating Expenses ",null,null,null,null,null,null,null,null,{"$f":"K66+K71","v":0}]
[]
[12,"Gross Profit ",null,null,null,null,null,null,null,null,{"$f":"K50-K73","v":0}]
[]
[]
[13,"Administrative Expenses",null,null,null,null,null,null,null,null,{"$f":"SUM('Sheet 1'!D45:D63)+SUM('Sheet 1'!D69+'Sheet 1'!D70+'Sheet 1'!D71)+IF('Sheet 1'!F80=\"P/L\",'Sheet 1'!D80,\"0\")+IF('Sheet 1'!F82=\"P/L\",'Sheet 1'!D82,\"0\")","v":0}]
[]
[14,"Operating Profit (loss)",null,null,null,null,null,null,null,null,{"$f":"K75-K78","v":0}]
[]
[15,"k) Finance Income",null,null,null,null,{"$f":"-'Sheet 1'!D34","v":0}]
[]
[16,"l)  Finance Cost",null,null,null,null,{"$f":"SUM('Sheet 1'!D65:D68)","v":0}]
[]
[17,"m) Fair Value through Profit or Loss",null,null,null,null,{"$f":"-'Sheet 1'!D35","v":0}]
[]
[18,"Profit (Loss) before tax ",null,null,null,null,null,null,null,null,{"$f":"K80+G82-G84+G86","v":0}]
[]
[19,"Tax (expense) income",null,null,null,null,null,null,null,null,{"$f":"'Sheet 1'!D72","v":0}]
[]
[20,"Profit (Loss) after tax ",null,null,null,null,null,null,null,null,{"$f":"K88-K90","v":0}]
[]
[]
[21,"Other Comprehensive Income"]
[]
[null,"n) Fair value movements on Intangible Assets",null,null,null,null,null,null,null,null,null,null,"gain","losses"]
[null,null,null,null,null,null,{"$f":"+IF('Sheet 1'!F80=\"OCI\",-'Sheet 1'!D80,\"0\")","v":"0"},null,null,null,null,null,{"$f":"IF(G98>0,G98,)","v":"0"},{"$f":"IF(G98<0,G98,0)","v":0}]
[null,"o) Gain/Loss on revaluation of available for sale Financial Assets",null,null,null,null,null,null,null,null,null,null,0,0]
[null,null,null,null,null,null,{"$f":"-'Sheet 1'!D81","v":0},null,null,null,null,null,0,0]
[null,"p)  Gain/Loss on revaluation of property",null,null,null,null,{"$f":"IF('Sheet 1'!F82=\"OCI\",-'Sheet 1'!D82,0)","v":0},null,null,null,null,null,0,0]
[null,"q) Other items of income and expense included in other comprehensive income",null,null,null,null,{"$f":"-'Sheet 1'!D83","v":0},null,null,null,null,null,0,0]
[null,"r) Tax income/expense relating to components of other comprehensive income",null,null,null,null,{"$f":"-'Sheet 1'!D84","v":0},"Other Comprehensive Income",null,null,{"$f":"SUM(G98+G100+G101+G102+G103)","v":0},null,0,0]
[null,null,null,null,null,null,null,null,null,null,null,null,{"$f":"SUM(M98:M103)","v":0},{"$f":"SUM(N98:N103)","v":0}]
[22,"Total Comprehensive Income",null,null,null,null,null,null,null,null,{"$f":"K92+K103","v":0}]
[]
[null,null,null,null,null,null,null,null,null,"VALIDATION SHEET 2",{"$f":"-SUM('Sheet 1'!D13:D83)","v":0}]

{"sheet":"Sheet 3","index":7,"n_rows":70,"n_cols":10,"rows_kept":70,"cut":false,"hidden":false,"merged":[[69,1,69,9]]}
[]
[null,null,null,null,null,null,null,null,"Initialled by the auditor for identification purposes only "]
[]
[null,"STATEMENT OF FINANCIAL POSITION"]
[]
[null,"As at: ",{"$f":"'COVER SHEET'!C29","v":"00:00:00"}]
[]
[null,"Assets"]
[null,null,null,null,null,null,{"$f":"IF('COVER SHEET'!C34=\"\",\"\",'COVER SHEET'!C34)","v":""},null,null,{"$f":"IF('COVER SHEET'!C34=\"\",\"\",'COVER SHEET'!C34)","v":""}]
[1,"Non-current"]
[null,"a) Intangible assets",null,null,null,null,{"$f":"'Sheet 1'!D88+'Sheet 1'!D89","v":0}]
[null,"b) Property, Plant and Equipment",null,null,null,null,{"$f":"'Sheet 1'!D90","v":0}]
[null,"c) Investment Property",null,null,null,null,{"$f":"'Sheet 1'!D91","v":0},"Total Non-current assets",null,{"$f":"SUM(G11:G13)","v":0}]
[]
[2.0299999999999998,"Other non-current Assets"]
[null,"a) Inventories",null,null,null,null,{"$f":"'Sheet 1'!D93","v":0}]
[null,"b) Deferred Tax Asset",null,null,null,null,{"$f":"'Sheet 1'!D92","v":0}]
[null,"c) Financial Instruments - Long Positions",null,null,null,null,{"$f":"'Sheet 1'!AE294","v":0}]
[null,"d) Trading Book Debtors",null,null,null,null,{"$f":"SUM('Sheet 1'!F295:F299)","v":0}]
[null,"e) Non-Trading Book Debtors",null,null,null,null,{"$f":"SUM('Sheet 1'!D302:D313)+'Sheet 1'!D319+'Sheet 1'!D315+SUM('Sheet 1'!G295:G299)+'Sheet 1'!D320","v":0}]
[null,"f) Amounts due from group companies**",null,null,null,null,{"$f":"+'Sheet 1'!D317","v":0}]
[null,"g) Amounts due from other connected persons*",null,null,null,null,{"$f":"+'Sheet 1'!D318","v":0}]
[null,"h) Amounts receivable from government bodies",null,null,null,null,{"$f":"'Sheet 1'!D324+'Sheet 1'!D325","v":0}]
[null,"i) Amounts receivable from financial institutions",null,null,null,null,{"$f":"SUM('Sheet 1'!D327:D328)","v":0}]
[null,"j) Bank and cash balances",null,null,null,null,{"$f":"+SUM('Sheet 1'!D331:D332)","v":0}]
[null,"k) Other receivables",null,null,null,null,{"$f":"'Sheet 1'!D329+'Sheet 1'!D321+'Sheet 1'!D322","v":0},"Total Current Assets",null,{"$f":"SUM(G16:G26)","v":0}]
[]
[null,"Total Assets",null,null,null,null,null,null,null,{"$f":"+J13+J26","v":0}]
[]
[null,"Equity"]
[]
[3,"Equity and Other Reserves"]
[null,"a) Called up ordinary share capital ",null,null,null,null,{"$f":"-'Sheet 1'!D356","v":0}]
[null,"b) Preference share capital",null,null,null,null,{"$f":"-SUM('Sheet 1'!D357:D363)","v":0}]
[null,"c) Investor Compensation Scheme Reserve",null,null,null,null,{"$f":"-'Sheet 1'!D364","v":0}]
[null,"d) Share premium account",null,null,null,null,{"$f":"-SUM('Sheet 1'!D366:D370)","v":0}]
[null,"e) Revenue reserves",null,"i) as per the previous year's audited accounts",null,null,{"$f":"-'Sheet 1'!D371","v":0}]
[null,null,null,"ii) retained profits/ (loss) for the year/ period",null,null,{"$f":"'Sheet 2'!K92","v":0}]
[null,"f) Other Comprehensive Income  i) as per the previous year's audited accounts",null,null,null,null,{"$f":"-'Sheet 1'!D372","v":0}]
[null,"                         ii) other comprehensive income for the year/period",null,null,null,null,{"$f":"'Sheet 2'!K103","v":0}]
[null,"g) Other reserves",null,null,null,null,{"$f":"-'Sheet 1'!D373-'Sheet 1'!D76-'Sheet 1'!D77","v":0},"Total Equity and other reserves",null,{"$f":"SUM(G33:G41)","v":0}]
[]
[4,"Minority Interest",null,null,null,null,null,null,null,{"$f":"-'Sheet 1'!D374","v":0}]
[]
[null,"Liabilities"]
[]
[5,"Non-current"]
[null,"a) Loans: ","i) subordinated",null,null,{"$f":"-SUM('Sheet 1'!D343:D345)","v":0}]
[null,"                   ","ii) other",null,null,{"$f":"-'Sheet 1'!D346","v":0},{"$f":"+F48+F49","v":0}]
[null,"b) Amounts due to group companies**",null,null,null,null,{"$f":"-'Sheet 1'!D348","v":0}]
[null,"c) Amounts due to other connected persons* ",null,null,null,null,{"$f":"-'Sheet 1'!D349","v":0}]
[null,"d) Other Payables",null,null,null,null,{"$f":"-'Sheet 1'!D350","v":0},"Total Non-current liabilities",null,{"$f":"SUM(G49:G52)","v":0}]
[]
[6,"Current"]
[null,"a) Loans/overdrafts",null,null,null,null,{"$f":"-'Sheet 1'!D336","v":0}]
[null,"b) Taxation",null,null,null,null,{"$f":"-'Sheet 1'!D335","v":0}]
[null,"c) Amounts due to group companies**",null,null,null,null,{"$f":"-'Sheet 1'!D338","v":0}]
[null,"d) Amounts due to other connected persons* ",null,null,null,null,{"$f":"-'Sheet 1'!D339","v":0}]
[null,"e) Financial instruments - Short Positions ",null,null,null,null,{"$f":"ABS('Sheet 1'!AF294)","v":0}]
[null,"f) Other payables",null,null,null,null,{"$f":"-'Sheet 1'!D341+(-'Sheet 1'!D340)","v":0}]
[null,"g) Deferred Tax Liability",null,null,null,null,{"$f":"-'Sheet 1'!D351","v":0}]
[null,"h) Provisions for liabilities",null,null,null,null,{"$f":"-'Sheet 1'!D352","v":0}]
[null,"i) Financial Liabilities",null,null,null,null,{"$f":"-'Sheet 1'!D353","v":0},"Total Current liabilities",null,{"$f":"SUM(G55:G63)","v":0}]
[]
[7,"Total Liabilities",null,null,null,null,null,null,null,{"$f":"+J52+J63","v":0}]
[]
[]
[null,"Total Equity and Liabilities",null,null,null,null,null,null,null,{"$f":"J41+J65+J43","v":0}]
[]
[8,"* Details of 'Amounts due to/ from other connected persons' and/or **'Amounts due to/ from group Companies' and/or Any other details or comments:"]

{"sheet":"Sheet 4","index":8,"n_rows":103,"n_cols":5,"rows_kept":103,"cut":false,"hidden":false,"merged":[[12,0,14,0],[1,1,1,4]]}
[]
[null,"OWN FUNDS"]
[]
[null,"Rows","Item","Label","Amount"]
[null,"010",1,"OWN FUNDS",{"$f":"SUM(E7+E61+E82)","v":0}]
[null,"015","1.1","TIER 1 CAPITAL",{"$f":"SUM(E7+E61)","v":0}]
[null,"020",{"$f":"C$6&\".1\"","v":"1.1.1"},"COMMON EQUITY TIER 1 CAPITAL",{"$f":"(E8+E17+E22+E23+E24+E25+E26+E27+E28+E34+E38+E41+E42+E43+E47+E48+E49+E50+E51+E52+E53+E54+E55+E56+E57+E58+E59+E60)","v":0}]
[null,"030",{"$f":"C$7&\".1\"","v":"1.1.1.1"},"Capital instruments eligible as CET1 Capital",{"$f":"E9+E11+E12+E16-E10","v":0}]
[null,"040",{"$f":"C$8&\".1\"","v":"1.1.1.1.1"},"Paid up capital instruments ",{"$f":"ABS('Sheet 1'!D356)","v":0}]
[null,"050","1.1.1.1.2*","Memorandum item: Capital instruments not eligible"]
[null,"060",{"$f":"C$8&\".3\"","v":"1.1.1.1.3"},"Share premium",{"$f":"ABS('Sheet 1'!D367)","v":0}]
[null,"070",{"$f":"C$8&\".4\"","v":"1.1.1.1.4"},"(-) Own CET1 instruments",{"$f":"SUM(E13:E15)","v":0}]
[null,"080",{"$f":"C$12&\".1\"","v":"1.1.1.1.4.1"},"(-) Direct holdings of CET1 instruments",{"$f":"IF(AND('Sheet 1'!F396=\"CET 1\",'Sheet 1'!G396=\"Direct\"),-'Sheet 1'!H396,\"0\")","v":"0"}]
[null,"090",{"$f":"C$12&\".2\"","v":"1.1.1.1.4.2"},"(-) Indirect holdings of CET1 instruments",{"$f":"IF(AND('Sheet 1'!F396=\"CET 1\",'Sheet 1'!G396=\"Indirect\"),-'Sheet 1'!H396,\"0\")","v":"0"}]
[null,"091",{"$f":"C$12&\".3\"","v":"1.1.1.1.4.3"},"(-) Synthetic holdings of CET1 instruments",{"$f":"IF(AND('Sheet 1'!F396=\"CET 1\",'Sheet 1'!G396=\"Synthetic\"),-'Sheet 1'!H396,\"0\")","v":"0"}]
[null,"092",{"$f":"C$8&\".5\"","v":"1.1.1.1.5"},"(-) Actual or contingent obligations to purchase own CET1 instruments"]
[null,"130",{"$f":"C$7&\".2\"","v":"1.1.1.2"},"Retained earnings",{"$f":"SUM(E18+E19)","v":0}]
[null,"140",{"$f":"C$17&\".1\"","v":"1.1.1.2.1"},"Previous years retained earnings",{"$f":"-('Sheet 1'!D371)","v":0}]
[null,"150",{"$f":"C$17&\".2\"","v":"1.1.1.2.2"},"Profit or loss eligible",{"$f":"(E20+E21)","v":0}]
[null,"160",{"$f":"C$19&\".1\"","v":"1.1.1.2.2.1"},"Profit or loss attributable to owners of the parent",{"$f":"('Sheet 2'!K92)-SUM('Sheet 1'!D76:D77)","v":0}]
[null,"170",{"$f":"C$19&\".2\"","v":"1.1.1.2.2.2"},"(-) Part of interim or year-end profit not eligible",{"$f":"IF('Sheet 1'!D419<0,0,-('Sheet 1'!D419-'Sheet 1'!D421))+IF(OR(SUM('Sheet 1'!D76:D77)<=0,SUM(-'Sheet 1'!D371,'Sheet 1'!D419)<0),0,IF(SUM('Sheet 1'!D76:D77)>SUM('Sheet 3'!G37+'Sheet 1'!D421),SUM('Sheet 1'!D76:D77)-SUM('Sheet 3'!G37+'Sheet 1'!D421),0))","v":0}]
[null,"180",{"$f":"C$7&\".3\"","v":"1.1.1.3"},"Accumulated other comprehensive income",{"$f":"SUM('Sheet 3'!G39:G40)","v":0}]
[null,"200",{"$f":"C$7&\".4\"","v":"1.1.1.4"},"Other reserves",{"$f":"-('Sheet 1'!D373)","v":0}]
[null,"210",{"$f":"C$7&\".5\"","v":"1.1.1.5"},"Funds for general banking risk"]
[null,"220",{"$f":"C$7&\".6\"","v":"1.1.1.6"},"Transitional adjustments due to grandfathered CET1 Capital instruments",{"$f":"'Sheet 4.2'!F12+'Sheet 4.2'!F9","v":0}]
[null,"230",{"$f":"C$7&\".7\"","v":"1.1.1.7"},"Minority interest given recognition in CET1 capital",{"$f":"-'Sheet 1'!D374","v":0}]
[null,"240",{"$f":"C$7&\".8\"","v":"1.1.1.8"},"Transitional adjustments due to additional minority interests",{"$f":"'Sheet 4.2'!F13","v":0}]
[null,"250",{"$f":"C$7&\".9\"","v":"1.1.1.9"},"Adjustments to CET1 due to prudential filters",{"$f":"SUM(E29+E30+E31+E32+E33)","v":0}]
[null,"260",{"$f":"C$28&\".1\"","v":"1.1.1.9.1"},"(-) Increases in equity resulting from securitised assets"]
[null,"270",{"$f":"C$28&\".2\"","v":"1.1.1.9.2"},"Cash flow hedge reserve"]
[null,"280",{"$f":"C$28&\".3\"","v":"1.1.1.9.3"},"Cumulative gains and losses due to changes in own credit risk on fair valued liabilities"]
[null,"285",{"$f":"C$28&\".4\"","v":"1.1.1.9.4"},"Fair value gains and losses arising from the institution's own credit risk related to derivative liabilities"]
[null,"290",{"$f":"C$28&\".5\"","v":"1.1.1.9.5"},"(-) Value adjustments due to the requirements for prudent valuation"]
[null,"300",{"$f":"C$7&\".10\"","v":"1.1.1.10"},"(-) Goodwill",{"$f":"(E35+E36+E37)","v":0}]
[null,"310",{"$f":"C$34&\".1\"","v":"1.1.1.10.1"},"(-) Goodwill accounted for as intangible asset",{"$f":"IF(D35='Sheet 1'!F88,-'Sheet 1'!D88,0)","v":0}]
[null,"320",{"$f":"C$34&\".2\"","v":"1.1.1.10.2"},"(-) Goodwill included in the valuation of significant investments",{"$f":"IF(D36='Sheet 1'!F88,-'Sheet 1'!D88,0)","v":0}]
[null,"330",{"$f":"C$34&\".3\"","v":"1.1.1.10.3"},"Deferred tax liabilities associated to goodwill"]
[null,"340",{"$f":"C$7&\".11\"","v":"1.1.1.11"},"(-) Other intangible assets",{"$f":"SUM(E39+E40)","v":0}]
[null,"350",{"$f":"C$38&\".1\"","v":"1.1.1.11.1"},"(-) Other intangible assets gross amount",{"$f":"(-'Sheet 1'!D89)","v":0}]
[null,"360",{"$f":"C$38&\".2\"","v":"1.1.1.11.2"},"Deferred tax liabilities associated to other intangible assets"]
[null,"370",{"$f":"C$7&\".12\"","v":"1.1.1.12"},"(-) Deferred tax assets that rely on future profitability",{"$f":"-ABS('Sheet 4.1'!E8)","v":0}]
[null,"380",{"$f":"C$7&\".13\"","v":"1.1.1.13"},"(-) IRB shortfall of credit risk adjustments to expected losses"]
[null,"390",{"$f":"C$7&\".14\"","v":"1.1.1.14"},"(-)Defined benefit pension fund assets",{"$f":"SUM(E44+E45+E46)","v":0}]
[null,"400",{"$f":"C$43&\".1\"","v":"1.1.1.14.1"},"(-)Defined benefit pension fund assets gross amount"]
[null,"410",{"$f":"C$43&\".2\"","v":"1.1.1.14.2"},"Deferred tax liabilities associated to defined benefit pension fund assets"]
[null,"420",{"$f":"C$43&\".3\"","v":"1.1.1.14.3"},"Defined benefit pension fund assets which the institution has an unrestricted ability to use"]
[null,"430",{"$f":"C$7&\".15\"","v":"1.1.1.15"},"(-) Reciprocal cross holdings in CET1 Capital"]
[null,"440",{"$f":"C$7&\".16\"","v":"1.1.1.16"},"(-) Excess of deduction from AT1 items over AT1 Capital",{"$f":"-E79","v":0}]
[null,"450",{"$f":"C$7&\".17\"","v":"1.1.1.17"},"(-) Qualifying holdings outside the financial sector which can alternatively be subject to a 1.250% risk weight"]
[null,"460",{"$f":"C$7&\".18\"","v":"1.1.1.18"},"(-) Securitisation positions which can alternatively be subject to a 1.250% risk weight"]
[null,"470",{"$f":"C$7&\".19\"","v":"1.1.1.19"},"(-) Free deliveries which can alternatively be subject to a 1.250% risk weight",{"$f":"-(SUM(IF('Sheet 1'!F306='Sheet 1'!J305,'Sheet 1'!D306,\"0\")+IF('Sheet 1'!I313='Sheet 1'!J305,'Sheet 1'!G313,\"0\")))","v":0}]
[null,"471",{"$f":"C$7&\".20\"","v":"1.1.1.20"},"(-) Positions in a basket for which an institution cannot determine the risk weight under the IRB approach, and can alternatively be subject to a 1.250% risk weight"]
[null,"472",{"$f":"C$7&\".21\"","v":"1.1.1.21"},"(-) Equity exposures under an internal models approach which can alternatively be subject to a 1.250% risk weight"]
[null,"480",{"$f":"C$7&\".22\"","v":"1.1.1.22"},"(-) CET1 instruments of financial sector entites where the institution does not have a significant investment",{"$f":"IF('Sheet 1'!F404=\"CET 1\",-'Sheet 1'!D404,\"0\")","v":"0"}]
[null,"490",{"$f":"C$7&\".23\"","v":"1.1.1.23"},"(-) Deductible deferred tax assets that rely on future profitability and arise from temporary differences",{"$f":"IF('Sheet 4.1'!E6>0,IF('Sheet 4.1'!E9>'Sheet 4.1'!E30,-('Sheet 4.1'!E9-'Sheet 4.1'!E30),\"0\"),0)","v":0}]
[null,"500",{"$f":"C$7&\".24\"","v":"1.1.1.24"},"(-) CET1 instruments of financial sector entities where the institution has a significant investment"]
[null,"510",{"$f":"C$7&\".25\"","v":"1.1.1.25"},"(-) Amount exceeding the 17.65% threshold",{"$f":"IF('Sheet 4.1'!E6>0,IF('Sheet 4.1'!E30>'Sheet 4.1'!E31,-('Sheet 4.1'!E30-'Sheet 4.1'!E31),0),0)","v":0}]
[null,"520",{"$f":"C$7&\".26\"","v":"1.1.1.26"},"Other transitional adjustments to CET1 Capital",{"$f":"'Sheet 4.2'!F18","v":0}]
[null,"524",{"$f":"C$7&\".27\"","v":"1.1.1.27"},"Additional deductions of CET1 Capital due to Article 3 CRR"]
[null,"529",{"$f":"C$7&\".28\"","v":"1.1.1.28"},"CET1 capital elements or deductions - other"]
[null,"530",{"$f":"C$6&\".2\"","v":"1.1.2"},"ADDITIONAL TIER 1 CAPITAL",{"$f":"E62+E71+E72+E73+E74+E75+E76+E77+E78+E79+E80+E81","v":0}]
[null,"540",{"$f":"C$61&\".1\"","v":"1.1.2.1"},"Capital instruments eligible as AT1 Capital",{"$f":"(E63+E65+E66+E70)","v":0}]
[null,"550",{"$f":"C$62&\".1\"","v":"1.1.2.1.1"},"Paid up capital instruments"]
[null,"560","1.2.1.2*","Memorandum item: Capital instruments not eligible"]
[null,"570",{"$f":"C$62&\".3\"","v":"1.1.2.1.3"},"Share premium",{"$f":"ABS('Sheet 1'!D368)","v":0}]
[null,"580",{"$f":"C$62&\".4\"","v":"1.1.2.1.4"},"(-) Own AT1 instruments",{"$f":"SUM(E67:E69)","v":0}]
[null,"590",{"$f":"C$66&\".1\"","v":"1.1.2.1.4.1"},"(-) Direct holdings of AT1 instruments",{"$f":"IF(AND('Sheet 1'!F396=\"AT 1\",'Sheet 1'!G396=\"Direct\"),-'Sheet 1'!H396,\"0\")","v":"0"}]
[null,"620",{"$f":"C$66&\".2\"","v":"1.1.2.1.4.2"},"(-) Indirect holdings of AT1 instruments",{"$f":"IF(AND('Sheet 1'!F396=\"AT 1\",'Sheet 1'!G396=\"Indirect\"),-'Sheet 1'!H396,\"0\")","v":"0"}]
[null,"621",{"$f":"C$66&\".3\"","v":"1.1.2.1.4.3"},"(-) Synthetic holdings of AT1 instruments",{"$f":"IF(AND('Sheet 1'!F396=\"AT 1\",'Sheet 1'!G396=\"Synthetic\"),-'Sheet 1'!H396,\"0\")","v":"0"}]
[null,"622",{"$f":"C$62&\".5\"","v":"1.1.2.1.5"},"(-) Actual or contingent obligations to purchase own AT1 instruments"]
[null,"660",{"$f":"C$61&\".2\"","v":"1.1.2.2"},"Transitional adjustments due to grandfathered AT1 Capital instruments",{"$f":"'Sheet 4.2'!G9+'Sheet 4.2'!G12","v":0}]
[null,"670",{"$f":"C$61&\".3\"","v":"1.1.2.3"},"Instruments issued by subsidiaries that are given recognition in AT1 Capital"]
[null,"680",{"$f":"C$61&\".4\"","v":"1.1.2.4"},"Transitional adjustments due to additional recognition in AT1 Capital of instruments issued by subsidiaries",{"$f":"'Sheet 4.2'!G13","v":0}]
[null,"690",{"$f":"C$61&\".5\"","v":"1.1.2.5"},"(-) Reciprocal cross holdings in AT1 Capital"]
[null,"700",{"$f":"C$61&\".6\"","v":"1.1.2.6"},"(-) AT1 instruments of financial sector entities where the institution does not have a significant investment",{"$f":"IF('Sheet 1'!F404=\"AT 1\",-'Sheet 1'!D404,\"0\")","v":"0"}]
[null,"710",{"$f":"C$61&\".7\"","v":"1.1.2.7"},"(-) AT1 instruments of financial sector entities where the institution has a significant investment"]
[null,"720",{"$f":"C$61&\".8\"","v":"1.1.2.8"},"(-) Excess of deduction from T2 items over T2 Capital ",{"$f":"-E101","v":0}]
[null,"730",{"$f":"C$61&\".9\"","v":"1.1.2.9"},"Other transitional adjustments to AT1 Capital",{"$f":"'Sheet 4.2'!G18","v":0}]
[null,"740",{"$f":"C$61&\".10\"","v":"1.1.2.10"},"Excess of deduction from AT1 items over AT1 Capital (deducted in CET1)",{"$f":"-MIN(E63+E65+E66+E70+E71+E72+E73+E74+E75+E76+E77+E78,0)","v":0}]
[null,"744",{"$f":"C$61&\".11\"","v":"1.1.2.11"},"Additional deductions of AT1 Capital due to Article 3 CRR"]
[null,"748",{"$f":"C$61&\".12\"","v":"1.1.2.12"}," AT1 capital elements or deductions - other "]
[null,"750",{"$f":"C$5&\".2\"","v":"1.2"},"TIER 2 CAPITAL",{"$f":"E83+E92+E93+E94+E95+E96+E97+E98+E99+E100+E101+E102+E103","v":0}]
[null,"760",{"$f":"C$82&\".1\"","v":"1.2.1"},"Capital instruments and subordinated loans eligible as T2 Capital",{"$f":"E84+E87+E86+E91","v":0}]
[null,"770",{"$f":"C83&\".1\"","v":"1.2.1.1"},"Paid up capital instruments  and subordinated loans ",{"$f":"SUM(ABS('Sheet 1'!D360)+ABS('Sheet 1'!D362))+IF('Subordinated Loan Working'!I31=0,'Subordinated Loan Working'!I10,'Subordinated Loan Working'!I31)+IF('Subordinated Loan Working'!I63=0,'Subordinated Loan Working'!I42,'Subordinated Loan Working'!I63)+IF('Subordinated Loan Working'!I95=0,'Subordinated Loan Working'!I74,'Subordinated Loan Working'!I95)+ABS('Sheet 1'!D358)+ABS('Sheet 1'!D359)","v":0}]
[null,"780","1.3.1.2*","Memorandum item: Capital instruments and subordinated loans not eligible"]
[null,"790",{"$f":"C$83&\".3\"","v":"1.2.1.3"},"Share premium",{"$f":"ABS('Sheet 1'!D369)","v":0}]
[null,"800",{"$f":"C$83&\".4\"","v":"1.2.1.4"},"(-) Own T2 instruments",{"$f":"SUM(E88+E89+E90)","v":0}]
[null,"810",{"$f":"C$87&\".1\"","v":"1.2.1.4.1"},"(-) Direct holdings of T2 instruments",{"$f":"IF(AND('Sheet 1'!F396=\"T2\",'Sheet 1'!G396=\"Direct\"),-'Sheet 1'!H396,\"0\")","v":"0"}]
[null,"840",{"$f":"C$87&\".2\"","v":"1.2.1.4.2"},"(-) Indirect holdings of T2 instruments",{"$f":"IF(AND('Sheet 1'!F396=\"T2\",'Sheet 1'!G396=\"Indirect\"),-'Sheet 1'!H396,\"0\")","v":"0"}]
[null,"841",{"$f":"C$87&\".3\"","v":"1.2.1.4.3"},"(-) Synthetic holdings of T2 instruments",{"$f":"IF(AND('Sheet 1'!F396=\"T2\",'Sheet 1'!G396=\"Synthetic\"),-'Sheet 1'!H396,\"0\")","v":"0"}]
[null,"842",{"$f":"C$83&\".5\"","v":"1.2.1.5"},"(-) Actual or contingent obligations to purchase own T2 instruments"]
[null,"880",{"$f":"C$82&\".2\"","v":"1.2.2"},"Transitional adjustments due to grandfathered T2 Capital instruments and subordinated loans ",{"$f":"'Sheet 4.2'!H12+'Sheet 4.2'!H9","v":0}]
[null,"890",{"$f":"C$82&\".3\"","v":"1.2.3"},"Instruments issued by subsidiaries that are given recognition in T2 Capital"]
[null,"900",{"$f":"C$82&\".4\"","v":"1.2.4"},"Transitional adjustments due to additional recognition in T2 Capital of instruments issued by subsidiaries",{"$f":"'Sheet 4.2'!H13","v":0}]
[null,"910",{"$f":"C$82&\".5\"","v":"1.2.5"},"IRB Excess of provisions over expected losses eligible"]
[null,"920",{"$f":"C$82&\".6\"","v":"1.2.6"},"SA General credit risk adjustments"]
[null,"930",{"$f":"C$82&\".7\"","v":"1.2.7"},"(-) Reciprocal cross holdings in T2 Capital"]
[null,"940",{"$f":"C$82&\".8\"","v":"1.2.8"},"(-) T2 instruments of financial sector entities where the institution does not have a significant investment",{"$f":"IF('Sheet 1'!F404=\"T2\",-'Sheet 1'!D404,\"0\")","v":"0"}]
[null,"950",{"$f":"C$82&\".9\"","v":"1.2.9"},"(-) T2 instruments of financial sector entities where the institution has a significant investment"]
[null,"960",{"$f":"C$82&\".10\"","v":"1.2.10"},"Other transitional adjustments to T2 Capital",{"$f":"'Sheet 4.2'!H18","v":0}]
[null,"970",{"$f":"C$82&\".11\"","v":"1.2.11"},"Excess of deduction from T2 items over T2 Capital (deducted in AT1)",{"$f":"-MIN(E84+E86+E92+E93+E94+E95+E96+E97+E98+E99+E100+E87+E91,0)","v":0}]
[null,"974",{"$f":"C$82&\".12\"","v":"1.2.12"},"Additional deductions of T2 Capital due to Article 3 CRR"]
[null,"978",{"$f":"C$82&\".13\"","v":"1.2.13"},"T2 capital elements or deductions - other"]

{"sheet":"Sheet 4.1","index":9,"n_rows":127,"n_cols":5,"rows_kept":127,"cut":false,"hidden":false,"merged":[]}
[]
[null,"C 04.00 - MEMORANDUM ITEMS (CA4)"]
[]
[null,"Row","ID","Item","Amount"]
[null,"Deferred tax assets and liabilities"]
[null,"010",1,"Total deferred tax assets",{"$f":"'Sheet 1'!D92","v":0}]
[null,"020",{"$f":"C$6&\".1\"","v":"1.1"},"Deferred tax assets that do not rely on future profitability"]
[null,"030",{"$f":"C$6&\".2\"","v":"1.2"},"Deferred tax assets that rely on future profitability and do not arise from temporary differences"]
[null,"040",{"$f":"C$6&\".3\"","v":"1.3"},"Deferred tax assets that rely on future profitability and arise from temporary differences"]
[null,"050",2,"Total deferred tax liabilities",{"$f":"-'Sheet 1'!D351","v":0}]
[null,"060",{"$f":"C$10&\".1\"","v":"2.1"},"Deferred tax liabilities non deductible from deferred tax assets that rely on future profitability",{"$f":"SUM('Sheet 4'!E37+'Sheet 4'!E40+'Sheet 4'!E45)","v":0}]
[null,"070",{"$f":"C$10&\".2\"","v":"2.2"},"Deferred tax liabilities deductible from deferred tax assets that rely on future profitability",{"$f":"SUM(E13:E14)","v":0}]
[null,"080",{"$f":"C$12&\".1\"","v":"2.2.1"},"Deductible deferred tax liabilities associated with deferred tax assets that rely on future profitability and do not arise from temporary differences"]
[null,"090",{"$f":"C$12&\".2\"","v":"2.2.2"},"Deductible deferred tax liabilities associated with deferred tax assets that rely on future profitability and arise from temporary differences"]
[null,"Credit risk adjustments and expected losses"]
[null,"100",3,"IRB excess (+) or shortfall (-) of credit risk adjustments, additional value adjustments and other own funds reductions to expected losses for non defaulted exposures",{"$f":"SUM(E17+E21)","v":0}]
[null,"110",{"$f":"C$16&\".1\"","v":"3.1"},"Total credit risk adjustments, additional value adjustments and other own funds reductions eligible for inclusion in the calculation of the expected loss amount",{"$f":"SUM(E18+E19+E20)","v":0}]
[null,"120",{"$f":"C$17&\".1\"","v":"3.1.1"},"General credit risk adjustments"]
[null,"130",{"$f":"C$17&\".2\"","v":"3.1.2"},"Specific credit risk adjustments"]
[null,"131",{"$f":"C$17&\".3\"","v":"3.1.3"},"Additional value adjustments and other own funds reductions"]
[null,"140",{"$f":"C$16&\".2\"","v":"3.2"},"Total expected losses eligible "]
[null,"145",4,"IRB excess (+) or shortfall (-) of specific credit risk adjustments to expected losses for defaulted exposures"]
[null,"150",{"$f":"C$22&\".1\"","v":"4.1"},"Specific credit risk adjustments and positions treated similarily"]
[null,"155",{"$f":"C$22&\".2\"","v":"4.2"},"Total expected losses eligible "]
[null,"160",5,"Risk weighted exposure amounts for calculating the cap to the excess of provision eligible as T2"]
[null,"170",6,"Total gross provisions eligible for inclusion in T2 capital"]
[null,"180",7,"Risk weighted exposure amounts for calculating the cap to the provision eligible as T2"]
[null,"Thresholds for Common Equity Tier 1 deductions"]
[null,190,8,"Threshold non deductible of holdings in relevant entities where an institution does not have a significant investment",{"$f":"10%*('Sheet 4'!E8+'Sheet 4'!E17+'Sheet 4'!E22+'Sheet 4'!E24+'Sheet 4'!E26+'Sheet 4'!E28-'Sheet 4'!E34-'Sheet 4'!E38-'Sheet 4'!E41-'Sheet 4'!E42-'Sheet 4'!E43-'Sheet 4'!E47-'Sheet 4'!E49-'Sheet 4'!E50-'Sheet 4'!E51)","v":0}]
[null,200,9,"10% CET1 threshold",{"$f":"10%*('Sheet 4'!E8+'Sheet 4'!E17+'Sheet 4'!E22+'Sheet 4'!E23+'Sheet 4'!E24+'Sheet 4'!E25+'Sheet 4'!E26+'Sheet 4'!E28+'Sheet 4'!E34+'Sheet 4'!E38+'Sheet 4'!E41+'Sheet 4'!E42+'Sheet 4'!E43+'Sheet 4'!E47+'Sheet 4'!E50+'Sheet 4'!E51+'Sheet 4'!E52+'Sheet 4'!E53+'Sheet 4'!E54)","v":0}]
[null,210,10,"17.65% CET1 threshold",{"$f":"17.65%*('Sheet 4'!E8+'Sheet 4'!E17+'Sheet 4'!E22+'Sheet 4'!E23+'Sheet 4'!E24+'Sheet 4'!E25+'Sheet 4'!E26+'Sheet 4'!E27+'Sheet 4'!E28+'Sheet 4'!E34+'Sheet 4'!E38+'Sheet 4'!E41+'Sheet 4'!E42+'Sheet 4'!E43+'Sheet 4'!E47+'Sheet 4'!E50+'Sheet 4'!E51+'Sheet 4'!E52+'Sheet 4'!E53+'Sheet 4'!E54+'Sheet 4'!E48+'Sheet 4'!E49+'Sheet 4'!E56-SUM(E8:E9))","v":0}]
[null,220,11,"Eligible capital for the purposes of qualifying holdings outside the financial sector and large exposures",{"$f":"SUM('Sheet 4'!E7+'Sheet 4'!E61+IF('Sheet 4'!E82>1/3*('Sheet 4'!E7+'Sheet 4'!E61),1/3*('Sheet 4'!E7+'Sheet 4'!E61),'Sheet 4'!E82))","v":0}]
[null,"Investments in the capital of financial sector entities where the institution does not have a significant investment"]
[null,230,12,"Holdings of CET1 capital of financial sector entities where the institution does not have a significant investment, net of short positions",{"$f":"SUM(E35+E38+E41)","v":0}]
[null,240,{"$f":"C34&\".1\"","v":"12.1"},"Direct holdings of CET1 capital of financial sector entities where the institution does not have a significant investment",{"$f":"SUM(E36:E37)","v":0}]
[null,250,{"$f":"C35&\".1\"","v":"12.1.1"},"Gross direct holdings of CET1 capital of financial sector entities where the institution does not have a significant investment"]
[null,260,{"$f":"C35&\".2\"","v":"12.1.2"},"(-) Permitted offsetting short positions in relation to the direct gross holdings included above"]
[null,270,{"$f":"C34&\".2\"","v":"12.2"},"Indirect holdings of CET1 capital of financial sector entities where the institution does not have a significant investment",{"$f":"SUM(E39+E40)","v":0}]
[null,280,{"$f":"C38&\".1\"","v":"12.2.1"},"Gross indirect holdings of CET1 capital of financial sector entities where the institution does not have a significant investment"]
[null,290,{"$f":"C38&\".2\"","v":"12.2.2"},"(-) Permitted offsetting short positions in relation to the indirect gross holdings included above"]
[null,"291",{"$f":"C34&\".3\"","v":"12.3"},"Synthetic holdings of CET1 capital of financial sector entities where the institution does not have a significant investment",{"$f":"SUM(E42+E43)","v":0}]
[null,"292",{"$f":"C41&\".1\"","v":"12.3.1"},"Gross synthetic holdings of CET1 capital of financial sector entities where the institution does not have a significant investment"]
[null,"293",{"$f":"C41&\".2\"","v":"12.3.2"},"(-) Permitted offsetting short positions in relation to the synthetic gross holdings included above"]
[null,300,13,"Holdings of AT1 capital of financial sector entities where the institution does not have a significant investment, net of short positions ",{"$f":"SUM(E45+E48+E51)","v":0}]
[null,310,{"$f":"C44&\".1\"","v":"13.1"},"Direct holdings of AT1 capital of financial sector entities where the institution does not have a significant investment",{"$f":"SUM(E46+E47)","v":0}]
[null,320,{"$f":"C45&\".1\"","v":"13.1.1"},"Gross direct holdings of AT1 capital of financial sector entities where the institution does not have a significant investment"]
[null,330,{"$f":"C45&\".2\"","v":"13.1.2"},"(-) Permitted offsetting short positions in relation to the direct gross holdings included above"]
[null,340,{"$f":"C44&\".2\"","v":"13.2"},"Indirect holdings of AT1 capital of financial sector entities where the institution does not have a significant investment",{"$f":"SUM(E49+E50)","v":0}]
[null,350,{"$f":"C48&\".1\"","v":"13.2.1"},"Gross indirect holdings of AT1 capital of financial sector entities where the institution does not have a significant investment"]
[null,360,{"$f":"C48&\".2\"","v":"13.2.2"},"(-) Permitted offsetting short positions in relation to the indirect gross holdings included above"]
[null,"361",{"$f":"C44&\".3\"","v":"13.3"},"Synthetic holdings of AT1 capital of financial sector entities where the institution does not have a significant investment",{"$f":"SUM(E52+E53)","v":0}]
[null,"362",{"$f":"C51&\".1\"","v":"13.3.1"},"Gross synthetic holdings of AT1 capital of financial sector entities where the institution does not have a significant investment"]
[null,"363",{"$f":"C51&\".2\"","v":"13.3.2"},"(-) Permitted offsetting short positions in relation to the synthetic gross holdings included above"]
[null,370,14,"Holdings of T2 capital of financial sector entities where the institution does not have a significant investment, net of short positions",{"$f":"SUM(E55+E58+E61)","v":0}]
[null,380,{"$f":"C54&\".1\"","v":"14.1"},"Direct holdings of T2 capital of financial sector entities where the institution does not have a significant investment",{"$f":"SUM(E56+E57)","v":0}]
[null,390,{"$f":"C55&\".1\"","v":"14.1.1"},"Gross direct holdings of T2 capital of financial sector entities where the institution does not have a significant investment"]
[null,400,{"$f":"C55&\".2\"","v":"14.1.2"},"(-) Permitted offsetting short positions in relation to the direct gross holdings included above"]
[null,410,{"$f":"C54&\".2\"","v":"14.2"},"Indirect holdings of T2 capital of financial sector entities where the institution does not have a significant investment",{"$f":"SUM(E59+E60)","v":0}]
[null,420,{"$f":"C58&\".1\"","v":"14.2.1"},"Gross indirect holdings of T2 capital of financial sector entities where the institution does not have a significant investment"]
[null,430,{"$f":"C58&\".2\"","v":"14.2.2"},"(-) Permitted offsetting short positions in relation to the indirect gross holdings included above"]
[null,"431",{"$f":"C54&\".3\"","v":"14.3"},"Synthetic holdings of T2 capital of financial sector entities where the institution does not have a significant investment",{"$f":"SUM(E62+E63)","v":0}]
[null,"432",{"$f":"C61&\".1\"","v":"14.3.1"},"Gross synthetic holdings of T2 capital of financial sector entities where the institution does not have a significant investment"]
[null,"433",{"$f":"C61&\".2\"","v":"14.3.2"},"(-) Permitted offsetting short positions in relation to the synthetic gross holdings included above"]
[null,"Investments in the capital of financial sector entities where the institution has a significant investment   "]
[null,440,15,"Holdings of CET1 capital of financial sector entities where the institution has a significant investment, net of short positions",{"$f":"SUM(E66+E69+E72)","v":0}]
[null,450,{"$f":"C65&\".1\"","v":"15.1"},"Direct holdings of CET1 capital of financial sector entities where the institution has a significant investment",{"$f":"SUM(E67+E68)","v":0}]
[null,460,{"$f":"C66&\".1\"","v":"15.1.1"},"Gross direct holdings of CET1 capital of financial sector entities where the institution has a significant investment"]
[null,470,{"$f":"C66&\".2\"","v":"15.1.2"},"(-) Permitted offsetting short positions in relation to the direct gross holdings included above"]
[null,480,{"$f":"C65&\".2\"","v":"15.2"},"Indirect holdings of CET1 capital of financial sector entities where the institution has a significant investment",{"$f":"SUM(E70+E71)","v":0}]
[null,490,{"$f":"C69&\".1\"","v":"15.2.1"},"Gross indirect holdings of CET1 capital of financial sector entities where the institution has a significant investment"]
[null,500,{"$f":"C69&\".2\"","v":"15.2.2"},"(-) Permitted offsetting short positions in relation to the indirect gross holdings included above"]
[null,"501",{"$f":"C65&\".3\"","v":"15.3"},"Synthetic holdings of CET1 capital of financial sector entities where the institution has a significant investment",{"$f":"SUM(E73+E74)","v":0}]
[null,"502",{"$f":"C72&\".1\"","v":"15.3.1"},"Gross synthetic holdings of CET1 capital of financial sector entities where the institution has a significant investment"]
[null,"503",{"$f":"C72&\".2\"","v":"15.3.2"},"(-) Permitted offsetting short positions in relation to the synthetic gross holdings included above"]
[null,510,16,"Holdings of AT1 capital of financial sector entities where the institution has a significant investment, net of short positions ",{"$f":"SUM(E76+E79+E82)","v":0}]
[null,520,{"$f":"C75&\".1\"","v":"16.1"},"Direct holdings of AT1 capital of financial sector entities where the institution has a significant investment",{"$f":"SUM(E77+E78)","v":0}]
[null,530,{"$f":"C76&\".1\"","v":"16.1.1"},"Gross direct holdings of AT1 capital of financial sector entities where the institution has a significant investment"]
[null,540,{"$f":"C76&\".2\"","v":"16.1.2"},"(-) Permitted offsetting short positions in relation to the direct gross holdings included above"]
[null,550,{"$f":"C75&\".2\"","v":"16.2"},"Indirect holdings of AT1 capital of financial sector entities where the institution has a significant investment",{"$f":"SUM(E80+E81)","v":0}]
[null,560,{"$f":"C79&\".1\"","v":"16.2.1"},"Gross indirect holdings of AT1 capital of financial sector entities where the institution has a significant investment"]
[null,570,{"$f":"C79&\".2\"","v":"16.2.2"},"(-) Permitted offsetting short positions in relation to the indirect gross holdings included above"]
[null,"571",{"$f":"C75&\".3\"","v":"16.3"},"Synthetic holdings of AT1 capital of financial sector entities where the institution has a significant investment",{"$f":"SUM(E83+E84)","v":0}]
[null,"572",{"$f":"C82&\".1\"","v":"16.3.1"},"Gross synthetic holdings of AT1 capital of financial sector entities where the institution has a significant investment"]
[null,"573",{"$f":"C82&\".2\"","v":"16.3.2"},"(-) Permitted offsetting short positions in relation to the synthetic gross holdings included above"]
[null,580,17,"Holdings of T2 capital of financial sector entities where the institution has a significant investment, net of short positions",{"$f":"SUM(E86+E89+E92)","v":0}]
[null,590,{"$f":"C85&\".1\"","v":"17.1"},"Direct holdings of T2 capital of financial sector entities where the institution has a significant investment",{"$f":"E87+E88","v":0}]
[null,600,{"$f":"C86&\".1\"","v":"17.1.1"},"Gross direct holdings of T2 capital of financial sector entities where the institution has a significant investment"]
[null,610,{"$f":"C86&\".2\"","v":"17.1.2"},"(-) Permitted offsetting short positions in relation to the direct gross holdings included above"]
[null,620,{"$f":"C85&\".2\"","v":"17.2"},"Indirect holdings of T2 capital of financial sector entities where the institution has a significant investment",{"$f":"SUM(E90:E91)","v":0}]
[null,630,{"$f":"C89&\".1\"","v":"17.2.1"},"Gross indirect holdings of T2 capital of financial sector entities where the institution has a significant investment"]
[null,640,{"$f":"C89&\".2\"","v":"17.2.2"},"(-) Permitted offsetting short positions in relation to the indirect gross holdings included above"]
[null,"641",{"$f":"C85&\".3\"","v":"17.3"},"Synthetic holdings of T2 capital of financial sector entities where the institution has a significant investment",{"$f":"SUM(E93+E94)","v":0}]
[null,"642",{"$f":"C92&\".1\"","v":"17.3.1"},"Gross synthetic holdings of T2 capital of financial sector entities where the institution has a significant investment"]
[null,"643",{"$f":"C92&\".2\"","v":"17.3.2"},"(-) Permitted offsetting short positions in relation to the synthetic gross holdings included above"]
[null,"Total risk exposure amounts of holdings not deducted from the corresponding capital category:"]
[null,650,18,"Risk weighted exposures of CET1 holdings in financial sector entities which are not deducted from the institution's CET1 capital"]
[null,660,19,"Risk weighted exposures of AT1 holdings in financial sector entities which are not deducted from the institution's AT1 capital"]
[null,670,20,"Risk weighted exposures of T2 holdings in financial sector entities which are not deducted from the institution's T2 capital"]
[null,"Temporary waiver from deduction from own funds"]
[null,680,21,"Holdings on CET1 Capital Instruments of financial sector entities where the institution does not have a significant investment temporary waived"]
[null,690,22,"Holdings on CET1 Capital Instruments of financial sector entities where the institution has a significant investment  temporary waived"]
[null,700,23,"Holdings on AT1 Capital Instruments of financial sector entities where the institution does not have a significant investment temporary waived"]
[null,710,24,"Holdings on AT1 Capital Instruments of financial sector entities where the institution has a significant investment  temporary waived"]
[null,720,25,"Holdings on T2 Capital Instruments of financial sector entities where the institution does not have a significant investment  temporary waived"]
[null,730,26,"Holdings on T2 Capital Instruments of financial sector entities where the institution has a significant investment temporary waived"]
[null,"Capital buffers"]
[null,740,27,"Combined Buffer Requirement",{"$f":"SUM(E108+E111)","v":0}]
[null,"750",null,"Total capital conservation buffer",{"$f":"SUM(E109:E110)","v":0}]
[null,"760",null,"Conservation buffer due to macro-prudential or systemic risk identified at the level of a Member State"]
[null,"770",null,"Institution specific countercyclical capital buffer"]
[null,"780",null,"Systemic risk buffer"]
[null,"790",null,"Systemical important institution buffer"]
[null,800,null,"Global Systemically Important Institution buffer"]
[null,810,null,"Other Systemically Important Institution buffer"]
[null,"Pillar II requirements"]
[null,820,28,"Own funds requirements related to Pillar II adjustments"]
[null,"Additional information for investment firms"]
[null,830,29,"Initial capital"]
[null,840,30,"Own funds based on Fixed Overheads"]
[null,"Additional information for calculating of reporting thresholds"]
[null,850,31,"Non-domestic original exposures"]
[null,860,32,"Total original exposures"]
[null,"Basel I floor"]
[null,870,null,"Adjustments to total own funds"]
[null,880,null,"Own funds fully adjusted for Basel I floor"]
[null,890,null,"Own funds requirements for Basel I floor"]
[null,900,null,"Own funds requirements for Basel I floor - SA alternative"]

{"sheet":"Sheet 4.2","index":10,"n_rows":63,"n_cols":11,"rows_kept":63,"cut":false,"hidden":false,"merged":[[1,1,1,10],[3,1,4,3],[3,4,5,4],[3,5,4,5],[3,6,4,6],[3,7,4,7],[3,8,4,8],[3,9,3,10]]}
[]
[null,"C 05.01 - TRANSITIONAL PROVISIONS (CA5.1)"]
[]
[null,"CA 5.1",null,null,"Legal references","Adjustments to CET1","Adjustments to AT1","Adjustments to T2","Adjustments included in RWAs","Memorandum items"]
[null,null,null,null,null,null,null,null,null,"Applicable percentage","Eligible amount without transitional provisions"]
[null,"Code","ID","Item",null,"010","020","030","040","050","060"]
[null,"010","1","TOTAL ADJUSTMENTS",null,{"$f":"SUM(F8+F13+F18)","v":0},{"$f":"SUM(G8+G13+G18)","v":0},{"$f":"SUM(H8+H13+H18)","v":0},0,null,0]
[null,"020","1.1","GRANDFATHERED INSTRUMENTS",null,{"$f":"SUM(F9+F12)","v":0},{"$f":"SUM(G9+G12)","v":0},{"$f":"SUM(H9+H12)","v":0},0,null,0]
[null,"030","1.1.1","Grandfathered instruments: Instruments constituting state aid","Article 462 of CRR",{"$f":"SUM(F10+F11)","v":0},{"$f":"SUM(G10+G11)","v":0},{"$f":"SUM(H10+H11)","v":0}]
[null,"040","1.1.1.1","Instruments that qualified as own funds according to 2006/48/EC","Article 462 (2), (3) and (4) of CRR",0,0,0]
[null,"050","1.1.1.2","Instruments issued by institutions that are incorporated in a Member State that is subject to an Economic Adjustment Programme","Article 462(1), (2a), (3a), (5) and (6) of CRR",0,0,0]
[null,"060","1.1.2","Instruments not constituting state aid",null,0,0,0]
[null,"070","1.2","MINORITY INTERESTS AND EQUIVALENTS",null,{"$f":"SUM(F14:F15)","v":0},{"$f":"SUM(G16)","v":0},{"$f":"SUM(H17)","v":0}]
[null,"080","1.2.1","Capital instruments and items that do not qualify as minority interests","Articles 459 of CRR",0,null,null,null,0]
[null,"090","1.2.2","Transitional recognition in consolidated own funds of minority interests","Articles 79 and 460 of CRR",0,null,null,null,1,{"$f":"'Sheet 4'!E26","v":0}]
[null,"091","1.2.3","Transitional recognition in consolidated own funds of qualifying Additional Tier 1 capital","Article 80 and 460 of CRR",null,0,null,null,1,{"$f":"'Sheet 4'!E72","v":0}]
[null,"092","1.2.4","Transitional recognition in consolidated own funds of qualifying Tier 2 capital","Article 82 and 460 of CRR",null,null,0,null,1,{"$f":"'Sheet 4'!E93","v":0}]
[null,"100","1.3","OTHER TRANSITIONAL ADJUSTMENTS","(sum, no link to CA1)",{"$f":"SUM(F19+F25+F63)","v":0},{"$f":"SUM(G25+G63)","v":0},{"$f":"SUM(H25+H63)","v":0}]
[null,"110","1.3.1","Unrealised gains and losses",null,{"$f":"SUM(F20:F24)","v":0}]
[null,"120","1.3.1.1","Unrealised gains","Article 450 of CRR",{"$f":"-(J20*K20)","v":0},null,null,null,{"$f":"SUMIF('Applicable Percentages'!A32:A36,'COVER SHEET'!B1,'Applicable Percentages'!B32:B36)","v":0},{"$f":"SUM('Sheet 2'!M104+ABS('Sheet 1'!G372))-K22","v":0}]
[null,"130","1.3.1.2","Unrealised losses","Article 449 of CRR",{"$f":"0","v":0},null,null,null,{"$f":"SUMIF('Applicable Percentages'!A32:A36,'COVER SHEET'!B1,'Applicable Percentages'!C32:C36)","v":0},{"$f":"'Sheet 2'!N104-'Sheet 1'!F372-K23","v":0}]
[null,"133","1.3.1.3.","Unrealised gains on exposures to central governments classified in the \"Available for sale\" category of EU-endorsed IAS39","Article 449 of CRR",{"$f":"-(J22*K22)","v":0},null,null,null,{"$f":"SUMIF('Applicable Percentages'!A32:A36,'COVER SHEET'!B1,'Applicable Percentages'!B32:B36)","v":0},{"$f":"IF('Sheet 1'!L81<0,ABS('Sheet 1'!L81),0)","v":0}]
[null,"136","1.3.1.4.","Unrealised loss on exposures to central governments classified in the \"Available for sale\" category of EU-endorsed IAS39","Article 449 of CRR",0,null,null,null,{"$f":"SUMIF('Applicable Percentages'!A32:A36,'COVER SHEET'!B1,'Applicable Percentages'!C32:C36)","v":0},{"$f":"IF('Sheet 1'!L81>0,-'Sheet 1'!L81,0)","v":0}]
[null,"138","1.3.1.5.","Fair value gains and losses arising from the institution's own credit risk related to derivative liabilities","Article 450 of CRR",0,null,null,null,1,{"$f":"'Sheet 4'!E32","v":0}]
[null,"140","1.3.2","Deductions","(sum, no link to CA1)",{"$f":"SUM(F26+F27+F28+F29+F30+F33+F43+F53+F58+F57+F62)","v":0},{"$f":"SUM(G26+G27+G29+G33+G43+G53+G58)","v":0},{"$f":"SUM(H29+H33+H43+H53+H58)","v":0},{"$f":"SUM(I28+I33+I43+I53+I58+I57)","v":0},null,{"$f":"K26+K27+K28+K29+K30+K33+K43+K53+K58","v":0}]
[null,"150","1.3.2.1","Losses for the current financial year","Articles 33 (1) point (a), 451 (1), 453 (2) and 458 of CRR",0,0,null,null,{"$f":"SUMIF('Applicable Percentages'!A39:A43,'COVER SHEET'!B1,'Applicable Percentages'!B39:B43)","v":0},{"$f":"IF('Sheet 4'!E18<0,'Sheet 4'!E18,0)","v":0}]
[null,"160","1.3.2.2","Intangible assets","Articles 33 (1) point (b), 451 (1), 453 (3) and 458 of CRR",0,0,null,null,{"$f":"SUMIF('Applicable Percentages'!A39:A43,'COVER SHEET'!B1,'Applicable Percentages'!B39:B43)","v":0},{"$f":"'Sheet 4'!E38","v":0}]
[null,"170","1.3.2.3","Deferred tax assets that rely on future profitability and do not arise from temporary differences","Articles 33 (1) point (c), 451 (1), 453 (4) and 458 of CRR",0,null,null,0,{"$f":"SUMIF('Applicable Percentages'!A39:A43,'COVER SHEET'!B1,'Applicable Percentages'!B39:B43)","v":0},{"$f":"'Sheet 4'!E41","v":0}]
[null,"180","1.3.2.4","IRB shortfall of provisions to expected losses","Articles 33 (1) point (d), 451 (1), 453 (5) and 458 of CRR",0,0,0,null,{"$f":"SUMIF('Applicable Percentages'!A39:A43,'COVER SHEET'!B1,'Applicable Percentages'!B39:B43)","v":0},{"$f":"'Sheet 4'!E42","v":0}]
[null,"190","1.3.2.5","Defined benefit pension fund assets","Articles 33 (1) point (e), 451 (1), 453 (6) and 458 of CRR",0,null,null,null,{"$f":"SUMIF('Applicable Percentages'!A39:A43,'COVER SHEET'!B1,'Applicable Percentages'!B39:B43)","v":0},{"$f":"'Sheet 4'!E43","v":0}]
[null,"194","1.3.2.5*","of which: Introduction of amendments to IAS 19 - positive item","Article 473 of CRR"]
[null,"198","1.3.2.5**","of which: Introduction of amendments to IAS 19 - negative item","Article 473 of CRR"]
[null,"200","1.3.2.6","Own instruments",null,{"$f":"SUM(F34+F37+F40)","v":0},{"$f":"SUM(G34+G37+G40)","v":0},{"$f":"SUM(H34+H37+H40)","v":0},{"$f":"SUM(I34+I37+I40)","v":0},null,{"$f":"SUM(K34+K37+K40)","v":0}]
[null,"210","1.3.2.6.1","Own CET1 instruments","Articles 33 (1) point (f), 451 (1), 453 (7) and 458 of CRR",0,0,null,0,{"$f":"SUMIF('Applicable Percentages'!A39:A43,'COVER SHEET'!B1,'Applicable Percentages'!B39:B43)","v":0},{"$f":"'Sheet 4'!E12","v":0}]
[null,"211","1.3.2.6.1**","of which: Direct holdings",null,0,0,null,null,{"$f":"SUMIF('Applicable Percentages'!A39:A43,'COVER SHEET'!B1,'Applicable Percentages'!B39:B43)","v":0},{"$f":"'Sheet 4'!E13","v":"0"}]
[null,"212","1.3.2.6.1*","of which: Indirect holdings",null,0,null,null,0,{"$f":"SUMIF('Applicable Percentages'!A39:A43,'COVER SHEET'!B1,'Applicable Percentages'!B39:B43)","v":0},{"$f":"'Sheet 4'!E14","v":"0"}]
[null,"220","1.3.2.6.2","Own AT1 instruments","Articles 53 point (a), 454, 455(2) and 458 of CRR",0,0,null,0,{"$f":"SUMIF('Applicable Percentages'!A39:A43,'COVER SHEET'!B1,'Applicable Percentages'!B39:B43)","v":0},{"$f":"'Sheet 4'!E66","v":0}]
[null,"221","1.3.2.6.2**","of which: Direct holdings",null,0,0,null,null,{"$f":"SUMIF('Applicable Percentages'!A39:A43,'COVER SHEET'!B1,'Applicable Percentages'!B39:B43)","v":0},{"$f":"'Sheet 4'!E67","v":"0"}]
[null,"222","1.3.2.6.2*","of which: Indirect holdings",null,null,null,null,0,{"$f":"SUMIF('Applicable Percentages'!A39:A43,'COVER SHEET'!B1,'Applicable Percentages'!B39:B43)","v":0},{"$f":"'Sheet 4'!E68","v":"0"}]
[null,"230","1.3.2.6.3","Own T2 instruments","Articles 63 point (a), 456, 457(2) and 458 of CRR",null,null,0,0,{"$f":"SUMIF('Applicable Percentages'!A39:A43,'COVER SHEET'!B1,'Applicable Percentages'!B39:B43)","v":0},{"$f":"'Sheet 4'!E87","v":0}]
[null,"231","1.3.2.6.3*","of which: Direct holdings",null,null,null,0,null,{"$f":"SUMIF('Applicable Percentages'!A39:A43,'COVER SHEET'!B1,'Applicable Percentages'!B39:B43)","v":0},{"$f":"'Sheet 4'!E88","v":"0"}]
[null,"232","1.3.2.6.3**","of which: Indirect holdings",null,null,null,null,0,{"$f":"SUMIF('Applicable Percentages'!A39:A43,'COVER SHEET'!B1,'Applicable Percentages'!B39:B43)","v":0},{"$f":"'Sheet 4'!E89","v":"0"}]
[null,"240","1.3.2.7","Reciprocal cross holdings",null,{"$f":"SUM(F44+F45+F46+F48+F49+F51+F52)","v":0},{"$f":"SUM(G45+G46+G47+G48+G49+G51+G52)","v":0},{"$f":"SUM(H45+H46+H48+H49+H50+H51+H52)","v":0},{"$f":"SUM(I45+I46+I48+I49+I51+I52)","v":0},null,{"$f":"SUM(K44+K47+K50)","v":0}]
[null,"250","1.3.2.7.1","Reciprocal cross holdings in CET1 Capital","Articles 33(1) point (g), 451 (1), 453(8) and 458 of CRR",0,null,null,null,{"$f":"SUMIF('Applicable Percentages'!A39:A43,'COVER SHEET'!B1,'Applicable Percentages'!B39:B43)","v":0},{"$f":"'Sheet 4'!E47","v":0}]
[null,"260","1.3.2.7.1.1","Reciprocal cross holdings in CET1 Capital of financial sector entities where the institution does not have a significant investment","Articles 33(1) point (g), 451 (1), 453(8) point (a) and 458 of CRR",0,0,0,0]
[null,"270","1.3.2.7.1.2","Reciprocal cross holdings in CET1 Capital of financial sector entities where the institution has a significant investment","Articles 33(1) point (g), 451 (1), 453(8) point (b) and 458 of CRR",0,0,0,0]
[null,"280","1.3.2.7.2","Reciprocal cross holdings in AT1 Capital","Articles 53 point (b), 454, 455(3) and 458 of CRR",null,0,null,null,{"$f":"SUMIF('Applicable Percentages'!A39:A43,'COVER SHEET'!B1,'Applicable Percentages'!B39:B43)","v":0},{"$f":"'Sheet 4'!E74","v":0}]
[null,"290","1.3.2.7.2.1","Reciprocal cross holdings in AT1 Capital of financial sector entities where the institution does not have a significant investment","Articles 53 point (b), 454, 455(3) point (a) and 458 of CRR",0,0,0]
[null,"300","1.3.2.7.2.2","Reciprocal cross holdings in AT1 Capital of financial sector entities where the institution has a significant investment","Articles 53 point (b), 454, 455(3) point (b) and 458 of CRR",0,0,0]
[null,"310","1.3.2.7.3","Reciprocal cross holdings in T2 Capital","Articles 63 point (b), 456, 457(3) and 458 of CRR",null,null,0,null,{"$f":"SUMIF('Applicable Percentages'!A39:A43,'COVER SHEET'!B1,'Applicable Percentages'!B39:B43)","v":0},{"$f":"'Sheet 4'!E97","v":0}]
[null,"320","1.3.2.7.3.1","Reciprocal cross holdings in T2 Capital of financial sector entities where the institution does not have a significant investment","Articles 63 point (b), 456, 457(3) point (a) and 458 of CRR",0,0,0,0]
[null,"330","1.3.2.7.3.2","Reciprocal cross holdings in T2 Capital of financial sector entities where the institution has a significant investment","Articles 63 point (b), 456, 457(3) point (b) and 458 of CRR",0,0,0,0]
[null,"340","1.3.2.8","Own funds instruments of financial sector entities where the institution does not have a significant investment",null,{"$f":"SUM(F54+F55+F56)","v":0},{"$f":"SUM(G54+G55+G56)","v":0},{"$f":"SUM(H54+H55+H56)","v":0},{"$f":"SUM(I54+I55+I56)","v":0},null,{"$f":"SUM(K54:K56)","v":0}]
[null,"350","1.3.2.8.1","CET1 instruments of financial sector entities where the institution does not have a significant investment","Articles 33(1) point (h), 451 (1), 453(9) and 458 of CRR",0,0,0,0,1,{"$f":"'Sheet 4'!E54","v":"0"}]
[null,"360","1.3.2.8.2","AT1 instruments of financial sector entities where the institution does not have a significant investment","Articles 53 point (c), 454, 455(4) and 458 of CRR",0,0,0,0,1,{"$f":"'Sheet 4'!E75","v":"0"}]
[null,"370","1.3.2.8.3","T2 instruments of financial sector entities where the institution does not have a significant investment","Articles 63 point (c), 456, 457(4) and 458 of CRR",0,0,0,0,1,{"$f":"'Sheet 4'!E98","v":"0"}]
[null,"380","1.3.2.9","Deferred tax assets that are dependent on future profitability and arise from temporary differences and CET1 instruments of financial sector entities where the institution has a significant investment","Article 452(2) and (3) of CRR",{"$f":"I57","v":0},null,null,{"$f":"IF(AND(OR('COVER SHEET'!B1=2014,'COVER SHEET'!B1=2015,'COVER SHEET'!B1=2016,'COVER SHEET'!B1=2017),'Sheet 4.1'!E30>'Sheet 4.1'!E31),'Sheet 4.1'!E30-'Sheet 4.1'!E31,0)","v":0},null,{"$f":"IF('Sheet 4.1'!E9>0,-MIN('Sheet 4.1'!E9,'Sheet 4.1'!E30),0)","v":0}]
[null,"390","1.3.2.10","Own funds instruments of financial sector entities where the institution has a significant investment",null,{"$f":"SUM(F59+F60+F61)","v":0},{"$f":"SUM(G59+G60+G61)","v":0},{"$f":"SUM(H59+H60+H61)","v":0},{"$f":"SUM(I59+I60+I61)","v":0},null,{"$f":"SUM(K59:K61)","v":0}]
[null,"400","1.3.2.10.1","CET1 instruments of financial sector entities where the institution has a significant investment","Articles 33(1) point (i), 451 (1), 453(10) and 458 of CRR",0,0,0,0,1,{"$f":"'Sheet 4'!E56","v":0}]
[null,"410","1.3.2.10.2","AT1 instruments of financial sector entities where the institution has a significant investment","Articles 53 point (d), 454, 455(4) and 458 of CRR",0,0,0,0,1,{"$f":"'Sheet 4'!E76","v":0}]
[null,"420","1.3.2.10.3","T2 instruments of financial sector entities where the institution has a significant investment","Articles 63 point (d), 456, 457(4) and 458 of CRR",0,0,0,0,1,{"$f":"'Sheet 4'!E99","v":0}]
[null,"425","1.3.2.11","Exemption Deduction of Equity Holdings in Insurance Companies from Common Equity Tier 1 Items","Article 452(2a) of CRR"]
[null,"430","1.3.3","Additional filters and deductions","Article 461 of CRR",0,0,0,null,0]

{"sheet":"Sheet 5","index":11,"n_rows":47,"n_cols":13,"rows_kept":47,"cut":false,"hidden":false,"merged":[[31,1,31,5],[3,1,3,7],[18,1,18,5],[28,1,28,5],[29,1,29,5]]}
[]
[null,null,null,null,null,null,null,"Initialled by the auditor for identification purposes only "]
[]
[null,"FIXED OVERHEAD REQUIREMENT"]
[]
[null,"As at:",{"$f":"'COVER SHEET'!C29","v":"00:00:00"},null,null,null,null,null,null,null,null,null,"Yes"]
[null,null,null,null,null,null,null,null,null,null,null,null,"No"]
[1,"How many months are represented in the recent Audited Financial Statements"]
[]
[2,"Total Expenditure",null,null,null,null,null,null,null,null,null,null,1]
[null,null,null,null,null,null,null,null,null,null,null,null,2]
[null,null,null,null,null,null,null,null,null,null,null,null,3]
[3,"Less:",null,null,null,null,null,null,null,null,null,null,4]
[null,"a) fully discretionary staff bonuses",null,null,null,null,null,null,null,null,null,null,5]
[null,"b) employees', directors' and partners' shares in profits, ",null,null,null,null,null,null,null,null,null,null,6]
[null,"  to the extent that they are fully discretionary",null,null,null,null,null,null,null,null,null,null,7]
[null,"c) other appropriations of profits and other variable remuneration,",null,null,null,null,null,null,null,null,null,null,8]
[null,"  to the extent that they are fully discretionary",null,null,null,null,null,null,null,null,null,null,9]
[null,"d) Commissions that are directly related to the acqusition of gross revenue (derived from investment services activities), paid or payable to third parties; and/ or \n",null,null,null,null,null,null,null,null,null,null,10]
[null,"  shared commission and fees which are directly related to ",null,null,null,null,null,null,null,null,null,null,11]
[null,"commission and fees receivable, which are included within",null,null,null,null,null,null,null,null,null,null,12]
[null,"total revenue, and where the payment of the commission",null,null,null,null,null,null,null,null,null,null,13]
[null,"and fees payable is contingent upon the actual receipt",null,null,null,null,null,null,null,null,null,null,14]
[null,"of the commission and fees receivable",null,null,null,null,null,null,null,null,null,null,15]
[null,"e) fees, brokerage and other charges paid to clearing",null,null,null,null,null,null,null,null,null,null,16]
[null,"  houses, exchanges and intermediate brokers for",null,null,null,null,null,null,null,null,null,null,17]
[null,"  the purposes of executing, registering or clearing transactions",null,null,null,null,null,null,null,null,null,null,18]
[null,"f)  fees to tied agents"]
[null,"g) expenditures from taxes due in relation to annual profits;"]
[null,"h) annual payments related to contract-based profit and loss"]
[null,"    transfer agreements with parent undertaking"]
[null,"i)  expenses related to items that have already been deducted from"]
[null,"    own funds in accordance with Article 36(1) of Regulation (EU)"]
[null,"    2013/575"]
[null,"j) non-recurring expenses from non-ordinary activities",null,null,null,null,null,null,{"$f":"SUM(G14:G35)","v":0}]
[]
[]
[4,"Relevant Fixed Expenditure ",null,null,null,null,null,null,{"$f":"+I10-I35","v":0}]
[]
[5,"Other Additions"]
[]
[6,"Does the licence holder make use of tied agents?"]
[null,null,null,null,null,null,{"$f":"IF(G42=\"yes\",\"Input 35% of all fees related to tied agents\",\"\")","v":""}]
[]
[7,"(One quarter of the annual relevant fixed expenditure)",null,null,null,null,null,null,{"$f":"((I38*13/52)+(I42*13/52)+(I40*13/52))","v":0}]
[]
[8,"Fixed Overhead Requirement",null,null,null,null,null,null,{"$f":"IF(H8=0,0,((I45)/H8)*12)","v":0}]

{"sheet":"Sheet 6","index":12,"n_rows":29,"n_cols":14,"rows_kept":29,"cut":false,"hidden":false,"merged":[[15,2,15,5],[17,1,17,5],[19,1,19,5],[21,1,21,6]]}
[]
[]
[null,null,null,null,null,null,null,null,{"$f":"+IF('[22]COVER SHEET'!$B$22=\"\",0,IF('[22]COVER SHEET'!$B$22=\"Interim Financial Return\",0,IF('[22]Sheet 7'!$K$82=\"\",0,'[22]Sheet 7'!$K$82)))","v":0}]
[null,"FINANCIAL RESOURCES REQUIREMENT"]
[]
[null,"As at ",{"$f":"'COVER SHEET'!C29","v":"00:00:00"}]
[]
[]
[]
["1.0","Total Own Funds",null,null,null,null,null,null,{"$f":"'Sheet 4'!E5","v":0}]
[]
[2,"Fixed Overhead Requirement",null,null,null,null,null,null,{"$f":"'Sheet 5'!I47","v":0}]
[]
[]
[3,"Initial Capital",null,null,null,null,""]
[null,null,"Category 2 licence holder",null,null,null,null,null,{"$f":"IF('COVER SHEET'!C36>0,125000*1/'COVER SHEET'!C36,0)","v":0},null,null,"Cat 2"]
[]
[4,"Additional Capital Resources before reductions",null,null,null,null,{"$f":"IF(M27>0,N27,0)","v":0},null,null,null,null,{"$f":"I12","v":0},"FO"]
[]
[5,"Insert percentage exemption from additional amount of Own Funds (if any)"]
[]
[6,"Additional Capital Resources after reductions",null,null,null,null,null,null,{"$f":"G18- (G18*G20)","v":0}]
[null,null,null,null,null,null,null,null,null,null,null,{"$f":"IF(AND('[23]COVER SHEET'!C25<>\"Category 3\",I24>L18),I24,IF(AND('[23]COVER SHEET'!C25<>\"Category 3\",L18>I24),L18,0))","v":0},"higher of above & initial capital"]
[7,"Total Capital",null,null,null,null,null,null,{"$f":"IF(((I16+I22)*('COVER SHEET'!C36))>10000000,(10000000/'COVER SHEET'!C36),(I16+I22))","v":0}]
[]
[null,null,null,null,null,null,null,null,null,null,null,"Addition capital ","Add cap limit","amount taken"]
[8,"CAPITAL RESOURCES REQUIREMENT",null,null,null,null,null,null,{"$f":"IF(L23=0,L25,L23)","v":0},null,null,{"$f":"IF(AND('Sheet 1'!D414>0,('Sheet 1'!D414*'COVER SHEET'!C36)>250000000),((('Sheet 1'!D414*'COVER SHEET'!C36)-250000000)*0.0002),0)","v":0},{"$f":"L27","v":0},{"$f":"IF(M27>0,(M27/'COVER SHEET'!C36),0)","v":0}]
[]
[9,"FINANCIAL RESOURCES REQUIREMENT",null,null,null,null,null,null,{"$f":"I10-I27","v":0}]

{"sheet":"Sheet 7","index":13,"n_rows":113,"n_cols":15,"rows_kept":113,"cut":false,"hidden":false,"merged":[[18,2,21,8],[22,2,24,8],[15,2,16,8],[42,1,42,6],[30,1,30,6],[32,1,32,6],[33,1,33,6],[34,1,34,6],[35,1,35,6],[36,1,36,6],[37,1,37,6],[38,1,38,6],[39,1,39,6],[40,1,40,6],[41,1,41,6],[74,1,74,10],[43,1,43,6],[44,1,44,6],[45,1,45,6],[46,1,46,6],[47,1,47,6],[48,1,48,6],[49,1,49,6],[50,1,50,6],[51,1,51,6],[64,2,64,3],[64,5,64,6],[112,2,112,5],[76,1,76,10],[77,1,77,10],[96,2,96,5],[101,2,101,5],[106,9,106,10],[110,8,110,9]]}
[]
[]
[]
[null,"REPRESENTATIONS",null,null,null,{"$f":"IF('COVER SHEET'!C18=\"\",\"\",'COVER SHEET'!C18)","v":""}]
[]
[null,null,null,null,null,null,null,null,null,null,"Insert Yes/ No:"]
[]
["1.","Is the licence holder able, and will it be able for the forseeable future, to meet all of its liabilities ",null,null,null,null,null,null,null,null,null,null,null,null,"YES"]
[null,"as they fall due for payment?",null,null,null,null,null,null,null,null,null,null,null,null,"NO"]
[]
["2.","Have the licence holder's Financial Resources been in excess of or equal to its Financial "]
[null,"Resources Surplus throughout the period ending on the Accounting Reference Date?"]
[]
["3.","We Confirm that :"]
[]
[null,"i.","The licence holder's financial resources have been properly calculated in accordance with the MFSA's requirements."]
[]
[]
[null,"ii.","All matters (including contingent liabilities, claims and litigation) which might reasonably be expected to have a material effect on the licence holder's financial position at the date of submission of these statements have been declared herewith or notified in writing to MFSA."]
[]
[]
[]
[null,"iii.","An assessment has been carried out on the Investment Committee members and no information was found that may give rise to any doubt regarding the members’ fit and proper assessment, as per Rule R3-3.2 of Part A of the Investment Services Rules for Investment Services Providers."]
[]
[]
[]
[]
["4.","Names of Shareholders and members having direct or indirect holding greater than or equal to"]
[null," ten per cent of the capital issued by the Licence Holder:"]
[]
[null,"Name of Member / Shareholder",null,null,null,null,null,null,"Percentage held:",null,"Number of shares held:"]
[]
[]
[]
[]
[]
[]
[]
[]
[]
[]
[]
[]
[]
[]
[]
[]
[]
[]
[]
[]
[]
[]
[]
["5.","I further confirm that during the above mentioned period, the Licence Holder has:"]
[]
[null,null,"not received any complaints from clients;"]
[]
[null,null,"has received (please specify number:)       ",null,null,null,null,"complaints from clients. At the end of the "]
[null,null,"period, the licence holder has (please specify number:)       ",null,null,null,null,null,null,"complaints which"]
[null,null,"have not been resolved."]
[]
[]
["6.","I am a       director/        partner/        principal of the licence holder and I confirm that during "]
[null,"the period",null,null,"to "]
[]
[null,"the business of the licence holder has been conducted in accordance with:-"]
[]
[null,"a. ","the Investment Services Act;"]
[null,"b.","the licence conditions;  and"]
[null,"c.","any recommendations or directives issued to the licence holder by the "]
[null,null,"Malta Financial Services Authority"]
[]
[null,"except for: (kindly provide details)"]
[]
[]
[]
[]
[]
[null,"and that the Malta Financial Services Authority has been notified of all matters which may influence"]
[null,"its decision to allow the licence to continue. "]
[]
[]
["7.","This Financial Return was approved by the licence holder on :",null,null,null,null,null,null,null,"  Date."]
[]
["8.","This is an Annual Financial Return updated to accurately reflect the information in the "]
[null,"Audited Financial Statements.",null,null,null,null,null,null,null,null,"YES"]
[]
["9.","It is accompanied by the Audited Financial Statements, the report of the auditor "]
[null,"to the MFSA and a copy of the Management Letter as required by the MFSA.",null,null,null,null,null,null,null,null,"YES"]
[]
[null,"Signed on behalf of licence holder by :"]
[]
[null,"Signed:",null,null,null,null,null,"Date:"]
[null,null,"(Director/ Authorised Signatory)"]
[]
[null,"Name:"]
[]
[null,"Signed:",null,null,null,null,null,"Date:"]
[null,null,"(Director/ Second Authorised Signatory)"]
[]
[null,"Name:"]
[]
[]
["10.","This Section should be completed by the Audit Partner/ Manager in charge."]
[]
[null,"This Return should be read in conjunction with the auditor's report to the MFSA dated ",null,null,null,null,null,null,null,"2020-01-01"]
[]
[null,"Signed by the Audit Manager/Partner in charge for identification purposes only:"]
[null,null,null,null,null,null,null,null,null,null,null,null,null,{"$f":"'COVER SHEET'!B15","v":"AUDITED ANNUAL FINANCIAL RETURN"}]
[null,"Signed:",null,null,null,null,null,"Date:","2020-01-01"]
[]
[null,"Name:"]

{"sheet":"Applicable Percentages","index":14,"n_rows":43,"n_cols":7,"rows_kept":43,"cut":false,"hidden":true,"merged":[[0,0,0,1],[13,0,13,1],[29,0,29,2],[37,0,37,2]]}
["GrandFathering Instruments",null,"464(5)"]
[2013,0.9]
[{"$f":"A2+1","v":2014},{"$f":"B2-10%","v":0.8}]
[{"$f":"A3+1","v":2015},{"$f":"B3-10%","v":0.70000000000000007}]
[2016,0.60000000000000009]
[2017,0.50000000000000011]
[2018,0.40000000000000013]
[2019,0.30000000000000016]
[2020,0.20000000000000015]
[2021,0.10000000000000014]
[null,null,null,null,100,{"$f":"IF((E11+E12-E13)>0,C1,C14)","v":"459(3)"}]
[null,null,null,null,2000]
[null,null,null,null,3000]
[" Capital instruments and items that do not qualify as minority interests",null,"459(3)"]
[2013,1]
[{"$f":"A15+1","v":2014},0.8]
[{"$f":"A16+1","v":2015},0.6]
[{"$f":"A17+1","v":2016},0.4,null,null,null,null,1]
[{"$f":"A18+1","v":2017},0.2,null,null,null,null,2]
[null,null,null,null,null,null,3]
[null,null,null,null,null,null,4]
["Transitional recognition in consolidated own funds of minority interests",null,"460(2)",null,null,null,5]
[2013,0]
[2014,0.2]
[2015,0.4]
[2016,0.6]
[2017,0.8]
[]
[]
["Unrealised Gains and Losses"]
[null,"Gains (468)","Losses (467)"]
[2013,0,1]
[2014,1,1]
[2015,0.6,1]
[2016,0.4,1]
[2017,0.2,1]
[]
["Article 458 of CRR"]
[2013,1]
[2014,1]
[2015,1]
[2016,1]
[2017,1]

{"sheet":"Sheet 8","index":15,"n_rows":63,"n_cols":18,"rows_kept":63,"cut":false,"hidden":false,"merged":[[60,1,60,7],[39,2,39,3],[42,2,42,3],[48,2,48,3],[50,2,50,3],[55,1,56,7],[58,1,59,7],[37,2,37,3],[6,2,6,5],[8,3,8,4],[9,3,9,4],[17,3,18,3],[34,2,34,3]]}
[]
[]
[]
[]
[]
[null,null,null,null,null,null,null,null,null,null,null,null,null,"Fixed (€)","Variable/tranche (€)","Variable","Total","Currency"]
[null,null,"ANNUAL SUPERVISORY FEE CALCULATOR",null,null,null,null,null,null,null,null,"Category 1A",null,2000,350,{"$f":"IF($E$27<50000,0,IF($E$27<=1000000,(ROUNDUP((($E$27-50000)/50000),0)*$O$7),(19*$O$7)))","v":0},{"$f":"N7+P7","v":2000},"EUR"]
[null,null,null,null,null,null,null,null,null,null,null,"Category 1B",null,2750,350,{"$f":"IF($E$27<50000,0,IF($E$27<=1000000,(ROUNDUP((($E$27-50000)/50000),0)*$O$8),(19*$O$8)))","v":0},{"$f":"N8+P8","v":2750},"GBP"]
[null,null,null,"(To be compiled and submitted in hard copy on an Annual basis together with the Audited Annual Financial Return)",null,null,null,null,null,null,null,"Category 2",null,4500,400,{"$f":"IF($E$27<250000,0,IF($E$27<=5000000,(ROUNDUP((($E$27-250000)/250000),0)*$O$9),(19*$O$9)))","v":0},{"$f":"N9+P9","v":4500},"USD"]
[null,null,null,null,null,null,null,null,null,null,null,"Category 3",null,6000,400,{"$f":"IF($E$27<250000,0,IF($E$27<=50000000,(ROUNDUP((($E$27-250000)/250000),0)*$O$10),(199*$O$10)))","v":0},{"$f":"N10+P10","v":6000}]
[null,null,null,null,null,null,null,null,null,null,null,"Category 4A",null,15000,"N/A","N/A",{"$f":"N11","v":15000}]
[null,null,1,"Name of Licence Holder",{"$f":"'COVER SHEET'!C18","v":0},null,null,null,null,null,null,"Category 4B",null,5000,"N/A","N/A",{"$f":"N12","v":5000}]
[]
[null,null,2,"Licence Category","Category 2",""]
[]
[null,null,3,"Gross revenue indicated in the Annual Audited Financial Statements and that is derived from activities for which an investment services licence was issued in terms of Article 3 of the Investment Services Act",null,{"$f":"IF(E16=('Sheet 2'!K50-'Sheet 2'!K47),1,0)","v":1}]
[]
[null,null,4,"Commission that are directly related to the acquisition of the said gross revenue, paid or payable to third parties"]
[null,null,null,null,null,{"$f":"IF(E19='Sheet 1'!H40,1,0)","v":1}]
[]
[null,null,5,"Currency in which accounts are reported",{"$f":"'COVER SHEET'!C34","v":0}]
[]
[null,null,6,"Revenue in reported currency (as defined in Subsidiary Legislation 370.03 Investment Services Act (Fees) Regulations)",{"$f":"E16-E19","v":0}]
[]
[null,null,7,"Exchange rate as at end of reporting period converting the reporting currency to EURO",{"$f":"'COVER SHEET'!C36","v":0}]
[]
[null,null,8,"Revenue in EURO",{"$f":"E23*E25","v":0}]
[]
[null,null,9,"Annual Supervisory Fee due in EURO",{"$f":"IF(E14=L7,Q7,IF(E14=L8,Q8,IF(E14=L9,Q9,IF(E14=L10,Q10,IF(E14=L11,Q11,IF(E14=L12,Q12,0))))))","v":4500}]
[]
[null,"Signed on behalf of licence holder by :"]
[]
[null,"We confirm that the above computation is in line with the provision set out in the Subsidiary Legislation 370.03 Investment Services Act (Fees) Regulations."]
[]
[null,"Signed:",null,null,null,"Date:",null,{"$f":"IF(G35=\"\",0,1)","v":0}]
[null,null,"(Director/ Authorised Signatory)"]
[]
[null,"Name:",null,null,{"$f":"IF(C38=\"\",0,1)","v":0}]
[]
[null,"Signed:",null,null,null,"Date:",null,{"$f":"IF(G40=\"\",0,1)","v":0}]
[null,null,"(Director/ Authorised Signatory)"]
[]
[null,"Name:",null,null,{"$f":"IF(C43=\"\",0,1)","v":0}]
[]
[null,"This Section must be filled only if the return is an Annual Financial Return.  It should be completed by the Audit Partner/ Manager in charge "]
[]
[null,"We confirm that we have checked the above fee computation ad endorsed the Licence Holder's declarations set out above. "]
[]
[null,"Signed:",null,null,null,"Date:"]
[]
[null,"Name:"]
[]
[]
[null,"Notes:"]
[]
[null,"1. Please ensure that the figures reported above are consistent with figures reported in audited financial statements and other data/ information submitted to the Malta Financial Services Authority."]
[]
[]
[null,"2. Please ensure that you send your remittance to the Malta Financial Services Authority as soon as possible. Cheques are to be sent payable to the 'Malta Financial Services Authority' and are to be sent to the:"]
[]
[null,"Malta Financial Services Authority\nFinance Department\nTriq L- Imdina, Zone 1\nCentral Business District\nBirkirkara  CBD 1010"]
[]
[null,"3. The Authroity reserves the right to carry out random or full checks of data / information and fee computation submitted."]

{"sheet":"LH Names & Codes","index":16,"n_rows":59,"n_cols":5,"rows_kept":59,"cut":false,"hidden":true,"merged":[]}
["LH Name","Code","Licence Type","LEI Code"]
["24 Capital Management Limited ","24CM","AIFM","254900U468UFGFSSUU96"]
["Abalone Asset Management Limited","ABAL","AIFM+UCITS","213800RJPNK256NQ3V19"]
["Accendo Capital Management","ACML14","AIFM","984500BC2E0X69ETCF12"]
["Accolade Investment Company Limited","AICL","AIFM","52990058ACRLCNZ2UY14"]
["Adventum International Limited","ADVN","AIFM","529900SSBWKEESF51507"]
["Agon Asset Management Limited","TIME","AIFM","213800XHYX5J3FINK248"]
["Alanda Capital Management (Malta) Limited","ALND","AIFM","213800ABTM42ACZA6145","lapsed"]
["Alpha Value Management Limited","AVML","AIFM+UCITS","21380023BOO37ZG47O86"]
["Altarius Asset Management Limited","ALTA","AIFM","5299000X84JRI8MS7D35"]
["AMAGIS Capital Management Limited","AMAG","AIFM+UCITS","213800QCBVP7O9DPFD93"]
["Amarillo Investment Solutions Limited ","AISL","De-Minimis","213800TEV1QJC67DYI25"]
["Andurand Capital Management Limited","ANDU","AIFM","549300C74U6R5H5T5081"]
["APartners Capital Investment Management Limited","APIM","AIFM","213800KL64XGYK86Z111"]
["AQA Capital (Malta) Limited","AQAC","AIFM+UCITS","2138001G8FUBS3YXAL75"]
["Audentia Capital Management Limited","ACML","AIFM","213800EMSWGQ5MV2P206"]
["AUM Asset Management Limited","AUMA","AIFM","213800CXW86T97PXU441"]
["Auriga Asset Management Limited (+ De-Minimis)","AURI","UCITS","485100000JPOXDVQ3K89"]
["BOV Asset Management Limited","VFML","UCITS","2138001GKM54HSYO4Q41","lapsed"]
["Calamatta Cuschieri Investment Management Limited","CCIM","UCITS","391200VTSURYXBPRQ671"]
["Culross Global Investment Management Limited","CULR","AIFM","635400OXJBKRVFTBDP2"]
["Decent Investments Malta Limited","DIM","De-Minimis"]
["Dolfin Fund Management Limited","RMSM","AIFM","549300BZ2608O037ZQ19"]
["Eisler Capital (MT) Limited","ECM","AIFM","549300LCIZGZQD7NG159"]
["EuroMena FMC Limited","EURO","De-Minimis","254900M5Z2MU1FXQT967"]
["Fair-Finance Asset Management Limited","FFAM","AIFM+UCITS","5299002J79R9TA0YUZ86"]
["Falcon Money Management Limited","FALC","AIFM","213800DWGDOMU52RW804"]
["FCS Asset Management Limited","FCSL","AIFM+UCITS","213800RZJX1BIQVYRX04"]
["Flexagon Capital Management Limited","FLEX","AIFM+UCITS","2138001XODNXDE3RSZ44"]
["FMG (Malta) Limited","FMGM","AIFM","213800NV7JCBS2TXRH63","lapsed"]
["Framont & Partners Management Limited","FRMT","AIFM+UCITS","213800KFDGNSMJPNR308"]
["Frere Hall Capital Management (Malta) Limited","FRER","AIFM","5493007RQ2JD0PEBNS38"]
["Gamma Capital Markets Limited","GMMA","AIFM+UCITS","2138004R5UZCINK9C881"]
["GWM Asset Management Limited","GWMA","AIFM","213800ETITVASZIXR550"]
["Hanover Investors Management (Malta) Limited","HIMM","AIFM","213800N1V5TK2J65PN10"]
["Heartland Investment Management Limited ","HART","AIFM","254900PMMTCJCDJ97613"]
["HSBC Global Asset Management (Malta) Limited","HSBG","UCITS","213800K5ZFNCMMGZHN18"]
["Lombard Capital Asset Management Limited","LCAM","UCITS","485100PPP2BHNRATJV06"]
["Mansard Capital Management Limited ","MANS","De-Minimis","2138003SCWMLSJWAS783","lapsed"]
["Mediterrania Capital Partners Limited","MEDC","AIFM","254900XTV63V33AL0U72"]
["Mirabella Malta Limited ","MIRA","AIFM","213800FL1BC6V4M64Z34"]
["Multi Partners Financial Services Limited","MLTI","AIFM","254900QHIBCDS1PAXA73"]
["Noster Capital Management Limited","NCML4","AIFM","549300F17PZSLPEL0X79"]
["Pamplona PE Investments Malta Limited","PAPP","AIFM","213800OEX7X5TXPATR14"]
["PeakBridge Partners Limited","PBPL","AIFM","7890008H7QHOH5BJ8F79","lapsed"]
["Plan B Investments Limited","ABIE","De-Minimis","3157005SGUZVHKBSOW59"]
["Portsea AIFM Malta Limited","SEAT","AIFM","485100J981X3N4CNBM24"]
["Praude Asset Management Limited","PAML","AIFM+UCITS","213800XEUU66ORVOIE24"]
["Prestige Capital Management Limited","PRES","AIFM","213800MNQE78N1WVAA45"]
["PSG Fund Management (Malta) Limited","PSGF","AIFM+UCITS","213800CFUB5E8I27SF77","lapsed"]
["Q Fund Management Limited","BSTN","AIFM","2138005Z18R4WFYWGV56"]
["ReAPS Asset Management Limited","RAPS","UCITS","213800HL9D7GV5ZEAZ89"]
["Rigsave Capital Limited","RIGS","AIFM+UCITS","9845008G1EB2E4BC1E22"]
["SevenHills Investment Management Limited","GWMG","AIFM+UCITS","213800IUYUSQPISRH630"]
["SphereInvest Group Limited","SPGL","AIFM+UCITS","635400LYRQN3YJZNFV08"]
["Storton Fund Management Limited","LFUN","AIFM","984500999A540457B545"]
["Sun Hill Investment Management (Malta) Limited","SHIM","AIFM","213800Q1UNL4Q6E7VF92"]
["Terra Partners Asset Management Limited","TRRA","AIFM","529900LC51VCUHTEMG20"]
["Timberland Fund Management Limited","TMBR","AIFM","894500EGKKNXJOMX6995"]

{"sheet":"Non-Malta Funds","index":17,"n_rows":234,"n_cols":10,"rows_kept":234,"cut":false,"hidden":false,"merged":[[1,1,1,10]]}
[]
[null,"NON-MALTA DOMICILED FUNDS MANAGED IN MALTA"]
[]
[null,null,{"$f":"'COVER SHEET'!C18","v":0},null,null,null,"DATA PROVIDED AS AT",{"$f":"'COVER SHEET'!C29","v":"00:00:00"}]
[]
[null,"Kindly Indicate the number of non-Malta domiciled Collective Investment Schemes (including sub-Funds) managed by the Fund Manager directly or indirectly."]
[null,"In the case of both feeder and master funds being managed, kindly list both funds but include AUM only once.",null,null,null,"Please input in the relevant cells highlighted in blue "]
[]
[0,"Name of non-Malta domiciled Collective Investment Scheme managed by the fund manager","Name  of sub-Fund","Domiciled country of fund (Country where the fund is licensed)","Name of Custodian","Location of Custodian","Other custodians (if any)","Location of other custodians (if any)","Type of fund (equity fund, bond fund, hedge fund, real estate fund,  money market fund, etc.)","Assets Under Management (in EUR)"]
[1]
[{"$f":"A10+1","v":2}]
[3]
[4]
[5]
[6]
[7]
[8]
[9]
[10]
[11]
[12]
[13]
[14]
[15]
[16]
[17]
[18]
[19]
[20]
[21]
[22]
[23]
[24]
[25]
[26]
[27]
[28]
[29]
[30]
[31]
[32]
[33]
[34]
[35]
[36]
[37]
[38]
[39]
[40]
[41]
[42]
[43]
[44]
[45]
[46]
[47]
[48]
[49]
[50]
[51]
[52]
[53]
[54]
[55]
[56]
[57]
[58]
[59]
[60]
[61]
[62]
[63]
[64]
[65]
[{"$f":"A74+1","v":66}]
[67]
[68]
[69]
[70]
[71]
[72]
[73]
[74]
[75]
[76]
[77]
[78]
[79]
[80]
[81]
[82]
[83]
[84]
[85]
[86]
[87]
[88]
[89]
[90]
[91]
[92]
[93]
[94]
[95]
[96]
[97]
[98]
[99]
[100]
[101]
[102]
[103]
[104]
[105]
[106]
[107]
[108]
[109]
[110]
[111]
[112]
[113]
[114]
[115]
[116]
[117]
[118]
[119]
[120]
[121]
[122]
[123]
[124]
[125]
[126]
[127]
[128]
[129]
[{"$f":"A138+1","v":130}]
[131]
[132]
[133]
[134]
[135]
[136]
[137]
[138]
[139]
[140]
[141]
[142]
[143]
[144]
[145]
[146]
[147]
[148]
[149]
[150]
[151]
[152]
[153]
[154]
[155]
[156]
[157]
[158]
[159]
[160]
[161]
[162]
[163]
[164]
[165]
[166]
[167]
[168]
[169]
[170]
[171]
[172]
[173]
[174]
[175]
[176]
[177]
[178]
[179]
[180]
[181]
[182]
[183]
[184]
[185]
[186]
[187]
[188]
[189]
[190]
[191]
[192]
[193]
[{"$f":"A202+1","v":194}]
[195]
[196]
[197]
[198]
[199]
[200]
[201]
[202]
[203]
[204]
[205]
[206]
[207]
[208]
[209]
[210]
[211]
[212]
[213]
[214]
[215]
[216]
[217]
[218]
[219]
[220]
[221]
[222]
[223]
[224]
[225]

{"sheet":"VALIDATION SHEET","index":18,"n_rows":80,"n_cols":19,"rows_kept":80,"cut":false,"hidden":false,"merged":[[5,1,5,2],[5,4,5,7],[5,13,5,20],[46,7,46,18]]}
[]
[null,null,null,null,null,null,null,null,null,null,null,null,null,null,null,null,null,"Initialled by the auditor for identification purposes only "]
[null,null,null,null,null,null,null,null,null,null,null,null,null,null,null,null,null,null,{"$f":"IF('[22]COVER SHEET'!$B$22=\"\",0,IF('[22]COVER SHEET'!$B$22=\"Interim Financial Return\",0,IF('[22]Sheet 7'!$K$82=\"\",0,'[22]Sheet 7'!$K$82)))","v":0}]
[null,"VALIDATION SHEET"]
[]
[null,"Sheet Number:",null,null,"Sheet Title",null,null,null,null,null,null,null,null,"Description of Error"]
[]
[null,"Cover Sheet",null,null,null,null,null,null,null,null,null,{"$f":"+IF(G50>0,\"ERROR\",\"OK\")","v":"ERROR"},null,{"$f":"IF(L8=\"ERROR\",\"CHECK THAT ENTRIES IN COVER SHEET ARE CORRECTLY INPUTTED.\",\"\")","v":"CHECK THAT ENTRIES IN COVER SHEET ARE CORRECTLY INPUTTED."}]
[]
[null,"Sheet 1",{"$f":"+'[22]Sheet 1'!J4","v":"IFR 1"},null,{"$f":"[22]CONTENTS!E5","v":"INPUT SHEET - MANDATORY"},null,null,null,null,null,null,{"$f":"+IF(G54>0,\"ERROR\",\"OK\")","v":"ERROR"},null,{"$f":"IF(L10=\"ERROR\",\"CHECK THAT ALL ENTRIES HAVE BEEN FILLED AND ARE CORRECTLY INPUTTED.\",\"\")","v":"CHECK THAT ALL ENTRIES HAVE BEEN FILLED AND ARE CORRECTLY INPUTTED."}]
[null,null,null,null,null,null,null,null,null,null,null,null,null,{"$f":"IF(E53=\"ERROR\",\"CHECK SHEET 1 - SECURED LIABILITIES\",\"\")","v":""}]
[]
[]
[null,"Sheet 2",{"$f":"+'[22]Sheet 2'!K4","v":"IFR 2"},null,{"$f":"[22]CONTENTS!E7","v":"INCOME STATEMENT "},null,null,null,null,null,null,{"$f":"IF(AND(E56=\"OK\"),\"OK\",\"ERROR\")","v":"OK"},null,{"$f":"IF(E56=\"ERROR\",\"CHECK SHEET 2 - ITEMS IN THE INCOME STATEMENT.\",\"\")","v":""}]
[null,null,null,null,null,null,null,null,null,null,null,null,null,{"$f":"IF(E57=\"ERROR\",\"CHECK SHEET 2 - SECTIONS 8 AND/ OR 19\",\"\")","v":""}]
[]
[null,"Sheet 3",{"$f":"+'[22]Sheet 3'!J4","v":"IFR 3"},null,{"$f":"[22]CONTENTS!E9","v":"BALANCE SHEET "},null,null,null,null,null,null,{"$f":"IF(E59=\"ok\",\"OK\",\"ERROR\")","v":"OK"},null,{"$f":"IF(L17=\"ERROR\",\"CHECK Balance Sheet Entries\",\"\")","v":""}]
[]
[]
[]
[null,"Sheet 4",{"$f":"+'[22]Sheet 4'!K4","v":"IFR 4"},null,{"$f":"[22]CONTENTS!E11","v":"TOTAL OWN FUNDS CALCULATION"},null,null,null,null,null,null,{"$f":"IF(G61=0,\"OK\",\"ERROR\")","v":"OK"},null,{"$f":"IF(E61=\"ERROR\",\"CHECK SHEET 4 - ELIGIBLE CAPITAL MUST BE AT LEAST EQUAL TO FIXED OVERHEAD REQUIREMENT\",\"\")","v":""}]
[null,null,null,null,null,null,null,null,null,null,null,null,null,{"$f":"IF(E62=\"ERROR\",\"CHECK SHEET 4 - OWN FUNDS CANNOT BE LESS THAN INITIAL CAPITAL\",\"\")","v":""}]
[]
[null,"Sheet 5",{"$f":"'[22]Sheet 5'!I4","v":"IFR 5"},null,{"$f":"[22]CONTENTS!E13","v":"FIXED OVERHEAD REQUIREMENT"},null,null,null,null,null,null,{"$f":"IF(G66>0,\"ERROR\",\"OK\")","v":"ERROR"},null,{"$f":"IF(E64=\"ERROR\",\"CHECK SHEET 5 - MONTH REPRESENTATION - ITEM1\",\"\")","v":"CHECK SHEET 5 - MONTH REPRESENTATION - ITEM1"}]
[null,null,null,null,null,null,null,null,null,null,null,null,null,{"$f":"IF(E65=\"ERROR\",\"CHECK SHEET 5 - TIED AGENTS QUESTION\",\"\")","v":"CHECK SHEET 5 - TIED AGENTS QUESTION"}]
[null,null,null,null,null,null,null,null,null,null,null,null,null,{"$f":"IF(E66=\"ERROR\",\"CHECK SHEET 5 - TIED AGENTS AMOUNT\",\"\")","v":"CHECK SHEET 5 - TIED AGENTS AMOUNT"}]
[null,"Sheet 6",{"$f":"'[22]Sheet 6'!I4","v":"IFR 6"},null,{"$f":"[22]CONTENTS!E15","v":"FINANCIAL RESOURCES REQUIREMENT"},null,null,null,null,null,null,{"$f":"IF(G70>0,\"ERROR\",\"OK\")","v":"OK"},null,{"$f":"IF(E68=\"ERROR\",\"KINDLY INPUT THE APPROPIATE CREDIT/ COUNTERPARTY RISK COMPONENT \",\"\")","v":""}]
[null,null,null,null,null,null,null,null,null,null,null,null,null,{"$f":"IF(E69=\"ERROR\",\"KINDLY INPUT THE POSITION RISK COMPONENT & COUNTERPARTY RISK COMPONENT FOR DERIVATIVE INSTRUMENTS\",\"\")","v":""}]
[]
[null,"Sheet 7",{"$f":"'[22]Sheet 7'!L4","v":"IFR 7"},null,"REPRESENTATIONS",null,null,null,null,null,null,{"$f":"IF(G77>0,\"ERROR\",\"OK\")","v":"ERROR"},null,{"$f":"IF(E72=\"ERROR\",\"ENSURE THAT QUESTIONS: 1, 2, 3, 7 & SIGNATURES OF DIRECTORS ARE COMPLETED\", \"\")","v":"ENSURE THAT QUESTIONS: 1, 2, 3, 7 & SIGNATURES OF DIRECTORS ARE COMPLETED"}]
[null,null,null,null,null,null,null,null,null,null,null,null,null,{"$f":"IF(E73=\"ERROR\",\"PLEASE ENSURE QUESTIONS 8 & 9 ARE COMPLETED WHEN THE FINANCIAL RETURN IS AN ANNUAL AUDITED FINANCIAL RETURN\", \"\")","v":""}]
[null,null,null,null,null,null,null,null,null,null,null,null,null,{"$f":"IF(E74=\"ERROR\",\"PLEASE ENSURE QUESTION 4 IS COMPLETED WHEN THE FINANCIAL RETURN IS AN ANNUAL AUDITED FINANCIAL RETURN\", \"\")","v":"PLEASE ENSURE QUESTION 4 IS COMPLETED WHEN THE FINANCIAL RETURN IS AN ANNUAL AUDITED FINANCIAL RETURN"}]
[null,null,null,null,null,null,null,null,null,null,null,null,null,{"$f":"IF(E75=\"ERROR\",\"PLEASE ENSURE THAT THE DETAILS REQUIRED IN QUESTION 6 ARE COMPLETED\", \"\")","v":"PLEASE ENSURE THAT THE DETAILS REQUIRED IN QUESTION 6 ARE COMPLETED"}]
[null,null,null,null,null,null,null,null,null,null,null,null,null,{"$f":"IF(E76=\"ERROR\",\"PLEASE ENSURE QUESTION 10 IS COMPLETED WHEN THE FINANCIAL RETURN IS AN ANNUAL AUDITED FINANCIAL RETURN\", \"\")","v":"PLEASE ENSURE QUESTION 10 IS COMPLETED WHEN THE FINANCIAL RETURN IS AN ANNUAL AUDITED FINANCIAL RETURN"}]
[null,null,null,null,"NON-MALTA FUNDS",null,null,null,null,null,null,{"$f":"IF('Non-Malta Funds'!H6=\"\",\"ERROR\",\"OK\")","v":"ERROR"},null,{"$f":"IF(L35=\"ERROR\",\"KINDLY COMPLETE THE NON-MALTA FUNDS SHEET\", \"\")","v":"KINDLY COMPLETE THE NON-MALTA FUNDS SHEET"}]
[]
[null,"Sheet 8",null,null,"ANNUAL SUPERVISORY FEE CALCULATOR (AAFR only)",null,null,null,null,null,null,{"$f":"IF(SUM(F79:F80)>=1,\"ERROR\",\"OK\")","v":"OK"}]
[]
[]
[]
[]
[]
[]
[]
[]
[]
[null,"NAME OF SHEET","VALIDATION NO:",null,"VALIDATION FORMULA",null,null,"DESCRIPTION"]
[]
[null,"Cover Sheet",1,null,{"$f":"IF('COVER SHEET'!D93>0,\"ERROR\",\"OK\")","v":"ERROR"},{"$f":"IF(E49=\"OK\",0,1)","v":1},null,"Ensures all details in the cover sheet have been inputted."]
[null,null,null,null,{"$f":"IF(('COVER SHEET'!C22<>0), \"OK\", \"ERROR\")","v":"OK"},{"$f":"IF(E50=\"OK\",0,1)","v":0},{"$f":"SUM(F49:F50)","v":1},"Ensures that LEI code is filled in"]
[]
[null,"SHEET 1",1,null,{"$f":"IF('Sheet 1'!D375>0,\"ERROR\",IF('Sheet 1'!D375<0,\"ERROR\",\"OK\"))","v":"OK"},{"$f":"IF(E52=\"OK\",0,1)","v":0},null,"The trial balance has a nil balance"]
[null,null,2,null,{"$f":"+IF('Sheet 1'!D384>'Sheet 1'!D382,\"ERROR\",IF('Sheet 1'!D389>'Sheet 1'!D387,\"ERROR\",\"OK\"))","v":"OK"},{"$f":"IF(E53=\"OK\",0,1)","v":0},null,"Ensures that secured liabilities values have been correctly entered"]
[null,null,null,null,{"$f":"IF((OR('Sheet 1'!D414<>0, 'Sheet 1'!D417<>0, 'Sheet 1'!B424:D427<>0)), \"OK\", \"ERROR\")","v":"ERROR"},{"$f":"IF(E54=\"OK\",0,1)","v":1},{"$f":"SUM(F52:F54)","v":1},"Ensures that AUM/FUM is filled in"]
[]
[null,"SHEET 2",1,null,{"$f":"IF('[22]Sheet 2'!K122='[22]Sheet 2'!K124,\"OK\",\"ERROR\")","v":"OK"},{"$f":"IF((E56=\"OK\"),0,1)","v":0},null,"All entries in trial balance relating to P/L and statement of changes in equity have been entered"]
[null,null,null,null,null,null,{"$f":"IF(E53=\"OK\",0,1)","v":0},"Where explanations are required to some items in P/L items, appropriate comments are inserted"]
[]
[null,"SHEET 3",1,null,{"$f":"IF('Sheet 3'!J28='Sheet 3'!J68,\"OK\",\"ERROR\")","v":"OK"},null,null,"Ensures that balance sheet agrees"]
[]
[null,"SHEET 4",1,null,{"$f":"IF('Sheet 4.1'!E32>='Sheet 5'!I47,\"OK\",\"ERROR\")","v":"OK"},{"$f":"IF(E61=\"OK\",0,1)","v":0},{"$f":"F61","v":0},"ELIGIBLE CAPITAL MUST BE AT LEAST EQUAL TO FIXED OVERHEAD REQUIREMENT"]
[null,null,1,null,{"$f":"IF('Sheet 4'!E5<'Sheet 6'!I16,\"ERROR\",\"OK\")","v":"OK"},{"$f":"IF(E62=\"OK\",0,1)","v":0},null,"OWN FUNDS CANNOT BE LESS THAN INITIAL CAPITAL"]
[]
[null,"SHEET 5",1,null,{"$f":"IF('Sheet 5'!H8>1,\"OK\",\"ERROR\")","v":"ERROR"},{"$f":"IF(E64=\"OK\",0,1)","v":1},null,"Ensures that all months are represented in the recent Audited Financial Statements"]
[null,null,2,null,{"$f":"IF('Sheet 5'!G42=\"\",\"ERROR\",\"OK\")","v":"ERROR"},1,null,"Ensures that the licence holder has filled in the tied agents question?"]
[null,null,3,null,{"$f":"IF(OR('Sheet 5'!G42=\"NO\",AND('Sheet 5'!G42=\"YES\",'Sheet 5'!I42>0)),\"OK\",\"ERROR\")","v":"ERROR"},1,{"$f":"SUM(F64:F66)","v":3},"Ensures that the licence holder has included an amount if the tied agents question is answered yes"]
[]
[null,"SHEET 6",1,null,"OK",0,null,"Ensures that the appropriate risk credit risk calculation is selected by the LH"]
[null,null,2,null,"OK",0,null,"Ensures that if the licence holder holds positions in financial derivatives, the Derivatives Risk and counterparty credit risk are calculated and filled in"]
[null,null,3,null,"OK",0,{"$f":"SUM(F68:F70)","v":0},"Ensures that if the licence holder holds positions in commodities, the commodities instruments - risk component is calculated."]
[]
[null,"SHEET 7",1,null,{"$f":"IF('Sheet 7'!K9=\"\",\"ERROR\",IF('Sheet 7'!K12=\"\",\"ERROR\",IF('Sheet 7'!K16=\"\",\"ERROR\",IF('Sheet 7'!K19=\"\",\"ERROR\",IF('Sheet 7'!I94=\"\",\"ERROR\",IF('Sheet 7'!I84=\"\",\"ERROR\",\"OK\"))))))","v":"ERROR"},1,null,"Ensures appropriate details are filled in for questions: 1, 2, 3, 7 & signatures of directors are filled in properly"]
[null,null,2,null,{"$f":"IF(AND('COVER SHEET'!$B$15=\"\",'Sheet 7'!K87=\"\",'Sheet 7'!K90=\"\"),\"ERROR\",IF(AND('COVER SHEET'!$B$15=\"Interim Financial Return\",'Sheet 7'!K87=\"\",'Sheet 7'!K90=\"\"),\"OK\",IF(AND('COVER SHEET'!$B$15=\"Annual Financial Return\",'Sheet 7'!K87=\"\",'Sheet 7'!K90=\"\"),\"ERROR\",\"OK\")))","v":"OK"},0,null,"Ensures appropriate details are filled in when the Financial Return is an AAFR - questions 8 & 9."]
[null,null,3,null,{"$f":"IF('COVER SHEET'!$B$15=\"Interim Financial Return\",\"OK\",(IF(AND('Sheet 7'!K87=\"YES\",'Sheet 7'!I33>0,'Sheet 7'!K33>0),\"OK\",IF('Sheet 7'!K87=\"NO\",\"OK\",\"ERROR\"))))","v":"ERROR"},1,null,"Ensures that the appropriate details in question 4 are completed for an AAFR."]
[null,null,4,null,{"$f":"IF(AND('Sheet 7'!C65=0,'Sheet 7'!F65=0),\"ERROR\",\"OK\")","v":"ERROR"},1,null,"Ensures that the data required in question 6 is appropriately filled in."]
[null,null,5,null,{"$f":"IF(OR('COVER SHEET'!B15=\"INTERIM FINANCIAL RETURN\"),\"OK\",(IF(AND('COVER SHEET'!B15=\"ANNUAL FINANCIAL RETURN\",'Sheet 7'!K87=\"NO\",'Sheet 7'!K90=\"NO\"),\"OK\",(IF(AND('COVER SHEET'!B15=\"AUDITED ANNUAL FINANCIAL RETURN\",'Sheet 7'!K87=\"YES\",'Sheet 7'!K90=\"YES\",'Sheet 7'!J107>0,'Sheet 7'!I111>0,'Sheet 7'!C113>0),\"OK\",\"ERROR\")))))","v":"ERROR"},1,null,"Ensures that the dates in question 10 are completed."]
[null,null,6,null,{"$f":"IF(OR('COVER SHEET'!$B$15=\"Interim Financial Return\",'COVER SHEET'!$B$15=\"Annual Financial Return\",\"OK\"),(IF(AND('Sheet 7'!K87=\"YES\",'Sheet 7'!I111>0,'Sheet 7'!C113>0),\"OK\",IF('Sheet 7'!K87=\"NO\",\"OK\",\"ERROR\"))))","v":false},1,{"$f":"SUM(F72:F76)","v":4},"Ensures that the auditors' details are inputted in question 10."]
[]
[null,"SHEET 8",1,null,{"$f":"IF('Sheet 8'!E16=('Sheet 2'!K50-'Sheet 2'!K47),\"OK\",\"ERROR\")","v":"OK"},{"$f":"IF(E79=\"OK\",0,1)","v":0},null,"Ensures that commission inputs in Sheet 8 match those in Sheet 1"]
[null,null,2,null,{"$f":"IF('Sheet 8'!E19='Sheet 1'!H40,\"OK\",\"ERROR\")","v":"OK"},{"$f":"IF(E80=\"OK\",0,1)","v":0},{"$f":"SUM(F79:F80)","v":0},"Ensures that commission inputs in Sheet 8 match those in Sheet 1"]

{"sheet":"Subordinated Loan Working","index":19,"n_rows":95,"n_cols":9,"rows_kept":95,"cut":false,"hidden":true,"merged":[[3,1,3,7],[35,1,35,7],[67,1,67,7]]}
[]
[]
[]
[null,"SUBORDINATED LOAN 1 - Perpetual"]
[]
[null,"As at ",{"$f":"'COVER SHEET'!C29","v":"00:00:00"}]
[]
[null,"Subordinated Loan General Information"]
[]
[null,"Nominal Amount",null,null,null,null,null,null,{"$f":"ABS('Sheet 1'!D343)","v":0}]
[]
[]
[]
[]
[]
[]
[]
[]
[]
[]
[]
[]
[]
[]
[]
[]
[]
[]
[]
[]
[null,"Subordinated Loan Capital",null,null,null,null,null,null,{"$f":"I10","v":0}]
[]
[]
[]
[]
[null,"SUBORDINATED LOAN 2 - Fixed Term"]
[]
[null,"As at ",{"$f":"'COVER SHEET'!C29","v":"00:00:00"}]
[]
[null,"Subordinated Loan General Information"]
[]
[null,"Nominal Amount",null,null,null,null,null,null,{"$f":"ABS('Sheet 1'!D344)","v":0}]
[]
[]
[null,"Subordinated Loan Period Calculation"]
[null,"Date Issued",null,null,null,null,{"$f":"IF('Sheet 1'!D344<0,'Sheet 1'!F344,\"\")","v":""}]
[null,"Maturity Date",null,null,null,null,{"$f":"IF('Sheet 1'!D344<0,'Sheet 1'!G344,\"\")","v":""}]
[null,"No. of days",null,null,null,null,{"$f":"IF('Sheet 1'!D344<0,G47-G46,\"\")","v":""}]
[]
[]
[null,"No. of Days to maturity as at reporting period",{"$f":"C38","v":"00:00:00"},null,null,null,{"$f":"IF('Sheet 1'!D344<0,G47-C38,\"\")","v":""}]
[null,"No. of Years to maturity as at reporting Period",{"$f":"C38","v":"00:00:00"},null,null,null,{"$f":"IF('Sheet 1'!D344<0,G51/365,\"\")","v":""}]
[]
[]
[null,"Subordinated Loan General Information"]
[]
[null,"Nominal amount of Subordinated Loan  for the final five year period",null,null,null,null,null,null,{"$f":"IF(G52<5,I42,\"\")","v":""}]
[]
[null,"Number of Calendar days in a 5 year period",null,null,null,null,{"$f":"IF(G52<5,(365*5),\"\")","v":""}]
[]
[null,"No. of Days to maturity as at reporting Period",{"$f":"C38","v":"00:00:00"},null,null,null,{"$f":"IF(G52<5,G51,\"\")","v":""}]
[]
[null,"Amortisation of Subordianted Loan Capital",null,null,null,null,null,null,{"$f":"IF(I57=\"\",0,(IF('Sheet 1'!D344<0,(I57/G59)*G61,0)))","v":0}]
[]
[]
[]
[]
[null,"SUBORDINATED LOAN 3 - Fixed Term"]
[]
[null,"As at ",{"$f":"'COVER SHEET'!C29","v":"00:00:00"}]
[]
[null,"Subordinated Loan General Information"]
[]
[null,"Nominal Amount",null,null,null,null,null,null,{"$f":"ABS('Sheet 1'!D345)","v":0}]
[]
[]
[null,"Subordinated Loan Period Calculation"]
[null,"Date Issued",null,null,null,null,{"$f":"IF('Sheet 1'!D345<0,'Sheet 1'!F345,\"\")","v":""}]
[null,"Maturity Date",null,null,null,null,{"$f":"IF('Sheet 1'!D345<0,'Sheet 1'!G345,\"\")","v":""}]
[null,"No. of days",null,null,null,null,{"$f":"IF('Sheet 1'!D345<0,G79-G78,\"\")","v":""}]
[]
[]
[null,"No. of Days to maturity as at reporting period",{"$f":"C70","v":"00:00:00"},null,null,null,{"$f":"IF('Sheet 1'!D345<0,G79-C70,\"\")","v":""}]
[null,"No. of Years to maturity as at reporting Period",{"$f":"C70","v":"00:00:00"},null,null,null,{"$f":"IF('Sheet 1'!D345<0,G83/365,\"\")","v":""}]
[]
[]
[null,"Subordinated Loan General Information"]
[]
[null,"Nominal amount of Subordinated Loan  for the final five year period",null,null,null,null,null,null,{"$f":"IF(G84<5,I74,\"\")","v":""}]
[]
[null,"Number of Calendar days in a 5 year period",null,null,null,null,{"$f":"IF(G84<5,(365*5),\"\")","v":""}]
[]
[null,"No. of Days to maturity as at reporting Period",{"$f":"C70","v":"00:00:00"},null,null,null,{"$f":"IF(G84<5,G83,\"\")","v":""}]
[]
[null,"Amortisation of Subordianted Loan Capital",null,null,null,null,null,null,{"$f":"IF(I89=\"\",0,IF('Sheet 1'!D345<0,(I89/G91)*G93,0))","v":0}]