{"text_format":"1","workbook":"xlsx","n_sheets":17,"sheets":["COVER SHEET","CONTENTS","Sheet 1","Sheet 2","Sheet 3","Sheet 4","Sheet 4.1","Sheet 4.2","Sheet 5","Sheet 6","Sheet 7","Sheet 8","Non-Malta Funds","ESG Funds","VALIDATION SHEET","LH Names & Codes","Applicable Percentages"],"not_rendered":{"charts":0,"images":4,"macros":1,"external_links":0,"defined_names":129,"comments":1,"pivot_tables":0},"unopened":[],"bounds":{"document_bytes":16777216,"sheet_cells":100000,"rows_first":2000,"rows_last":500,"rows_between":2000,"halvings":0,"cell_chars":16384,"cell_head_chars":4096},"cells_cut":0,"cells_raw":0,"read":"whole","date_system":"1900"}

{"sheet":"COVER SHEET","index":0,"n_rows":98,"n_cols":10,"rows_kept":98,"cut":false,"hidden":false,"merged":[[43,1,45,2],[53,1,57,2],[7,0,7,2],[9,0,10,2],[11,0,11,2],[13,1,13,2],[14,1,14,2],[26,1,26,2]]}
[null,{"$f":"YEAR(C29)","v":1900}]
[]
[]
[]
[]
[]
[]
["INVESTMENT SERVICES RULES FOR INVESTMENT SERVICES PROVIDERS"]
[]
["PART B: STANDARD LICENCE CONDITIONS"]
[]
["Appendix 2B"]
[]
[1,"Document Type:"]
[null,"ANNUAL FINANCIAL RETURN"]
{"$rows_left_out":84}
{"sheet":"CONTENTS","index":1,"n_rows":31,"n_cols":11,"rows_kept":31,"cut":false,"hidden":false,"merged":[[18,3,18,8],[21,3,21,5],[20,3,20,8],[22,3,22,8]]}
[]
[null,"CONTENTS"]
[]
[]
[null,"Sheet 1",null,"INPUT SHEET - MANDATORY",null,null,null,null,null,null,{"$f":"IF('COVER SHEET'!$C$39>0,\"YES\",\"NO\")","v":"NO"}]
[]
[null,"Sheet 2",null,"INCOME STATEMENT ",null,null,null,null,null,null,{"$f":"IF('COVER SHEET'!$C$39>0,\"YES\",\"NO\")","v":"NO"}]
[]
[{"$f":"IF(#REF! =\"Annual Financial Return\",10,0)","v":{"$error":"#REF!"}},"Sheet 3",null,"BALANCE SHEET ",null,null,null,null,null,null,{"$f":"IF('COVER SHEET'!$C$39>0,\"YES\",\"NO\")","v":"NO"}]
[]
[null,"Sheet 4",null,"TOTAL OWN FUNDS CALCULATION",null,null,null,null,null,null,{"$f":"IF('COVER SHEET'!$C$39>0,\"YES\",\"NO\")","v":"NO"}]
[]
[null,"Sheet 5",null,"FIXED OVERHEAD REQUIREMENT",null,null,null,null,null,null,{"$f":"IF('COVER SHEET'!$C$39>0,\"YES\",\"NO\")","v":"NO"}]
[]
[null,"Sheet 6",null,"FINANCIAL RESOURCES REQUIREMENT",null,null,null,null,null,null,{"$f":"IF('COVER SHEET'!$C$39>0,\"YES\",\"NO\")","v":"NO"}]
{"$rows_left_out":17}
{"sheet":"Sheet 1","index":2,"n_rows":1132,"n_cols":37,"rows_kept":1132,"cut":false,"hidden":false,"merged":[[137,1,137,2],[138,1,138,2],[140,1,140,2],[141,1,141,2],[188,1,188,2],[177,1,177,2],[155,1,155,2],[156,1,156,2],[157,1,157,2],[158,1,158,2],[159,1,159,2],[168,1,168,2],[180,1,180,2],[172,1,172,2],[171,1,171,2],[184,1,184,2],[174,1,174,2],[261,1,261,2],[262,1,262,2],[422,1,422,2],[425,1,425,2],[1131,1,1132,2],[1131,3,1132,3],[1119,1,1120,2],[1119,3,1121,3],[1112,1,1113,2],[431,1,434,3],[299,1,299,2],[266,1,266,2],[276,1,276,2],[1127,1,1128,2],[1127,3,1128,3],[283,1,283,2],[275,1,275,2],[271,1,271,2],[269,1,269,2],[270,1,270,2],[273,1,273,2],[274,1,274,2],[279,1,279,2],[280,1,280,2],[217,1,217,2],[218,1,218,2],[219,1,219,2],[220,1,220,2],[221,1,221,2],[222,1,222,2],[288,1,288,2],[244,1,244,2],[245,1,245,2],[256,1,256,2],[257,1,257,2],[286,1,286,2],[278,1,278,2],[287,1,287,2],[258,1,258,2],[265,1,265,2],[272,1,272,2],[259,1,259,2],[267,1,267,2],[284,1,284,2],[285,1,285,2],[264,1,264,2],[282,1,282,2],[260,1,260,2],[407,5,407,7],[95,5,95,7],[111,1,111,2],[108,1,108,2],[109,1,109,2],[110,1,110,2],[57,3,60,3],[115,1,115,2],[196,1,196,2],[186,1,186,2],[178,1,178,2],[179,1,179,2],[124,1,124,2],[125,1,125,2],[133,1,133,2],[98,5,98,7],[105,1,105,2],[117,1,117,2],[139,1,139,2],[187,1,187,2],[181,1,181,2],[182,1,182,2],[183,1,183,2],[185,1,185,2],[393,1,393,2],[421,5,424,8],[426,5,434,8],[88,5,88,9],[94,5,94,7],[281,1,281,2],[296,1,296,2],[297,1,297,2],[298,1,298,2],[277,1,277,2],[268,1,268,2],[428,1,428,2],[195,1,195,2],[227,1,227,2],[202,1,202,2],[203,1,203,2],[193,1,193,2],[214,1,214,2],[229,1,229,2],[112,1,112,2],[198,1,198,2],[212,1,212,2],[213,1,213,2],[215,1,215,2],[226,1,226,2],[252,1,252,2],[241,1,241,2],[240,1,240,2],[247,1,247,2],[248,1,248,2],[290,1,290,2],[396,4,398,7],[394,4,395,7],[312,5,312,6],[313,5,313,6],[336,7,336,11],[295,1,295,2],[389,4,390,7],[391,4,393,7],[300,3,301,3],[301,1,301,2],[307,1,307,2],[314,6,315,6],[322,1,322,2],[327,7,327,11],[320,8,320,9],[291,1,291,2],[294,1,294,2],[263,1,263,2],[251,1,251,2],[57,1,60,2],[113,1,113,2],[114,1,114,2],[242,1,242,2],[237,1,237,2],[238,1,238,2],[239,1,239,2],[243,1,243,2],[246,1,246,2],[197,1,197,2],[134,1,134,2],[135,1,135,2],[205,1,205,2],[216,1,216,2],[154,1,154,2],[160,1,160,2],[175,1,175,2],[170,1,170,2],[164,1,164,2],[142,1,142,2],[143,1,143,2],[144,1,144,2],[5,6,5,7],[43,4,43,6],[90,4,90,6],[92,4,92,6],[165,1,165,2],[166,1,166,2],[167,1,167,2],[86,5,86,6],[151,1,151,2],[152,1,152,2],[153,1,153,2],[161,1,161,2],[103,1,103,2],[104,1,104,2],[89,5,89,6],[87,5,87,6],[121,1,121,2],[106,1,106,2],[107,1,107,2],[102,1,102,2],[99,5,99,11],[163,1,163,2],[162,1,162,2],[136,1,136,2],[418,5,418,7],[211,1,211,2],[189,1,189,2],[223,1,223,2],[224,1,224,2],[225,1,225,2],[190,1,190,2],[191,1,191,2],[199,1,199,2],[200,1,200,2],[201,1,201,2],[204,1,204,2],[206,1,206,2],[207,1,207,2],[208,1,208,2],[209,1,209,2],[358,5,358,11],[253,1,253,2],[254,1,254,2],[210,1,210,2],[390,1,390,2],[234,1,234,2],[249,1,249,2],[236,1,236,2],[1131,0,1132,0],[418,1,418,2],[45,1,45,2],[46,1,46,2],[145,1,145,2],[146,1,146,2],[147,1,147,2],[148,1,148,2],[149,1,149,2],[150,1,150,2],[176,1,176,2],[118,1,118,2],[119,1,119,2],[120,1,120,2],[122,1,122,2],[123,1,123,2],[116,1,116,2],[128,1,128,2],[129,1,129,2],[130,1,130,2],[132,1,132,2],[131,1,131,2],[250,1,250,2],[126,1,126,2],[127,1,127,2],[173,1,173,2],[169,1,169,2],[431,0,434,0],[1112,0,1113,0],[1119,0,1121,0],[1127,0,1128,0],[392,1,392,2],[230,1,230,2],[192,1,192,2],[194,1,194,2],[228,1,228,2],[293,1,293,2],[292,1,292,2],[389,1,389,2],[391,1,391,2],[394,1,394,2],[396,1,396,2],[255,1,255,2],[231,1,231,2],[232,1,232,2],[233,1,233,2],[235,1,235,2],[395,1,395,2]]}
[]
[]
[]
[null,"INPUT SHEET"]
[]
[null,"For the period from ",{"$f":"'COVER SHEET'!C28","v":"00:00:00"}," to ",null,null,{"$f":"'COVER SHEET'!C29","v":"00:00:00"}]
[]
[null,null,"Amounts included on the credit should be -ve "]
[null,null,"Amounts included on the debit should be +ve "]
[null,null,null,"As per Trial Balance"]
[]
[null,"1) Income"]
["1.a","a) Dealing Profit or (Loss) - Trading"]
["1.b","b) Dealing Profit or (Loss) - Long Term Investments"]
[null,"c) Commissions received on transactions in :"]
{"$rows_left_out":1118}
{"sheet":"Sheet 2","index":3,"n_rows":116,"n_cols":14,"rows_kept":116,"cut":false,"hidden":false,"merged":[[73,1,73,5],[71,1,71,5],[23,1,23,4],[24,1,24,4],[33,1,33,4],[34,1,34,4],[35,1,35,4],[36,1,36,4],[37,1,37,4],[38,1,38,4],[72,1,72,5]]}
[]
[null,null,null,null,null,null,null,null,null,"Initialled by the auditor for identification purposes only "]
[]
[null,"INCOME STATEMENT & ITEMS THROUGH STATEMENT OF CHANGES IN EQUITY"]
[]
[null,"For the period from ",null,{"$f":"'COVER SHEET'!C28","v":"00:00:00"}," to ",{"$f":"'COVER SHEET'!C29","v":"00:00:00"}]
[]
[null,null,null,null,null,null,{"$f":"IF('COVER SHEET'!C34=\"\",\"\",'COVER SHEET'!C34)","v":""},null,null,null,{"$f":"IF('COVER SHEET'!C34=\"\",\"\",'COVER SHEET'!C34)","v":""}]
[null,"Dealing Profit / (Loss)"]
[]
[1,"Dealing Profit or (Loss)",null,null,null,null,null,null,null,null,null,"70eb04cce2f2b382655bfe806b1c4870"]
["1.a","a) Dealing Profit or (Loss) - Trading",null,null,null,null,{"$f":"-'Sheet 1'!D13","v":0},null,null,null,null,"f5b78bad4d5708c48de167b147d8c5ce"]
["1.b","b) Dealing Profit or (Loss) - Long Term Financial Instruments",null,null,null,null,{"$f":"-'Sheet 1'!D14","v":0},"Total Dealing Profit or (Loss)",null,null,{"$f":"+G12+G13","v":0},"80ab4b4c50ac2234a7dc0301a3645588"]
[]
[]
{"$rows_left_out":102}
{"sheet":"Sheet 3","index":4,"n_rows":74,"n_cols":11,"rows_kept":74,"cut":false,"hidden":false,"merged":[[69,1,69,9],[37,1,37,5],[36,1,36,5],[38,1,38,5],[47,1,47,4]]}
[]
[null,null,null,null,null,null,null,null,"Initialled by the auditor for identification purposes only "]
[]
[null,"STATEMENT OF FINANCIAL POSITION"]
[]
[null,"As at: ",{"$f":"'COVER SHEET'!C29","v":"00:00:00"}]
[]
[null,"Assets"]
[null,null,null,null,null,null,{"$f":"IF('COVER SHEET'!C34=\"\",\"\",'COVER SHEET'!C34)","v":""},null,null,{"$f":"IF('COVER SHEET'!C34=\"\",\"\",'COVER SHEET'!C34)","v":""}]
[1,"Non-current"]
["1.a","a) Intangible assets",null,null,null,null,{"$f":"'Sheet 1'!D96+'Sheet 1'!D97","v":0},null,null,null,"a07c611582cc29c1a8285d14bd192d34"]
["1.b","b) Property, Plant and Equipment",null,null,null,null,{"$f":"'Sheet 1'!D98","v":0},null,null,null,"e27e7730d73c6128da76c09bc7786ca7"]
["1.c","c) Investment Property",null,null,null,null,{"$f":"'Sheet 1'!D99","v":0},"Total Non-current assets",null,{"$f":"SUM(G11:G13)","v":0},"5a16fc4e05742781bd71ab57930803c2"]
[]
[2,"Other non-current Assets",null,null,null,null,null,null,null,null,"e070c3a7a3d4bc91656dd558cebac7c9"]
{"$rows_left_out":60}
{"sheet":"Sheet 4","index":5,"n_rows":103,"n_cols":5,"rows_kept":103,"cut":false,"hidden":false,"merged":[[12,0,14,0],[1,1,1,4]]}
[]
[null,"OWN FUNDS"]
[]
[null,"Rows","Item","Label","Amount"]
[null,"010",1,"OWN FUNDS",{"$f":"SUM(E7+E61+E82)","v":0}]
[null,"015","1.1","TIER 1 CAPITAL",{"$f":"SUM(E7+E61)","v":0}]
[null,"020",{"$f":"C$6&\".1\"","v":"1.1.1"},"COMMON EQUITY TIER 1 CAPITAL",{"$f":"(E8+E17+E22+E23+E24+E25+E26+E27+E28+E34+E38+E41+E42+E43+E47+E48+E49+E50+E51+E52+E53+E54+E55+E56+E57+E58+E59+E60)","v":0}]
[null,"030",{"$f":"C$7&\".1\"","v":"1.1.1.1"},"Capital instruments eligible as CET1 Capital",{"$f":"E9+E11+E12+E16-E10","v":0}]
[null,"040",{"$f":"C$8&\".1\"","v":"1.1.1.1.1"},"Paid up capital instruments ",{"$f":"ABS('Sheet 1'!D364)","v":0}]
[null,"050","1.1.1.1.2*","Memorandum item: Capital instruments not eligible"]
[null,"060",{"$f":"C$8&\".3\"","v":"1.1.1.1.3"},"Share premium",{"$f":"ABS('Sheet 1'!D375)","v":0}]
[null,"070",{"$f":"C$8&\".4\"","v":"1.1.1.1.4"},"(-) Own CET1 instruments",{"$f":"SUM(E13:E15)","v":0}]
[null,"080",{"$f":"C$12&\".1\"","v":"1.1.1.1.4.1"},"(-) Direct holdings of CET1 instruments",{"$f":"IF(AND('Sheet 1'!F404=\"CET 1\",'Sheet 1'!G404=\"Direct\"),-'Sheet 1'!H404,\"0\")","v":"0"}]
[null,"090",{"$f":"C$12&\".2\"","v":"1.1.1.1.4.2"},"(-) Indirect holdings of CET1 instruments",{"$f":"IF(AND('Sheet 1'!F404=\"CET 1\",'Sheet 1'!G404=\"Indirect\"),-'Sheet 1'!H404,\"0\")","v":"0"}]
[null,"091",{"$f":"C$12&\".3\"","v":"1.1.1.1.4.3"},"(-) Synthetic holdings of CET1 instruments",{"$f":"IF(AND('Sheet 1'!F404=\"CET 1\",'Sheet 1'!G404=\"Synthetic\"),-'Sheet 1'!H404,\"0\")","v":"0"}]
{"$rows_left_out":89}
{"sheet":"Sheet 4.1","index":6,"n_rows":127,"n_cols":5,"rows_kept":127,"cut":false,"hidden":false,"merged":[]}
[]
[null,"C 04.00 - MEMORANDUM ITEMS (CA4)"]
[]
[null,"Row","ID","Item","Amount"]
[null,"Deferred tax assets and liabilities"]
[null,"010",1,"Total deferred tax assets",{"$f":"'Sheet 1'!D100","v":0}]
[null,"020",{"$f":"C$6&\".1\"","v":"1.1"},"Deferred tax assets that do not rely on future profitability"]
[null,"030",{"$f":"C$6&\".2\"","v":"1.2"},"Deferred tax assets that rely on future profitability and do not arise from temporary differences"]
[null,"040",{"$f":"C$6&\".3\"","v":"1.3"},"Deferred tax assets that rely on future profitability and arise from temporary differences"]
[null,"050",2,"Total deferred tax liabilities",{"$f":"-'Sheet 1'!D359","v":0}]
[null,"060",{"$f":"C$10&\".1\"","v":"2.1"},"Deferred tax liabilities non deductible from deferred tax assets that rely on future profitability",{"$f":"SUM('Sheet 4'!E37+'Sheet 4'!E40+'Sheet 4'!E45)","v":0}]
[null,"070",{"$f":"C$10&\".2\"","v":"2.2"},"Deferred tax liabilities deductible from deferred tax assets that rely on future profitability",{"$f":"SUM(E13:E14)","v":0}]
[null,"080",{"$f":"C$12&\".1\"","v":"2.2.1"},"Deductible deferred tax liabilities associated with deferred tax assets that rely on future profitability and do not arise from temporary differences"]
[null,"090",{"$f":"C$12&\".2\"","v":"2.2.2"},"Deductible deferred tax liabilities associated with deferred tax assets that rely on future profitability and arise from temporary differences"]
[null,"Credit risk adjustments and expected losses"]
{"$rows_left_out":113}
{"sheet":"Sheet 4.2","index":7,"n_rows":63,"n_cols":11,"rows_kept":63,"cut":false,"hidden":false,"merged":[[1,1,1,10],[3,1,4,3],[3,4,5,4],[3,5,4,5],[3,6,4,6],[3,7,4,7],[3,8,4,8],[3,9,3,10]]}
[]
[null,"C 05.01 - TRANSITIONAL PROVISIONS (CA5.1)"]
[]
[null,"CA 5.1",null,null,"Legal references","Adjustments to CET1","Adjustments to AT1","Adjustments to T2","Adjustments included in RWAs","Memorandum items"]
[null,null,null,null,null,null,null,null,null,"Applicable percentage","Eligible amount without transitional provisions"]
[null,"Code","ID","Item",null,"010","020","030","040","050","060"]
[null,"010","1","TOTAL ADJUSTMENTS",null,{"$f":"SUM(F8+F13+F18)","v":0},{"$f":"SUM(G8+G13+G18)","v":0},{"$f":"SUM(H8+H13+H18)","v":0},0,null,0]
[null,"020","1.1","GRANDFATHERED INSTRUMENTS",null,{"$f":"SUM(F9+F12)","v":0},{"$f":"SUM(G9+G12)","v":0},{"$f":"SUM(H9+H12)","v":0},0,null,0]
[null,"030","1.1.1","Grandfathered instruments: Instruments constituting state aid","Article 462 of CRR",{"$f":"SUM(F10+F11)","v":0},{"$f":"SUM(G10+G11)","v":0},{"$f":"SUM(H10+H11)","v":0}]
[null,"040","1.1.1.1","Instruments that qualified as own funds according to 2006/48/EC","Article 462 (2), (3) and (4) of CRR",0,0,0]
[null,"050","1.1.1.2","Instruments issued by institutions that are incorporated in a Member State that is subject to an Economic Adjustment Programme","Article 462(1), (2a), (3a), (5) and (6) of CRR",0,0,0]
[null,"060","1.1.2","Instruments not constituting state aid",null,0,0,0]
[null,"070","1.2","MINORITY INTERESTS AND EQUIVALENTS",null,{"$f":"SUM(F14:F15)","v":0},{"$f":"SUM(G16)","v":0},{"$f":"SUM(H17)","v":0}]
[null,"080","1.2.1","Capital instruments and items that do not qualify as minority interests","Articles 459 of CRR",0,null,null,null,0]
[null,"090","1.2.2","Transitional recognition in consolidated own funds of minority interests","Articles 79 and 460 of CRR",0,null,null,null,1,{"$f":"'Sheet 4'!E26","v":0}]
{"$rows_left_out":49}
{"sheet":"Sheet 5","index":8,"n_rows":47,"n_cols":13,"rows_kept":47,"cut":false,"hidden":false,"merged":[[34,1,34,5],[33,1,33,5],[3,1,3,7],[18,1,18,5],[28,1,28,5],[30,1,30,5],[15,1,15,5],[17,1,17,5],[23,1,23,5],[26,1,26,5]]}
[]
[null,null,null,null,null,null,null,"Initialled by the auditor for identification purposes only "]
[]
[null,"FIXED OVERHEAD REQUIREMENT"]
[]
[null,"As at:",{"$f":"'COVER SHEET'!C29","v":"00:00:00"},null,null,null,null,null,null,null,null,null,"Yes"]
[null,null,null,null,null,null,null,null,null,null,null,null,"No"]
[1,"How many months are represented in the recent Audited Financial Statements"]
[]
[2,"Total Expenditure",null,null,null,null,null,null,null,null,null,null,1]
[null,null,null,null,null,null,null,null,null,null,null,null,2]
[null,null,null,null,null,null,null,null,null,null,null,null,3]
[3,"Less:",null,null,null,null,null,null,null,null,null,null,4]
["3.a","a) fully discretionary staff bonuses",null,null,null,null,null,null,null,null,null,null,5]
[null,null,null,null,null,null,null,null,null,null,null,null,6]
{"$rows_left_out":33}
{"sheet":"Sheet 6","index":9,"n_rows":29,"n_cols":14,"rows_kept":29,"cut":false,"hidden":false,"merged":[[15,2,15,5],[17,1,17,5],[19,1,19,5],[21,1,21,6]]}
[]
[]
[null,null,null,null,null,null,null,null,0]
[null,"FINANCIAL RESOURCES REQUIREMENT"]
[]
[null,"As at ",{"$f":"'COVER SHEET'!C29","v":"00:00:00"}]
[]
[]
[]
["1.0","Total Own Funds",null,null,null,null,null,null,{"$f":"'Sheet 4'!E5","v":0}]
[]
[2,"Fixed Overhead Requirement",null,null,null,null,null,null,{"$f":"'Sheet 5'!I47","v":0}]
[]
[]
[null,null,null,null,null,null,""]
{"$rows_left_out":15}
{"sheet":"Sheet 7","index":10,"n_rows":113,"n_cols":15,"rows_kept":113,"cut":false,"hidden":false,"merged":[[112,2,112,5],[76,1,76,10],[77,1,77,10],[96,2,96,5],[101,2,101,5],[106,9,106,10],[110,8,110,9],[74,1,74,10],[43,1,43,6],[44,1,44,6],[45,1,45,6],[46,1,46,6],[47,1,47,6],[48,1,48,6],[49,1,49,6],[50,1,50,6],[51,1,51,6],[64,2,64,3],[64,5,64,6],[18,2,21,8],[22,2,24,8],[15,2,16,8],[42,1,42,6],[30,1,30,6],[32,1,32,6],[33,1,33,6],[34,1,34,6],[35,1,35,6],[36,1,36,6],[37,1,37,6],[38,1,38,6],[39,1,39,6],[40,1,40,6],[41,1,41,6]]}
[]
[]
[]
[null,"REPRESENTATIONS",null,null,null,{"$f":"IF('COVER SHEET'!C18=\"\",\"\",'COVER SHEET'!C18)","v":""}]
[]
[null,null,null,null,null,null,null,null,null,null,"Insert Yes/ No:"]
[]
["1.","Is the licence holder able, and will it be able for the forseeable future, to meet all of its liabilities ",null,null,null,null,null,null,null,null,null,null,null,null,"YES"]
[null,"as they fall due for payment?",null,null,null,null,null,null,null,null,null,null,null,null,"NO"]
[]
["2.","Have the licence holder's Financial Resources been in excess of or equal to its Financial "]
[null,"Resources Surplus throughout the period ending on the Accounting Reference Date?"]
[]
["3.","We Confirm that :"]
[]
{"$rows_left_out":99}
{"sheet":"Sheet 8","index":11,"n_rows":63,"n_cols":18,"rows_kept":63,"cut":false,"hidden":false,"merged":[[6,2,6,5],[8,3,8,4],[34,2,34,3],[15,15,18,15],[15,14,18,14],[15,13,18,13],[47,13,47,14],[37,2,37,3],[60,1,60,7],[39,2,39,3],[42,2,42,3],[48,2,48,3],[50,2,50,3],[55,1,56,7],[58,1,59,7]]}
[]
[]
[]
[null,null,null,null,null,null,null,null,null,null,null,"Old Fee Calculation"]
[]
[null,null,null,null,null,null,null,null,null,null,null,null,null,"Fixed (€)","Variable/tranche (€)","Variable","Total","Currency"]
[null,null,"ANNUAL SUPERVISORY FEE CALCULATOR",null,null,null,null,null,null,null,null,"Category 1A",null,2000,350,{"$f":"IF($E$27<50000,0,IF($E$27<=1000000,(ROUNDUP((($E$27-50000)/50000),0)*$O$7),(19*$O$7)))","v":0},{"$f":"N7+P7","v":2000},"EUR"]
[null,null,null,null,null,null,null,null,null,null,null,"Category 1B",null,2750,350,{"$f":"IF($E$27<50000,0,IF($E$27<=1000000,(ROUNDUP((($E$27-50000)/50000),0)*$O$8),(19*$O$8)))","v":0},{"$f":"N8+P8","v":2750},"GBP"]
[null,null,null,"(To be compiled and submitted in hard copy on an Annual basis together with the Audited Annual Financial Return)",null,null,null,null,null,null,null,"Category 2",null,4500,400,{"$f":"IF($E$27<250000,0,IF($E$27<=5000000,(ROUNDUP((($E$27-250000)/250000),0)*$O$9),(19*$O$9)))","v":0},{"$f":"N9+P9","v":4500},"USD"]
[null,null,null,null,null,null,null,null,null,null,null,"Category 3",null,6000,400,{"$f":"IF($E$27<250000,0,IF($E$27<=50000000,(ROUNDUP((($E$27-250000)/250000),0)*$O$10),(199*$O$10)))","v":0},{"$f":"N10+P10","v":6000}]
[null,null,null,null,null,null,null,null,null,null,null,"Category 4A",null,15000,"N/A","N/A",{"$f":"N11","v":15000}]
[null,null,1,"Name of Licence Holder",{"$f":"'COVER SHEET'!C18","v":0},null,null,null,null,null,null,"Category 4B",null,5000,"N/A","N/A",{"$f":"N12","v":5000}]
[]
[null,null,2,"Licence Category","Category 2","",null,null,null,null,null,"Old fee total:",null,{"$f":"IF(E14=L7,Q7,IF(E14=L8,Q8,IF(E14=L9,Q9,IF(E14=L10,Q10,IF(E14=L11,Q11,IF(E14=L12,Q12,0))))))","v":4500}]
[]
{"$rows_left_out":49}
{"sheet":"Non-Malta Funds","index":12,"n_rows":234,"n_cols":10,"rows_kept":234,"cut":false,"hidden":false,"merged":[[1,1,1,10]]}
[]
[null,"NON-MALTA DOMICILED FUNDS MANAGED IN MALTA"]
[]
[null,null,{"$f":"'COVER SHEET'!C18","v":0},null,null,null,"DATA PROVIDED AS AT",{"$f":"'COVER SHEET'!C29","v":"00:00:00"}]
[]
[null,"Kindly Indicate the number of non-Malta domiciled Collective Investment Schemes (including sub-Funds) managed by the Fund Manager directly or indirectly."]
[null,"In the case of both feeder and master funds being managed, kindly list both funds but include AUM only once.",null,null,null,"Please input in the relevant cells highlighted in blue "]
[]
[0,"Name of non-Malta domiciled Collective Investment Scheme managed by the fund manager","Name  of sub-Fund","Domiciled country of fund (Country where the fund is licensed)","Name of Custodian","Location of Custodian","Other custodians (if any)","Location of other custodians (if any)","Type of fund (equity fund, bond fund, hedge fund, real estate fund,  money market fund, etc.)","Assets Under Management (in EUR)"]
[1]
[{"$f":"A10+1","v":2}]
[3]
[4]
[5]
[6]
{"$rows_left_out":220}
{"sheet":"ESG Funds","index":13,"n_rows":238,"n_cols":11,"rows_kept":238,"cut":false,"hidden":false,"merged":[[1,1,1,8]]}
[]
[null,"Information as per Regulation (EU) 2019/2088 (\"SFDR\")"]
[]
[null,null,{"$f":"'COVER SHEET'!C18","v":0},null,null,"DATA PROVIDED AS AT",{"$f":"'COVER SHEET'!C29","v":"00:00:00"},null,null,null,"Article 8"]
[null,null,null,null,null,null,null,null,null,null,"Article 9"]
[1,"Does the Licence Holder consider PAIs at entity level, as referred to in SFDR Article 4(1)?",null,null,null,{"$f":"IF(E6=\"\",\"Field is required. Please select either Yes/No\",\"\")","v":"Field is required. Please select either Yes/No"}]
[]
[2,"Does the Licence Holder consider PAIs at product level, as referred to in SFDR Article 7(1)?",null,null,null,{"$f":"IF(E8=\"\", \"Field is required. Please select either Yes/No\", \"\")","v":"Field is required. Please select either Yes/No"}]
[]
[3,"Does the Licence Holder have Article 8 and/or Article 9 funds under its management?",null,null,null,{"$f":"IF(E10=\"\", \"Field is required. Please select either Yes/No\", \"\")","v":"Field is required. Please select either Yes/No"}]
[]
[null,{"$f":"IF(E10 = \"Yes\", \"Kindly fill in the table below given that the Licence Holder has Article 8 / Article 9 funds under its management\", \"Do not fill in the table below as the Licence Holder does not have Article 8 / Article 9 funds under its management\")","v":"Do not fill in the table below as the Licence Holder does not have Article 8 / Article 9 funds under its management"}]
[0,"Scheme Name","Sub-fund Name","Classification of Sub-fund as per the SFDR","Legal Entity Identifier (LEI) of Sub-fund","Country of Domicile","Total AUM of the Sub-fund (in Euro)","Link to SFDR Website Disclosures"]
[4]
[5]
{"$rows_left_out":224}
{"sheet":"VALIDATION SHEET","index":14,"n_rows":99,"n_cols":14,"rows_kept":99,"cut":false,"hidden":false,"merged":[[5,1,5,2],[5,4,5,7],[5,13,5,20]]}
[]
[]
[]
[null,"VALIDATION SHEET"]
[]
[null,"Sheet Number:",null,null,"Sheet Title",null,null,null,null,null,null,null,null,"Description of Error"]
[]
[null,"Cover Sheet",null,null,null,null,null,null,null,null,null,{"$f":"+IF(G66>0,\"ERROR\",\"OK\")","v":"ERROR"},null,{"$f":"IF(L8=\"ERROR\",\"CHECK THAT ENTRIES IN COVER SHEET ARE CORRECTLY INPUTTED.\",\"\")","v":"CHECK THAT ENTRIES IN COVER SHEET ARE CORRECTLY INPUTTED."}]
[]
[null,"Sheet 1","IFR 1",null,"INPUT SHEET - MANDATORY",null,null,null,null,null,null,{"$f":"+IF(G73>0,\"ERROR\",\"OK\")","v":"ERROR"},null,{"$f":"IF(L10=\"ERROR\",\"CHECK THAT ALL ENTRIES HAVE BEEN FILLED AND ARE CORRECTLY INPUTTED.\",\"\")","v":"CHECK THAT ALL ENTRIES HAVE BEEN FILLED AND ARE CORRECTLY INPUTTED."}]
[null,null,null,null,null,null,null,null,null,null,null,null,null,{"$f":"IF(E69=\"ERROR\",\"CHECK SHEET 1 - SECURED LIABILITIES\",\"\")","v":""}]
[]
[]
[null,"Sheet 2","IFR 2",null,"INCOME STATEMENT ",null,null,null,null,null,null,{"$f":"IF(AND(E75=\"OK\"),\"OK\",\"ERROR\")","v":"OK"},null,{"$f":"IF(E75=\"ERROR\",\"CHECK SHEET 2 - ITEMS IN THE INCOME STATEMENT.\",\"\")","v":""}]
[null,null,null,null,null,null,null,null,null,null,null,null,null,{"$f":"IF(E76=\"ERROR\",\"CHECK SHEET 2 - SECTIONS 8 AND/ OR 19\",\"\")","v":""}]
{"$rows_left_out":85}
{"sheet":"LH Names & Codes","index":15,"n_rows":52,"n_cols":5,"rows_kept":52,"cut":false,"hidden":true,"merged":[]}
["LH Name","Code","Licence Type","LEI Code"]
["24 Capital Management Limited ","24CM","AIFM","254900U468UFGFSSUU96"]
["Abalone Asset Management Limited","ABAL","AIFM+UCITS","213800RJPNK256NQ3V19"]
["Accendo Capital Management","ACML14","AIFM","984500BC2E0X69ETCF12"]
["Accolade Investment Company Limited","AICL","AIFM","52990058ACRLCNZ2UY14"]
["Adventum International Limited","ADVN","AIFM","529900SSBWKEESF51507"]
["AKJ FMG Limited","FMGM","AIFM","213800NV7JCBS2TXRH63","lapsed"]
["Alanda Capital Management (Malta) Limited","ALND","AIFM","213800ABTM42ACZA6145","lapsed"]
["Altarius Asset Management Limited","ALTA","AIFM","5299000X84JRI8MS7D35"]
["AMAGIS Capital Management Limited","AMAG","AIFM+UCITS","213800QCBVP7O9DPFD93"]
["Andurand Capital Management Limited","ANDU","AIFM","549300C74U6R5H5T5081"]
["APartners Capital Investment Management Limited","APIM","AIFM","213800KL64XGYK86Z111"]
["AQA Capital (Malta) Limited","AQAC","AIFM+UCITS","2138001G8FUBS3YXAL75"]
["Audentia Capital Management Limited","ACML","AIFM","213800EMSWGQ5MV2P206"]
["AUM Asset Management Limited","AUMA","AIFM","213800CXW86T97PXU441"]
{"$rows_left_out":38}
{"sheet":"Applicable Percentages","index":16,"n_rows":43,"n_cols":7,"rows_kept":43,"cut":false,"hidden":true,"merged":[[0,0,0,1],[13,0,13,1],[29,0,29,2],[37,0,37,2]]}
["GrandFathering Instruments",null,"464(5)"]
[2013,0.9]
[{"$f":"A2+1","v":2014},{"$f":"B2-10%","v":0.8}]
[{"$f":"A3+1","v":2015},{"$f":"B3-10%","v":0.70000000000000007}]
[2016,0.60000000000000009]
[2017,0.50000000000000011]
[2018,0.40000000000000013]
[2019,0.30000000000000016]
[2020,0.20000000000000015]
[2021,0.10000000000000014]
[null,null,null,null,100,{"$f":"IF((E11+E12-E13)>0,C1,C14)","v":"459(3)"}]
[null,null,null,null,2000]
[null,null,null,null,3000]
[" Capital instruments and items that do not qualify as minority interests",null,"459(3)"]
[2013,1]
{"$rows_left_out":28}