{"text_format":"1","workbook":"xlsx","n_sheets":14,"sheets":["I_DETAILS","T1_VT","T2_C(8)","T3_C(9)","T4_C(4)(5-7)(10)","T5_TSMI","T6_EM","T7_CS","T8_EA","O1_ODFI","O2_ODCC","II_DECLARATIONS","W1_DET.","LISTS"],"not_rendered":{"charts":0,"images":2,"macros":1,"external_links":0,"defined_names":16,"comments":0,"pivot_tables":0},"unopened":[],"bounds":{"document_bytes":16777216,"sheet_cells":100000,"rows_first":2000,"rows_last":500,"rows_between":2000,"halvings":0,"cell_chars":16384,"cell_head_chars":4096},"cells_cut":0,"cells_raw":0,"read":"whole","date_system":"1900"}

{"sheet":"I_DETAILS","index":0,"n_rows":56,"n_cols":13,"rows_kept":56,"cut":false,"hidden":false,"merged":[[55,1,56,3],[2,1,2,5],[5,1,5,3],[30,2,33,2],[4,5,6,5],[54,2,54,3]]}
[]
[null,"MALTA FINANCIAL SERVICES AUTHORITY",null,null,{"$f":"TODAY()","v":"2019-04-08"},null,null,"Working"]
[null,"Financial Instrument Test",null,null,null,null,null,"Name ",null,"IF","SUM"]
[]
[]
[null,"DETAILS SHEET",null,null,{"$f":"IF(AND(J42=1,J40=1),E40&\"_\"&E42,\" \")","v":" "},null,null,{"$f":"UPPER(LEFT(E40,4))","v":""},null,">0",{"$f":"SUM(J11:J50)","v":0}]
[]
[]
[null,"USER DETAILS"]
[]
{"$rows_left_out":47}
{"sheet":"T1_VT","index":1,"n_rows":30,"n_cols":14,"rows_kept":30,"cut":false,"hidden":false,"merged":[[15,1,15,4],[17,2,17,3],[1,7,1,8],[4,5,8,5],[21,2,21,3],[2,1,2,4],[12,2,12,3],[13,2,13,3],[19,1,19,4],[10,1,10,4],[5,0,7,0],[5,1,5,2],[5,3,5,4],[6,1,6,2],[6,3,6,4],[7,1,7,2],[7,3,7,4]]}
[]
[null,"Financial Instrument Test",null,null,null,null,null,"Working",null,"Blank","Completed ","Criteria (VT)","Sheet ON","Validate "]
[null,"T1 - Virtual Token",null,null,null,null,null,null,null,{"$f":"IF(SUM(H22:H22)=0,1,0)","v":1},{"$f":"IF(SUM(H13:H22)=4,1,0)","v":0},{"$f":"IF(AND(L20=1,K3=1,L11=1,L16=0),1,0)","v":0},{"$f":"W1_DET.!B13","v":0},{"$f":"W1_DET.!L14","v":0}]
[]
[]
[null,"Financial Instrument Test Ref.:",null,{"$f":"I_DETAILS!E6","v":" "}]
[null,"DLT Asset Name:",null,{"$f":"IF(I_DETAILS!E44=0,\"\",I_DETAILS!E44)","v":""},null,null,null,"IF"]
[null,"User: ",null,{"$f":"I_DETAILS!E13&\" \"&I_DETAILS!E15","v":" "},null,null,null,">0","Yes"]
[]
[]
{"$rows_left_out":21}
{"sheet":"T2_C(8)","index":2,"n_rows":21,"n_cols":14,"rows_kept":21,"cut":false,"hidden":false,"merged":[[1,7,1,8],[4,5,8,5],[10,1,10,4],[12,2,12,3],[2,1,2,4],[5,0,7,0],[5,1,5,2],[5,3,5,4],[6,1,6,2],[6,3,6,4],[7,1,7,2],[7,3,7,4]]}
[]
[null,"Financial Instrument Test",null,null,null,null,null,"Working",null,"Blank","Completed ","Criteria (CIII)","Sheet ON","Validate "]
[null,"T2 - C(8) FINANCIAL INSTRUMENTS UNDER MIFID",null,null,null,null,null,null,null,{"$f":"IF(SUM(H13)=0,1,0)","v":1},{"$f":"IF(SUM(H13)=1,1,0)","v":0},{"$f":"L11","v":0},{"$f":"W1_DET.!C13","v":0},{"$f":"W1_DET.!C14","v":0}]
[]
[]
[null,"Financial Instrument Test Ref.:",null,{"$f":"I_DETAILS!E6","v":" "}]
[null,"DLT Asset Name:",null,{"$f":"IF(I_DETAILS!E44=0,\"\",I_DETAILS!E44)","v":""},null,null,null,"IF"]
[null,"User: ",null,{"$f":"I_DETAILS!E13&\" \"&I_DETAILS!E15","v":" "},null,null,null,">0","Yes"]
[]
[]
{"$rows_left_out":12}
{"sheet":"T3_C(9)","index":3,"n_rows":21,"n_cols":14,"rows_kept":21,"cut":false,"hidden":false,"merged":[[1,7,1,8],[4,5,8,5],[10,1,10,4],[12,2,12,3],[2,1,2,4],[5,0,7,0],[5,1,5,2],[5,3,5,4],[6,1,6,2],[6,3,6,4],[7,1,7,2],[7,3,7,4]]}
[]
[null,"Financial Instrument Test",null,null,null,null,null,"Working",null,"Blank","Completed ","Criteria (CIX)","Sheet ON","Validate "]
[null,"T3 - C(9) FINANCIAL INSTRUMENTS UNDER MIFID",null,null,null,null,null,null,null,{"$f":"IF(SUM(H13)=0,1,0)","v":1},{"$f":"IF(SUM(H13)=1,1,0)","v":0},{"$f":"L11","v":0},{"$f":"W1_DET.!D13","v":0},{"$f":"W1_DET.!D14","v":0}]
[]
[]
[null,"Financial Instrument Test Ref.:",null,{"$f":"I_DETAILS!E6","v":" "}]
[null,"DLT Asset Name:",null,{"$f":"IF(I_DETAILS!E44=0,\"\",I_DETAILS!E44)","v":""},null,null,null,"IF"]
[null,"User: ",null,{"$f":"I_DETAILS!E13&\" \"&I_DETAILS!E15","v":" "},null,null,null,">0","Yes"]
[]
[]
{"$rows_left_out":12}
{"sheet":"T4_C(4)(5-7)(10)","index":4,"n_rows":59,"n_cols":18,"rows_kept":59,"cut":false,"hidden":false,"merged":[[37,2,37,3],[18,1,18,4],[40,1,40,4],[47,2,47,3],[48,2,48,3],[44,2,44,3],[45,2,45,3],[46,1,46,4],[49,2,49,3],[24,1,24,4],[25,2,25,3],[26,1,26,4],[27,2,27,3],[28,2,28,3],[29,2,29,3],[30,2,30,3],[31,2,31,3],[32,2,32,3],[33,2,33,3],[34,2,34,3],[35,2,35,3],[36,2,36,3],[42,1,42,4],[43,2,43,3],[1,7,1,8],[4,5,8,5],[41,2,41,3],[22,2,22,3],[23,2,23,3],[19,2,19,3],[20,2,20,3],[21,2,21,3],[39,1,39,4],[14,2,14,3],[15,2,15,3],[17,1,17,4],[10,1,10,4],[12,2,12,3],[13,2,13,3],[2,1,2,4],[5,0,7,0],[5,1,5,2],[5,3,5,4],[6,1,6,2],[6,3,6,4],[7,1,7,2],[7,3,7,4]]}
[]
[null,"Financial Instrument Test",null,null,null,null,null,"Working",null,"Blank","Completed ","Criteria (CIV)","Criteria (CV-VII)","Criteria (CX)","Criteria (ODFI)","Criteria (ODCC)","Sheet ON","Validate "]
[null,"T4 - C(4),C(5) to C(7) and C(10) FINANCIAL INSTRUMENTS UNDER MIFID",null,null,null,null,null,null,null,{"$f":"IF(SUM(H13:H42)=0,1,0)","v":1},{"$f":"IF(SUM(H13:H16,H20:H24,H26,H28:H38,H42,H44:H45,H48:H49)=26,1,0)","v":0},{"$f":"IF(AND(L11=1,L19=1,L40=1,K3=1),1,0)","v":0},{"$f":"IF(AND(M11=1,M19=1,M40=1,K3=1),1,0)","v":0},{"$f":"IF(AND(N11=1,N40=1,N19=1,K3=1),1,0)","v":0},{"$f":"IF(AND(O11=1,O19=1,O40=1,K3=1,M19=1),1,(IF(AND(O11=1,O19=1,O40=1,K3=1,N19=1),2,0)))","v":0},{"$f":"IF(AND(P19=1,P11=1,P40=1,K3=1),1,0)","v":0},{"$f":"W1_DET.!E13","v":0},{"$f":"W1_DET.!E14","v":0}]
[]
[]
[null,"Financial Instrument Test Ref.:",null,{"$f":"I_DETAILS!E6","v":" "}]
[null,"DLT Asset Name:",null,{"$f":"IF(I_DETAILS!E44=0,\"\",I_DETAILS!E44)","v":""},null,null,null,"IF"]
[null,"User: ",null,{"$f":"I_DETAILS!E13&\" \"&I_DETAILS!E15","v":" "},null,null,null,">0","Yes","Sum"]
[]
[]
{"$rows_left_out":50}
{"sheet":"T5_TSMI","index":5,"n_rows":45,"n_cols":16,"rows_kept":45,"cut":false,"hidden":false,"merged":[[32,2,32,3],[22,2,22,3],[16,2,16,3],[17,2,17,3],[29,1,29,4],[31,2,31,3],[1,7,1,8],[4,5,8,5],[10,1,10,4],[14,1,14,4],[19,1,19,4],[2,1,2,4],[34,1,34,4],[36,2,36,3],[5,0,7,0],[5,1,5,2],[5,3,5,4],[6,1,6,2],[6,3,6,4],[7,1,7,2],[7,3,7,4],[23,2,23,3],[24,2,24,3],[26,2,26,3],[27,2,27,3],[12,2,12,3],[21,2,21,3],[25,2,25,3]]}
[]
[null,"Financial Instrument Test",null,null,null,null,null,"Working",null,"Blank","Completed ","Criteria (TS)","Criteria (MI)","Criteria (EM)","Sheet ON","Validate "]
[null,"T5 - Transferable Securities & Money Market Instruments",null,null,null,null,null,null,null,{"$f":"IF(SUM(H13:H28)=0,1,0)","v":1},{"$f":"IF(SUM(H13,H17:H18,H22:H28,H32:H33,H37)=13,1,0)","v":0},{"$f":"IF(AND(K3=1,L11=1,L15=1,L20=1,L35=0),1,0)","v":0},{"$f":"IF(AND(K3=1,M11=1,M15=1,M30=1,M35=0),1,0)","v":0},{"$f":"IF(AND(K3=1,N11=1,N15=1,N20=0,N30=0,N35=1),1,0)","v":0},{"$f":"W1_DET.!H13","v":0},{"$f":"W1_DET.!H14","v":0}]
[]
[]
[null,"Financial Instrument Test Ref.:",null,{"$f":"I_DETAILS!E6","v":" "},null,null,null,null,null,null,"ON Criteria:",{"$f":"IF(H13=0,\"\",IF(AND(H13=1,I13=1),1,0))","v":""},{"$f":"IF(H13=0,\"\",IF(AND(H13=1,J13=1),1,0))","v":""}]
[null,"DLT Asset Name:",null,{"$f":"IF(I_DETAILS!E44=0,\"\",I_DETAILS!E44)","v":""},null,null,null,"IF"]
[null,"User: ",null,{"$f":"I_DETAILS!E13&\" \"&I_DETAILS!E15","v":" "},null,null,null,">0","Yes","No"]
[]
[]
{"$rows_left_out":36}
{"sheet":"T6_EM","index":6,"n_rows":29,"n_cols":14,"rows_kept":29,"cut":false,"hidden":false,"merged":[[1,7,1,8],[4,5,8,5],[12,2,12,3],[2,1,2,4],[10,1,10,4],[14,1,14,4],[16,2,16,3],[18,1,18,4],[20,2,20,3],[5,0,7,0],[5,1,5,2],[5,3,5,4],[6,1,6,2],[6,3,6,4],[7,1,7,2],[7,3,7,4]]}
[]
[null,"Financial Instrument Test",null,null,null,null,null,"Working",null,"Blank","Completed ","Criteria (EM)","Sheet ON","Validate "]
[null,"T6 - Electronic Money",null,null,null,null,null,null,null,{"$f":"IF(SUM(H13)=0,1,0)","v":1},{"$f":"IF(SUM(H13:H21,T5_TSMI!K3)=4,1,0)","v":0},{"$f":"(IF(AND(L11=1,L15=1,L19=1,K3=1,T5_TSMI!N3=1),1,0))","v":0},{"$f":"W1_DET.!I13","v":0},{"$f":"W1_DET.!I14","v":0}]
[]
[]
[null,"Financial Instrument Test Ref.:",null,{"$f":"I_DETAILS!E6","v":" "},null,null,null,"Working"]
[null,"DLT Asset Name:",null,{"$f":"IF(I_DETAILS!E44=0,\"\",I_DETAILS!E44)","v":""},null,null,null,"IF"]
[null,"User: ",null,{"$f":"I_DETAILS!E13&\" \"&I_DETAILS!E15","v":" "},null,null,null,">0","Yes"]
[]
[]
{"$rows_left_out":20}
{"sheet":"T7_CS","index":7,"n_rows":28,"n_cols":14,"rows_kept":28,"cut":false,"hidden":false,"merged":[[1,7,1,8],[4,5,8,5],[10,1,10,4],[15,1,15,4],[19,2,19,3],[18,2,18,3],[12,2,12,3],[13,2,13,3],[17,2,17,3],[2,1,2,4],[5,0,7,0],[5,1,5,2],[5,3,5,4],[6,1,6,2],[6,3,6,4],[7,1,7,2],[7,3,7,4]]}
[]
[null,"Financial Instrument Test",null,null,null,null,null,"Working",null,"Blank","Completed ","Criteria (CS)","Sheet ON","Validate "]
[null,"T7 - Units in a Collective Investment Scheme",null,null,null,null,null,null,null,{"$f":"IF(SUM(H13:H20)=0,1,0)","v":1},{"$f":"IF(SUM(H13:H20)=5,1,0)","v":0},{"$f":"IF(AND(L11=1,L16=1,K3=1),1,0)","v":0},{"$f":"W1_DET.!J13","v":0},{"$f":"W1_DET.!J14","v":0}]
[]
[]
[null,"Financial Instrument Test Ref.:",null,{"$f":"I_DETAILS!E6","v":" "}]
[null,"DLT Asset Name:",null,{"$f":"IF(I_DETAILS!E44=0,\"\",I_DETAILS!E44)","v":""},null,null,null,"IF"]
[null,"User: ",null,{"$f":"I_DETAILS!E13&\" \"&I_DETAILS!E15","v":" "},null,null,null,">0","Yes"]
[]
[]
{"$rows_left_out":19}
{"sheet":"T8_EA","index":8,"n_rows":21,"n_cols":14,"rows_kept":21,"cut":false,"hidden":false,"merged":[[1,7,1,8],[4,5,8,5],[12,2,12,3],[2,1,2,4],[5,0,7,0],[5,1,5,2],[5,3,5,4],[6,1,6,2],[6,3,6,4],[7,1,7,2],[7,3,7,4],[10,1,10,4]]}
[]
[null,"Financial Instrument Test",null,null,null,null,null,"Working",null,"Blank","Completed ","Criteria (EA)","Sheet ON","Validate "]
[null,"T8 - Emission Allowance",null,null,null,null,null,null,null,{"$f":"IF(SUM(H13)=0,1,0)","v":1},{"$f":"IF(SUM(H13)=1,1,0)","v":0},{"$f":"L11","v":0},{"$f":"W1_DET.!K13","v":0},{"$f":"W1_DET.!K14","v":0}]
[]
[]
[null,"Financial Instrument Test Ref.:",null,{"$f":"I_DETAILS!E6","v":" "},null,null,null,"Working"]
[null,"DLT Asset Name:",null,{"$f":"IF(I_DETAILS!E44=0,\"\",I_DETAILS!E44)","v":""},null,null,null,"IF"]
[null,"User: ",null,{"$f":"I_DETAILS!E13&\" \"&I_DETAILS!E15","v":" "},null,null,null,">0","Yes"]
[]
[]
{"$rows_left_out":12}
{"sheet":"O1_ODFI","index":9,"n_rows":37,"n_cols":16,"rows_kept":37,"cut":false,"hidden":false,"merged":[[5,0,7,0],[5,1,5,2],[5,3,5,4],[6,1,6,2],[6,3,6,4],[7,1,7,2],[7,3,7,4],[1,7,1,8],[24,1,24,4],[26,2,26,3],[28,2,28,3],[27,2,27,3],[18,2,18,3],[20,1,20,4],[22,2,22,3],[10,1,10,4],[12,2,12,3],[13,2,13,3],[15,1,15,4],[17,2,17,3],[4,5,8,5],[2,1,2,4]]}
[]
[null,"Financial Instrument Test",null,null,null,null,null,"Working",null,"Blank","Completed ","CRITERIA (FD2/FD5)","Criteria (SC)","Criteria (CP)","Sheet ON","Validate "]
[null,"O1 - Other Derivative Financial Instruments ",null,null,null,null,null,null,null,{"$f":"IF(SUM(H13:H29)=0,1,0)","v":1},{"$f":"IF(SUM(H13:H14,H18:H19,H23,H27:H29)=8,1,0)","v":0},{"$f":"IF(AND(L11=1,L16=1,L21=1,L25=1,K3=1),1,0)","v":0},{"$f":"M11","v":0},{"$f":"N16","v":0},{"$f":"W1_DET.!F13","v":0},{"$f":"W1_DET.!F14","v":0}]
[]
[]
[null,"Financial Instrument Test Ref.:",null,{"$f":"I_DETAILS!E6","v":" "}]
[null,"DLT Asset Name:",null,{"$f":"IF(I_DETAILS!E44=0,\"\",I_DETAILS!E44)","v":""},null,null,null,"IF"]
[null,"User: ",null,{"$f":"I_DETAILS!E13&\" \"&I_DETAILS!E15","v":" "},null,null,null,">0","Yes"]
[]
[]
{"$rows_left_out":28}
{"sheet":"O2_ODCC","index":10,"n_rows":30,"n_cols":16,"rows_kept":30,"cut":false,"hidden":false,"merged":[[5,0,7,0],[5,1,5,2],[5,3,5,4],[6,1,6,2],[6,3,6,4],[7,1,7,2],[7,3,7,4],[1,7,1,8],[18,2,18,3],[19,2,19,3],[20,2,20,3],[21,2,21,3],[10,1,10,4],[12,2,12,3],[13,2,13,3],[14,2,14,3],[16,1,16,4],[4,5,8,5],[2,1,2,4]]}
[]
[null,"Financial Instrument Test",null,null,null,null,null,"Working",null,"Blank","Completed ","CRITERIA (CIV)","Criteria (SC)","Criteria (MP)","Sheet ON","Validate "]
[null,"O2 - OTHER DERIVATIVE CONTRACTS RELATING TO CURRENCIES ",null,null,null,null,null,null,null,{"$f":"IF(SUM(H13:H22)=0,1,0)","v":1},{"$f":"IF(SUM(H13:H15,H19:H22)=7,1,0)","v":0},{"$f":"IF(AND(K3=1,M3=0,N3=0),1,0)","v":0},{"$f":"L11","v":0},{"$f":"M17","v":0},{"$f":"W1_DET.!G13","v":0},{"$f":"W1_DET.!G14","v":0}]
[]
[]
[null,"Financial Instrument Test Ref.:",null,{"$f":"I_DETAILS!E6","v":" "}]
[null,"DLT Asset Name:",null,{"$f":"IF(I_DETAILS!E44=0,\"\",I_DETAILS!E44)","v":""},null,null,null,"IF"]
[null,"User: ",null,{"$f":"I_DETAILS!E13&\" \"&I_DETAILS!E15","v":" "},null,null,null,">0","Yes"]
[]
[]
{"$rows_left_out":21}
{"sheet":"II_DECLARATIONS","index":11,"n_rows":36,"n_cols":7,"rows_kept":36,"cut":false,"hidden":false,"merged":[[23,1,23,6],[27,6,27,7],[17,6,17,7],[21,6,21,7],[2,1,2,6],[12,1,12,6],[15,4,15,6],[19,6,19,7],[14,3,14,6],[4,8,6,8],[5,1,5,4],[5,5,5,6],[8,1,8,6],[10,6,10,7],[10,3,10,5],[29,6,29,7],[31,6,31,7],[33,1,33,6],[25,3,25,6],[38,3,39,5],[35,1,35,7]]}
[]
[null,"MALTA FINANCIAL SERVICES AUTHORITY"]
[null,"Financial Instrument Test"]
[]
[]
[null,"DECLARATIONS SHEET",null,null,null,{"$f":"I_DETAILS!E6","v":" "}]
[]
[]
[null,"DETERMINATION"]
[]
{"$rows_left_out":27}
{"sheet":"W1_DET.","index":12,"n_rows":32,"n_cols":15,"rows_kept":32,"cut":false,"hidden":true,"merged":[[2,11,3,11],[2,12,3,12],[2,0,3,0]]}
["WORKINGS"]
[]
[null,"T1","T2","T3","T4","O1","O2","T5","T6","T7","T8","Sum","Workings","T14","Representations"]
[null,"VT","C(8)","C(9)","C(4)(5-7)(10)","ODFI","ODCC","TSMI","EM","CS","EA",null,null,"VFA","DETERMINATION"]
["In-Sheet Formula"]
["Blank",{"$f":"T1_VT!J3","v":1},{"$f":"'T2_C(8)'!J3","v":1},{"$f":"'T3_C(9)'!J3","v":1},{"$f":"'T4_C(4)(5-7)(10)'!J3","v":1},{"$f":"O1_ODFI!J3","v":1},{"$f":"O2_ODCC!J3","v":1},{"$f":"T5_TSMI!J3","v":1},{"$f":"T6_EM!J3","v":1},{"$f":"T7_CS!J3","v":1},{"$f":"T8_EA!J3","v":1}]
["Complete",{"$f":"T1_VT!K3","v":0},{"$f":"'T2_C(8)'!K3","v":0},{"$f":"'T3_C(9)'!K3","v":0},{"$f":"'T4_C(4)(5-7)(10)'!K3","v":0},{"$f":"IF(AND(E7=1,E11=0),1,O1_ODFI!K3)","v":0},{"$f":"IF(AND(E7=1,E12=0),1,O2_ODCC!K3)","v":0},{"$f":"T5_TSMI!K3","v":0},{"$f":"T6_EM!K3","v":0},{"$f":"T7_CS!K3","v":0},{"$f":"T8_EA!K3","v":0},{"$f":"IF(AND(B7=1,H7=1,J7=1,E7=1,C7=1,D7=1,K7=1,G7=1,F7=1,I7=1),1,0)","v":0}]
["C1 Determination ",{"$f":"T1_VT!L3","v":0},{"$f":"'T2_C(8)'!L3","v":0},{"$f":"'T3_C(9)'!L3","v":0},{"$f":"'T4_C(4)(5-7)(10)'!L3","v":0},{"$f":"O1_ODFI!L3","v":0},{"$f":"O2_ODCC!L3","v":0},{"$f":"T5_TSMI!L3","v":0},{"$f":"T6_EM!L3","v":0},{"$f":"T7_CS!L3","v":0},{"$f":"T8_EA!L3","v":0},{"$f":"IF(AND(B8=1,H8=1,J8=1,E8=1,C8=1,D8=1,K8=1,G8=1,F8=1,I8=1),1,0)","v":0},null,{"$f":"IF(OR(AND(I7=1,I8=0,H10=1),AND(K7=1,K8=0)),1,0)","v":0}]
["C2 Determination",null,null,null,{"$f":"'T4_C(4)(5-7)(10)'!M3","v":0},null,{"$f":"O2_ODCC!M3","v":0},{"$f":"T5_TSMI!M3","v":0}]
["C3 Determination ",null,null,null,{"$f":"'T4_C(4)(5-7)(10)'!N3","v":0},null,{"$f":"O2_ODCC!N3","v":0},{"$f":"T5_TSMI!N3","v":0}]
{"$rows_left_out":23}
{"sheet":"LISTS","index":13,"n_rows":209,"n_cols":11,"rows_kept":209,"cut":false,"hidden":true,"merged":[]}
["Lists"]
[]
["L_1","L_2","L_3","L_4","L_5","L_6","L_7","L_7","L_8","L_9","L_10"]
["Prefix","Country","Auth. Type","Y/N","Yes","Empty","No","Administrator","CMP","VFA Agent","MORE THAN 397 DAYS"]
["Mr ","Malta","Issuer","Yes","Yes",null,"No","Compliance Officer","Complete T10-4 to T10-7","Compliance Officer","397 DAYS OR LESS"]
["Ms","Afghanistan","Investment Services Licence Holder","No",null,null,null,"Senior Manager"]
["Mrs","Albania","VFA Licence Holder"]
["Prof.","Algeria","Unlicensed Entity/Individual"]
["Dr","Andorra"]
[null,"Angola"]
{"$rows_left_out":199}